1 | version:1 |
---|
2 | :debug:main epoch: in tree: 1 installed: 1 |
---|
3 | :debug:main autoconf 2.68_2 exists in the ports tree |
---|
4 | :debug:main autoconf 2.68_2 is the latest installed |
---|
5 | :debug:main autoconf 2.68_2 is active |
---|
6 | :debug:main Merging existing variants '' into variants |
---|
7 | :debug:main new fully merged portvariants: |
---|
8 | :debug:main Changing to port directory: /opt/local/var/macports/sources/rsync.macports.org/release/ports/devel/autoconf |
---|
9 | :debug:main OS darwin/10.8.0 (Mac OS X 10.6) arch i386 |
---|
10 | :debug:main org.macports.load registered provides 'load', a pre-existing procedure. Target override will not be provided |
---|
11 | :debug:main org.macports.unload registered provides 'unload', a pre-existing procedure. Target override will not be provided |
---|
12 | :debug:main org.macports.distfiles registered provides 'distfiles', a pre-existing procedure. Target override will not be provided |
---|
13 | :debug:main only one arch supported, so not adding the default universal variant |
---|
14 | :debug:main No need to upgrade! autoconf 2.68_2 >= autoconf 2.68_2 |
---|
15 | :debug:main epoch: in tree: 0 installed: 0 |
---|
16 | :debug:main perl5 5.12.3_1 exists in the ports tree |
---|
17 | :debug:main perl5 5.12.3_1 +perl5_12 is the latest installed |
---|
18 | :debug:main perl5 5.12.3_1 +perl5_12 is active |
---|
19 | :debug:main Merging existing variants '+perl5_12' into variants |
---|
20 | :debug:main new fully merged portvariants: perl5_12 + |
---|
21 | :debug:main Changing to port directory: /opt/local/var/macports/sources/rsync.macports.org/release/ports/lang/perl5 |
---|
22 | :debug:main OS darwin/10.8.0 (Mac OS X 10.6) arch i386 |
---|
23 | :debug:main org.macports.load registered provides 'load', a pre-existing procedure. Target override will not be provided |
---|
24 | :debug:main org.macports.unload registered provides 'unload', a pre-existing procedure. Target override will not be provided |
---|
25 | :debug:main org.macports.distfiles registered provides 'distfiles', a pre-existing procedure. Target override will not be provided |
---|
26 | :debug:main universal_variant is false, so not adding the default universal variant |
---|
27 | :debug:main Executing variant perl5_12 provides perl5_12 |
---|
28 | :debug:main No need to upgrade! perl5 5.12.3_1 >= perl5 5.12.3_1 |
---|
29 | :debug:main epoch: in tree: 0 installed: 0 |
---|
30 | :debug:main perl5.12 5.12.3_2 exists in the ports tree |
---|
31 | :debug:main perl5.12 5.12.3_2 is the latest installed |
---|
32 | :debug:main perl5.12 5.12.3_2 is active |
---|
33 | :debug:main Merging existing variants '' into variants |
---|
34 | :debug:main new fully merged portvariants: |
---|
35 | :debug:main Changing to port directory: /opt/local/var/macports/sources/rsync.macports.org/release/ports/lang/perl5.12 |
---|
36 | :debug:main OS darwin/10.8.0 (Mac OS X 10.6) arch i386 |
---|
37 | :debug:main org.macports.load registered provides 'load', a pre-existing procedure. Target override will not be provided |
---|
38 | :debug:main org.macports.unload registered provides 'unload', a pre-existing procedure. Target override will not be provided |
---|
39 | :debug:main org.macports.distfiles registered provides 'distfiles', a pre-existing procedure. Target override will not be provided |
---|
40 | :debug:main adding the default universal variant |
---|
41 | :debug:main Reading variant descriptions from /opt/local/var/macports/sources/rsync.macports.org/release/ports/_resources/port1.0/variant_descriptions.conf |
---|
42 | :debug:main No need to upgrade! perl5.12 5.12.3_2 >= perl5.12 5.12.3_2 |
---|
43 | :debug:main epoch: in tree: 0 installed: 0 |
---|
44 | :debug:main gdbm 1.10_0 exists in the ports tree |
---|
45 | :debug:main gdbm 1.10_0 is the latest installed |
---|
46 | :debug:main gdbm 1.10_0 is active |
---|
47 | :debug:main Merging existing variants '' into variants |
---|
48 | :debug:main new fully merged portvariants: |
---|
49 | :debug:main Changing to port directory: /opt/local/var/macports/sources/rsync.macports.org/release/ports/databases/gdbm |
---|
50 | :debug:main OS darwin/10.8.0 (Mac OS X 10.6) arch i386 |
---|
51 | :debug:main org.macports.load registered provides 'load', a pre-existing procedure. Target override will not be provided |
---|
52 | :debug:main org.macports.unload registered provides 'unload', a pre-existing procedure. Target override will not be provided |
---|
53 | :debug:main org.macports.distfiles registered provides 'distfiles', a pre-existing procedure. Target override will not be provided |
---|
54 | :debug:main Using group file /opt/local/var/macports/sources/rsync.macports.org/release/ports/_resources/port1.0/group/muniversal-1.0.tcl |
---|
55 | :debug:main Reading variant descriptions from /opt/local/var/macports/sources/rsync.macports.org/release/ports/_resources/port1.0/variant_descriptions.conf |
---|
56 | :debug:main universal variant already exists, so not adding the default one |
---|
57 | :debug:main No need to upgrade! gdbm 1.10_0 >= gdbm 1.10_0 |
---|
58 | :debug:main epoch: in tree: 0 installed: 0 |
---|
59 | :debug:main m4 1.4.16_0 exists in the ports tree |
---|
60 | :debug:main m4 1.4.16_0 is the latest installed |
---|
61 | :debug:main m4 1.4.16_0 is active |
---|
62 | :debug:main Merging existing variants '' into variants |
---|
63 | :debug:main new fully merged portvariants: |
---|
64 | :debug:main Changing to port directory: /opt/local/var/macports/sources/rsync.macports.org/release/ports/devel/m4 |
---|
65 | :debug:main OS darwin/10.8.0 (Mac OS X 10.6) arch i386 |
---|
66 | :debug:main org.macports.load registered provides 'load', a pre-existing procedure. Target override will not be provided |
---|
67 | :debug:main org.macports.unload registered provides 'unload', a pre-existing procedure. Target override will not be provided |
---|
68 | :debug:main org.macports.distfiles registered provides 'distfiles', a pre-existing procedure. Target override will not be provided |
---|
69 | :debug:main adding the default universal variant |
---|
70 | :debug:main Reading variant descriptions from /opt/local/var/macports/sources/rsync.macports.org/release/ports/_resources/port1.0/variant_descriptions.conf |
---|
71 | :debug:main No need to upgrade! m4 1.4.16_0 >= m4 1.4.16_0 |
---|
72 | :debug:main epoch: in tree: 0 installed: 0 |
---|
73 | :debug:main help2man 1.40.4_1 exists in the ports tree |
---|
74 | :debug:main help2man 1.40.4_1 is the latest installed |
---|
75 | :debug:main help2man 1.40.4_1 is active |
---|
76 | :debug:main Merging existing variants '' into variants |
---|
77 | :debug:main new fully merged portvariants: |
---|
78 | :debug:main Changing to port directory: /opt/local/var/macports/sources/rsync.macports.org/release/ports/textproc/help2man |
---|
79 | :debug:main OS darwin/10.8.0 (Mac OS X 10.6) arch i386 |
---|
80 | :debug:main org.macports.load registered provides 'load', a pre-existing procedure. Target override will not be provided |
---|
81 | :debug:main org.macports.unload registered provides 'unload', a pre-existing procedure. Target override will not be provided |
---|
82 | :debug:main org.macports.distfiles registered provides 'distfiles', a pre-existing procedure. Target override will not be provided |
---|
83 | :debug:main Reading variant descriptions from /opt/local/var/macports/sources/rsync.macports.org/release/ports/_resources/port1.0/variant_descriptions.conf |
---|
84 | :debug:main universal variant already exists, so not adding the default one |
---|
85 | :debug:main No need to upgrade! help2man 1.40.4_1 >= help2man 1.40.4_1 |
---|
86 | :debug:main epoch: in tree: 0 installed: 0 |
---|
87 | :debug:main p5.12-locale-gettext 1.50.0_6 exists in the ports tree |
---|
88 | :debug:main p5.12-locale-gettext 1.50.0_6 is the latest installed |
---|
89 | :debug:main p5.12-locale-gettext 1.50.0_6 is active |
---|
90 | :debug:main Merging existing variants '' into variants |
---|
91 | :debug:main new fully merged portvariants: |
---|
92 | :debug:main Changing to port directory: /opt/local/var/macports/sources/rsync.macports.org/release/ports/perl/p5-locale-gettext |
---|
93 | :debug:main OS darwin/10.8.0 (Mac OS X 10.6) arch i386 |
---|
94 | :debug:main org.macports.load registered provides 'load', a pre-existing procedure. Target override will not be provided |
---|
95 | :debug:main org.macports.unload registered provides 'unload', a pre-existing procedure. Target override will not be provided |
---|
96 | :debug:main org.macports.distfiles registered provides 'distfiles', a pre-existing procedure. Target override will not be provided |
---|
97 | :debug:main Using group file /opt/local/var/macports/sources/rsync.macports.org/release/ports/_resources/port1.0/group/perl5-1.0.tcl |
---|
98 | :debug:main Re-registering default for livecheck.version |
---|
99 | :debug:main Re-registering default for configure.universal_args |
---|
100 | :debug:main adding the default universal variant |
---|
101 | :debug:main Reading variant descriptions from /opt/local/var/macports/sources/rsync.macports.org/release/ports/_resources/port1.0/variant_descriptions.conf |
---|
102 | :debug:main No need to upgrade! p5.12-locale-gettext 1.50.0_6 >= p5.12-locale-gettext 1.50.0_6 |
---|
103 | :debug:main epoch: in tree: 0 installed: 0 |
---|
104 | :debug:main gettext 0.18.1.1_2 exists in the ports tree |
---|
105 | :debug:main gettext 0.18.1.1_2 is the latest installed |
---|
106 | :debug:main gettext 0.18.1.1_2 is active |
---|
107 | :debug:main Merging existing variants '' into variants |
---|
108 | :debug:main new fully merged portvariants: |
---|
109 | :debug:main Changing to port directory: /opt/local/var/macports/sources/rsync.macports.org/release/ports/devel/gettext |
---|
110 | :debug:main OS darwin/10.8.0 (Mac OS X 10.6) arch i386 |
---|
111 | :debug:main org.macports.load registered provides 'load', a pre-existing procedure. Target override will not be provided |
---|
112 | :debug:main org.macports.unload registered provides 'unload', a pre-existing procedure. Target override will not be provided |
---|
113 | :debug:main org.macports.distfiles registered provides 'distfiles', a pre-existing procedure. Target override will not be provided |
---|
114 | :debug:main Using group file /opt/local/var/macports/sources/rsync.macports.org/release/ports/_resources/port1.0/group/muniversal-1.0.tcl |
---|
115 | :debug:main Reading variant descriptions from /opt/local/var/macports/sources/rsync.macports.org/release/ports/_resources/port1.0/variant_descriptions.conf |
---|
116 | :debug:main Using group file /opt/local/var/macports/sources/rsync.macports.org/release/ports/_resources/port1.0/group/archcheck-1.0.tcl |
---|
117 | :debug:main universal variant already exists, so not adding the default one |
---|
118 | :debug:main No need to upgrade! gettext 0.18.1.1_2 >= gettext 0.18.1.1_2 |
---|
119 | :debug:main epoch: in tree: 0 installed: 0 |
---|
120 | :debug:main libiconv 1.14_0 exists in the ports tree |
---|
121 | :debug:main libiconv 1.14_0 is the latest installed |
---|
122 | :debug:main libiconv 1.14_0 is active |
---|
123 | :debug:main Merging existing variants '' into variants |
---|
124 | :debug:main new fully merged portvariants: |
---|
125 | :debug:main Changing to port directory: /opt/local/var/macports/sources/rsync.macports.org/release/ports/textproc/libiconv |
---|
126 | :debug:main OS darwin/10.8.0 (Mac OS X 10.6) arch i386 |
---|
127 | :debug:main org.macports.load registered provides 'load', a pre-existing procedure. Target override will not be provided |
---|
128 | :debug:main org.macports.unload registered provides 'unload', a pre-existing procedure. Target override will not be provided |
---|
129 | :debug:main org.macports.distfiles registered provides 'distfiles', a pre-existing procedure. Target override will not be provided |
---|
130 | :debug:main Using group file /opt/local/var/macports/sources/rsync.macports.org/release/ports/_resources/port1.0/group/muniversal-1.0.tcl |
---|
131 | :debug:main Reading variant descriptions from /opt/local/var/macports/sources/rsync.macports.org/release/ports/_resources/port1.0/variant_descriptions.conf |
---|
132 | :debug:main universal variant already exists, so not adding the default one |
---|
133 | :debug:main No need to upgrade! libiconv 1.14_0 >= libiconv 1.14_0 |
---|
134 | :debug:main epoch: in tree: 0 installed: 0 |
---|
135 | :debug:main ncurses 5.9_1 exists in the ports tree |
---|
136 | :debug:main ncurses 5.9_1 is the latest installed |
---|
137 | :debug:main ncurses 5.9_1 is active |
---|
138 | :debug:main Merging existing variants '' into variants |
---|
139 | :debug:main new fully merged portvariants: |
---|
140 | :debug:main Changing to port directory: /opt/local/var/macports/sources/rsync.macports.org/release/ports/devel/ncurses |
---|
141 | :debug:main OS darwin/10.8.0 (Mac OS X 10.6) arch i386 |
---|
142 | :debug:main org.macports.load registered provides 'load', a pre-existing procedure. Target override will not be provided |
---|
143 | :debug:main org.macports.unload registered provides 'unload', a pre-existing procedure. Target override will not be provided |
---|
144 | :debug:main org.macports.distfiles registered provides 'distfiles', a pre-existing procedure. Target override will not be provided |
---|
145 | :debug:main adding the default universal variant |
---|
146 | :debug:main Reading variant descriptions from /opt/local/var/macports/sources/rsync.macports.org/release/ports/_resources/port1.0/variant_descriptions.conf |
---|
147 | :debug:main No need to upgrade! ncurses 5.9_1 >= ncurses 5.9_1 |
---|
148 | :debug:main epoch: in tree: 0 installed: 0 |
---|
149 | :debug:main expat 2.0.1_1 exists in the ports tree |
---|
150 | :debug:main expat 2.0.1_1 is the latest installed |
---|
151 | :debug:main expat 2.0.1_1 is active |
---|
152 | :debug:main Merging existing variants '' into variants |
---|
153 | :debug:main new fully merged portvariants: |
---|
154 | :debug:main Changing to port directory: /opt/local/var/macports/sources/rsync.macports.org/release/ports/textproc/expat |
---|
155 | :debug:main OS darwin/10.8.0 (Mac OS X 10.6) arch i386 |
---|
156 | :debug:main org.macports.load registered provides 'load', a pre-existing procedure. Target override will not be provided |
---|
157 | :debug:main org.macports.unload registered provides 'unload', a pre-existing procedure. Target override will not be provided |
---|
158 | :debug:main org.macports.distfiles registered provides 'distfiles', a pre-existing procedure. Target override will not be provided |
---|
159 | :debug:main adding the default universal variant |
---|
160 | :debug:main Reading variant descriptions from /opt/local/var/macports/sources/rsync.macports.org/release/ports/_resources/port1.0/variant_descriptions.conf |
---|
161 | :debug:main No need to upgrade! expat 2.0.1_1 >= expat 2.0.1_1 |
---|
162 | :debug:main epoch: in tree: 0 installed: 0 |
---|
163 | :debug:main automake 1.11.1_0 exists in the ports tree |
---|
164 | :debug:main automake 1.11.1_0 is the latest installed |
---|
165 | :debug:main automake 1.11.1_0 is active |
---|
166 | :debug:main Merging existing variants '' into variants |
---|
167 | :debug:main new fully merged portvariants: |
---|
168 | :debug:main Changing to port directory: /opt/local/var/macports/sources/rsync.macports.org/release/ports/devel/automake |
---|
169 | :debug:main OS darwin/10.8.0 (Mac OS X 10.6) arch i386 |
---|
170 | :debug:main org.macports.load registered provides 'load', a pre-existing procedure. Target override will not be provided |
---|
171 | :debug:main org.macports.unload registered provides 'unload', a pre-existing procedure. Target override will not be provided |
---|
172 | :debug:main org.macports.distfiles registered provides 'distfiles', a pre-existing procedure. Target override will not be provided |
---|
173 | :debug:main only one arch supported, so not adding the default universal variant |
---|
174 | :debug:main No need to upgrade! automake 1.11.1_0 >= automake 1.11.1_0 |
---|
175 | :debug:main epoch: in tree: 0 installed: 0 |
---|
176 | :debug:main libtool 2.4.2_0 exists in the ports tree |
---|
177 | :debug:main libtool 2.4.2_0 is the latest installed |
---|
178 | :debug:main libtool 2.4.2_0 is active |
---|
179 | :debug:main Merging existing variants '' into variants |
---|
180 | :debug:main new fully merged portvariants: |
---|
181 | :debug:main Changing to port directory: /opt/local/var/macports/sources/rsync.macports.org/release/ports/devel/libtool |
---|
182 | :debug:main OS darwin/10.8.0 (Mac OS X 10.6) arch i386 |
---|
183 | :debug:main org.macports.load registered provides 'load', a pre-existing procedure. Target override will not be provided |
---|
184 | :debug:main org.macports.unload registered provides 'unload', a pre-existing procedure. Target override will not be provided |
---|
185 | :debug:main org.macports.distfiles registered provides 'distfiles', a pre-existing procedure. Target override will not be provided |
---|
186 | :debug:main adding the default universal variant |
---|
187 | :debug:main Reading variant descriptions from /opt/local/var/macports/sources/rsync.macports.org/release/ports/_resources/port1.0/variant_descriptions.conf |
---|
188 | :debug:main No need to upgrade! libtool 2.4.2_0 >= libtool 2.4.2_0 |
---|
189 | :debug:main epoch: in tree: 0 installed: 0 |
---|
190 | :debug:main rsync 3.0.8_1 exists in the ports tree |
---|
191 | :debug:main rsync 3.0.8_1 is the latest installed |
---|
192 | :debug:main rsync 3.0.8_1 is active |
---|
193 | :debug:main Merging existing variants '' into variants |
---|
194 | :debug:main new fully merged portvariants: |
---|
195 | :debug:main Changing to port directory: /opt/local/var/macports/sources/rsync.macports.org/release/ports/net/rsync |
---|
196 | :debug:main OS darwin/10.8.0 (Mac OS X 10.6) arch i386 |
---|
197 | :debug:main org.macports.load registered provides 'load', a pre-existing procedure. Target override will not be provided |
---|
198 | :debug:main org.macports.unload registered provides 'unload', a pre-existing procedure. Target override will not be provided |
---|
199 | :debug:main org.macports.distfiles registered provides 'distfiles', a pre-existing procedure. Target override will not be provided |
---|
200 | :debug:main adding the default universal variant |
---|
201 | :debug:main Reading variant descriptions from /opt/local/var/macports/sources/rsync.macports.org/release/ports/_resources/port1.0/variant_descriptions.conf |
---|
202 | :debug:main No need to upgrade! rsync 3.0.8_1 >= rsync 3.0.8_1 |
---|
203 | :debug:main epoch: in tree: 0 installed: 0 |
---|
204 | :debug:main popt 1.16_0 exists in the ports tree |
---|
205 | :debug:main popt 1.16_0 is the latest installed |
---|
206 | :debug:main popt 1.16_0 is active |
---|
207 | :debug:main Merging existing variants '' into variants |
---|
208 | :debug:main new fully merged portvariants: |
---|
209 | :debug:main Changing to port directory: /opt/local/var/macports/sources/rsync.macports.org/release/ports/devel/popt |
---|
210 | :debug:main OS darwin/10.8.0 (Mac OS X 10.6) arch i386 |
---|
211 | :debug:main org.macports.load registered provides 'load', a pre-existing procedure. Target override will not be provided |
---|
212 | :debug:main org.macports.unload registered provides 'unload', a pre-existing procedure. Target override will not be provided |
---|
213 | :debug:main org.macports.distfiles registered provides 'distfiles', a pre-existing procedure. Target override will not be provided |
---|
214 | :debug:main adding the default universal variant |
---|
215 | :debug:main Reading variant descriptions from /opt/local/var/macports/sources/rsync.macports.org/release/ports/_resources/port1.0/variant_descriptions.conf |
---|
216 | :debug:main No need to upgrade! popt 1.16_0 >= popt 1.16_0 |
---|
217 | :msg:main ---> Computing dependencies for rvm:info:main .:debug:main Searching for dependency: autoconf |
---|
218 | :debug:main Found Dependency: receipt exists for autoconf |
---|
219 | :debug:main Searching for dependency: automake |
---|
220 | :debug:main Found Dependency: receipt exists for automake |
---|
221 | :debug:main Searching for dependency: libtool |
---|
222 | :debug:main Found Dependency: receipt exists for libtool |
---|
223 | :debug:main Searching for dependency: rsync |
---|
224 | :debug:main Found Dependency: receipt exists for rsync |
---|
225 | :msg:main |
---|
226 | :debug:main Executing org.macports.main (rvm) |
---|
227 | :debug:main changing euid/egid - current euid: 0 - current egid: 0 |
---|
228 | :debug:main egid changed to: 501 |
---|
229 | :debug:main euid changed to: 502 |
---|
230 | :debug:archivefetch archivefetch phase started at Mon Nov 21 22:29:43 EST 2011 |
---|
231 | :msg:archivefetch ---> Fetching archive for rvm |
---|
232 | :debug:archivefetch Executing org.macports.archivefetch (rvm) |
---|
233 | :debug:archivefetch euid/egid changed to: 0/0 |
---|
234 | :debug:archivefetch chowned /opt/local/var/macports/software/rvm to macports |
---|
235 | :debug:archivefetch euid/egid changed to: 502/501 |
---|
236 | :debug:archivefetch euid/egid changed to: 0/0 |
---|
237 | :debug:archivefetch chowned /opt/local/var/macports/incoming to macports |
---|
238 | :debug:archivefetch euid/egid changed to: 502/501 |
---|
239 | :info:archivefetch ---> rvm-1.05_0.darwin_10.x86_64.tbz2 doesn't seem to exist in /opt/local/var/macports/software/rvm |
---|
240 | :msg:archivefetch ---> Attempting to fetch rvm-1.05_0.darwin_10.x86_64.tbz2 from http://packages.macports.org/rvm |
---|
241 | :debug:archivefetch Fetching archive failed:: The requested URL returned error: 404 |
---|
242 | :debug:archivefetch Privilege de-escalation not attempted as not running as root. |
---|
243 | :debug:fetch fetch phase started at Mon Nov 21 22:29:46 EST 2011 |
---|
244 | :notice:fetch ---> Fetching rvm |
---|
245 | :debug:fetch Can't run fetch on this port without elevated privileges. Escalating privileges back to root. |
---|
246 | :debug:fetch euid changed to: 0. egid changed to: 0. |
---|
247 | :debug:fetch changing euid/egid - current euid: 0 - current egid: 0 |
---|
248 | :debug:fetch egid changed to: 501 |
---|
249 | :debug:fetch euid changed to: 502 |
---|
250 | :debug:fetch Executing org.macports.fetch (rvm) |
---|
251 | :info:fetch ---> rvm_1.05.tar.gz doesn't seem to exist in /opt/local/var/macports/distfiles/rvm |
---|
252 | :debug:fetch Pinging downloads.sourceforge.net... |
---|
253 | :debug:fetch Pinging aarnet.dl.sourceforge.net... |
---|
254 | :debug:fetch Pinging biznetnetworks.dl.sourceforge.net... |
---|
255 | :debug:fetch Pinging cdnetworks-us-1.dl.sourceforge.net... |
---|
256 | :debug:fetch Pinging cdnetworks-us-2.dl.sourceforge.net... |
---|
257 | :debug:fetch Pinging cdnetworks-kr-1.dl.sourceforge.net... |
---|
258 | :debug:fetch Pinging cdnetworks-kr-2.dl.sourceforge.net... |
---|
259 | :debug:fetch Pinging citylan.dl.sourceforge.net... |
---|
260 | :debug:fetch Pinging dfn.dl.sourceforge.net... |
---|
261 | :debug:fetch Pinging fastbull.dl.sourceforge.net... |
---|
262 | :debug:fetch Pinging freefr.dl.sourceforge.net... |
---|
263 | :debug:fetch Pinging garr.dl.sourceforge.net... |
---|
264 | :debug:fetch Pinging heanet.dl.sourceforge.net... |
---|
265 | :debug:fetch Pinging hivelocity.dl.sourceforge.net... |
---|
266 | :debug:fetch Pinging ignum.dl.sourceforge.net... |
---|
267 | :debug:fetch Pinging internode.dl.sourceforge.net... |
---|
268 | :debug:fetch Pinging iweb.dl.sourceforge.net... |
---|
269 | :debug:fetch Pinging jaist.dl.sourceforge.net... |
---|
270 | :debug:fetch Pinging kent.dl.sourceforge.net... |
---|
271 | :debug:fetch Pinging mesh.dl.sourceforge.net... |
---|
272 | :debug:fetch Pinging nchc.dl.sourceforge.net... |
---|
273 | :debug:fetch Pinging ncu.dl.sourceforge.net... |
---|
274 | :debug:fetch Pinging netcologne.dl.sourceforge.net... |
---|
275 | :debug:fetch Pinging puzzle.dl.sourceforge.net... |
---|
276 | :debug:fetch Pinging softlayer.dl.sourceforge.net... |
---|
277 | :debug:fetch Pinging space.dl.sourceforge.net... |
---|
278 | :debug:fetch Pinging sunet.dl.sourceforge.net... |
---|
279 | :debug:fetch Pinging surfnet.dl.sourceforge.net... |
---|
280 | :debug:fetch Pinging switch.dl.sourceforge.net... |
---|
281 | :debug:fetch Pinging transact.dl.sourceforge.net... |
---|
282 | :debug:fetch Pinging ufpr.dl.sourceforge.net... |
---|
283 | :debug:fetch Pinging voxel.dl.sourceforge.net... |
---|
284 | :debug:fetch Pinging waix.dl.sourceforge.net... |
---|
285 | :debug:fetch Pinging distfiles.macports.org... |
---|
286 | :debug:fetch Pinging aarnet.au.distfiles.macports.org... |
---|
287 | :debug:fetch Pinging her.gr.distfiles.macports.org... |
---|
288 | :debug:fetch Pinging jog.id.distfiles.macports.org... |
---|
289 | :debug:fetch Pinging lil.fr.distfiles.macports.org... |
---|
290 | :debug:fetch Pinging sea.us.distfiles.macports.org... |
---|
291 | :debug:fetch Pinging ykf.ca.distfiles.macports.org... |
---|
292 | :debug:fetch downloads.sourceforge.net ping time is 38.483 |
---|
293 | :debug:fetch aarnet.dl.sourceforge.net ping time is 262.747 |
---|
294 | :debug:fetch biznetnetworks.dl.sourceforge.net ping time is 326.662 |
---|
295 | :debug:fetch cdnetworks-us-1.dl.sourceforge.net ping time is 97.032 |
---|
296 | :debug:fetch cdnetworks-us-2.dl.sourceforge.net ping time is 107.823 |
---|
297 | :debug:fetch cdnetworks-kr-1.dl.sourceforge.net ping time is 234.023 |
---|
298 | :debug:fetch cdnetworks-kr-2.dl.sourceforge.net ping time is 229.837 |
---|
299 | :debug:fetch citylan.dl.sourceforge.net ping time is 174.617 |
---|
300 | :debug:fetch dfn.dl.sourceforge.net ping time is 133.252 |
---|
301 | :debug:fetch fastbull.dl.sourceforge.net ping time is 159.995 |
---|
302 | :debug:fetch freefr.dl.sourceforge.net ping time is 118.857 |
---|
303 | :debug:fetch garr.dl.sourceforge.net ping time is 135.787 |
---|
304 | :debug:fetch heanet.dl.sourceforge.net ping time is 138.279 |
---|
305 | :debug:fetch hivelocity.dl.sourceforge.net ping time is 10000 |
---|
306 | :debug:fetch ignum.dl.sourceforge.net ping time is 135.930 |
---|
307 | :debug:fetch internode.dl.sourceforge.net ping time is 292.774 |
---|
308 | :debug:fetch iweb.dl.sourceforge.net ping time is 34.146 |
---|
309 | :debug:fetch jaist.dl.sourceforge.net ping time is 243.016 |
---|
310 | :debug:fetch kent.dl.sourceforge.net ping time is 107.948 |
---|
311 | :debug:fetch mesh.dl.sourceforge.net ping time is 118.269 |
---|
312 | :debug:fetch nchc.dl.sourceforge.net ping time is 321.031 |
---|
313 | :debug:fetch ncu.dl.sourceforge.net ping time is 10000 |
---|
314 | :debug:fetch netcologne.dl.sourceforge.net ping time is 10000 |
---|
315 | :debug:fetch puzzle.dl.sourceforge.net ping time is 152.861 |
---|
316 | :debug:fetch softlayer.dl.sourceforge.net ping time is 113.149 |
---|
317 | :debug:fetch space.dl.sourceforge.net ping time is 260.468 |
---|
318 | :debug:fetch sunet.dl.sourceforge.net ping time is 168.872 |
---|
319 | :debug:fetch surfnet.dl.sourceforge.net ping time is 164.632 |
---|
320 | :debug:fetch switch.dl.sourceforge.net ping time is 142.403 |
---|
321 | :debug:fetch transact.dl.sourceforge.net ping time is 252.523 |
---|
322 | :debug:fetch ufpr.dl.sourceforge.net ping time is 180.719 |
---|
323 | :debug:fetch voxel.dl.sourceforge.net ping time is 58.466 |
---|
324 | :debug:fetch waix.dl.sourceforge.net ping time is 309.652 |
---|
325 | :debug:fetch distfiles.macports.org ping time is 86.613 |
---|
326 | :debug:fetch aarnet.au.distfiles.macports.org ping time is 263.322 |
---|
327 | :debug:fetch her.gr.distfiles.macports.org ping time is 168.922 |
---|
328 | :debug:fetch jog.id.distfiles.macports.org ping time is 333.510 |
---|
329 | :debug:fetch lil.fr.distfiles.macports.org ping time is 109.573 |
---|
330 | :debug:fetch sea.us.distfiles.macports.org ping time is 10000 |
---|
331 | :debug:fetch ykf.ca.distfiles.macports.org ping time is 23.285 |
---|
332 | :notice:fetch ---> Attempting to fetch rvm_1.05.tar.gz from http://ykf.ca.distfiles.macports.org/MacPorts/mpdistfiles/rvm |
---|
333 | :debug:fetch Privilege de-escalation not attempted as not running as root. |
---|
334 | :debug:checksum checksum phase started at Mon Nov 21 22:29:50 EST 2011 |
---|
335 | :notice:checksum ---> Verifying checksum(s) for rvm |
---|
336 | :debug:checksum Executing org.macports.checksum (rvm) |
---|
337 | :info:checksum ---> Checksumming rvm_1.05.tar.gz |
---|
338 | :debug:checksum Correct (md5) checksum for rvm_1.05.tar.gz |
---|
339 | :debug:checksum Correct (sha1) checksum for rvm_1.05.tar.gz |
---|
340 | :debug:checksum Correct (rmd160) checksum for rvm_1.05.tar.gz |
---|
341 | :debug:checksum Privilege de-escalation not attempted as not running as root. |
---|
342 | :debug:extract extract phase started at Mon Nov 21 22:29:50 EST 2011 |
---|
343 | :notice:extract ---> Extracting rvm |
---|
344 | :debug:extract Executing org.macports.extract (rvm) |
---|
345 | :info:extract ---> Extracting rvm_1.05.tar.gz |
---|
346 | :debug:extract setting option extract.args to '/opt/local/var/macports/distfiles/rvm/rvm_1.05.tar.gz' |
---|
347 | :debug:extract Environment: CPATH='/opt/local/include' CC_PRINT_OPTIONS_FILE='/opt/local/var/macports/build/_opt_local_var_macports_sources_rsync.macports.org_release_ports_sysutils_rvm/rvm/work/.CC_PRINT_OPTIONS' LIBRARY_PATH='/opt/local/lib' CC_PRINT_OPTIONS='YES' MACOSX_DEPLOYMENT_TARGET='10.6' |
---|
348 | :debug:extract Assembled command: 'cd "/opt/local/var/macports/build/_opt_local_var_macports_sources_rsync.macports.org_release_ports_sysutils_rvm/rvm/work" && /usr/bin/gzip -dc '/opt/local/var/macports/distfiles/rvm/rvm_1.05.tar.gz' | /usr/bin/gnutar --no-same-owner -xf -' |
---|
349 | :debug:extract Executing command line: cd "/opt/local/var/macports/build/_opt_local_var_macports_sources_rsync.macports.org_release_ports_sysutils_rvm/rvm/work" && /usr/bin/gzip -dc '/opt/local/var/macports/distfiles/rvm/rvm_1.05.tar.gz' | /usr/bin/gnutar --no-same-owner -xf - |
---|
350 | :debug:extract euid/egid changed to: 0/0 |
---|
351 | :debug:extract chowned /opt/local/var/macports/build/_opt_local_var_macports_sources_rsync.macports.org_release_ports_sysutils_rvm/rvm/work to macports |
---|
352 | :debug:extract euid/egid changed to: 502/501 |
---|
353 | :debug:extract Executing proc-post-org.macports.extract-extract-0 |
---|
354 | :info:extract xinstall: chdir(/opt/local/var/macports/sources/rsync.macports.org/release/ports/sysutils/rvm/files) |
---|
355 | :info:extract xinstall: types.cc -> /opt/local/var/macports/build/_opt_local_var_macports_sources_rsync.macports.org_release_ports_sysutils_rvm/rvm/work/rvm-1.05/types.cc |
---|
356 | :info:extract xinstall: rmath.cc -> /opt/local/var/macports/build/_opt_local_var_macports_sources_rsync.macports.org_release_ports_sysutils_rvm/rvm/work/rvm-1.05/rmath.cc |
---|
357 | :debug:extract Privilege de-escalation not attempted as not running as root. |
---|
358 | :debug:patch patch phase started at Mon Nov 21 22:29:51 EST 2011 |
---|
359 | :debug:patch Executing org.macports.patch (rvm) |
---|
360 | :notice:patch ---> Applying patches to rvm |
---|
361 | :info:patch ---> Applying /opt/local/var/macports/sources/rsync.macports.org/release/ports/sysutils/rvm/files/patch-rvm.diff |
---|
362 | :debug:patch Environment: CPATH='/opt/local/include' CC_PRINT_OPTIONS_FILE='/opt/local/var/macports/build/_opt_local_var_macports_sources_rsync.macports.org_release_ports_sysutils_rvm/rvm/work/.CC_PRINT_OPTIONS' LIBRARY_PATH='/opt/local/lib' CC_PRINT_OPTIONS='YES' MACOSX_DEPLOYMENT_TARGET='10.6' |
---|
363 | :debug:patch Assembled command: 'cd "/opt/local/var/macports/build/_opt_local_var_macports_sources_rsync.macports.org_release_ports_sysutils_rvm/rvm/work/rvm-1.05" && /usr/bin/patch -p0' |
---|
364 | :debug:patch Executing command line: cd "/opt/local/var/macports/build/_opt_local_var_macports_sources_rsync.macports.org_release_ports_sysutils_rvm/rvm/work/rvm-1.05" && /usr/bin/patch -p0 < '/opt/local/var/macports/sources/rsync.macports.org/release/ports/sysutils/rvm/files/patch-rvm.diff' |
---|
365 | :info:patch patching file Makefile.am |
---|
366 | :info:patch patching file rmath.h |
---|
367 | :info:patch patching file test-error.cc |
---|
368 | :info:patch patching file types.h |
---|
369 | :debug:patch Privilege de-escalation not attempted as not running as root. |
---|
370 | :debug:configure configure phase started at Mon Nov 21 22:29:51 EST 2011 |
---|
371 | :notice:configure ---> Configuring rvm |
---|
372 | :debug:configure Using compiler 'Mac OS X clang' |
---|
373 | :debug:configure Executing org.macports.configure (rvm) |
---|
374 | :debug:configure Environment: CPATH='/opt/local/include' CC_PRINT_OPTIONS_FILE='/opt/local/var/macports/build/_opt_local_var_macports_sources_rsync.macports.org_release_ports_sysutils_rvm/rvm/work/.CC_PRINT_OPTIONS' LIBRARY_PATH='/opt/local/lib' CC_PRINT_OPTIONS='YES' MACOSX_DEPLOYMENT_TARGET='10.6' |
---|
375 | :debug:configure Assembled command: 'cd "/opt/local/var/macports/build/_opt_local_var_macports_sources_rsync.macports.org_release_ports_sysutils_rvm/rvm/work/rvm-1.05" && autoreconf --install' |
---|
376 | :debug:configure Executing command line: cd "/opt/local/var/macports/build/_opt_local_var_macports_sources_rsync.macports.org_release_ports_sysutils_rvm/rvm/work/rvm-1.05" && autoreconf --install |
---|
377 | :info:configure Makefile.am:1363: shell ls -1 $(PKG_DIR: non-POSIX variable name |
---|
378 | :info:configure Makefile.am:1363: (probably a GNU make extension) |
---|
379 | :info:configure Makefile.am:1: `CXXFLAGS' is a user variable, you should not override it; |
---|
380 | :info:configure Makefile.am:1: use `AM_CXXFLAGS' instead. |
---|
381 | :debug:configure Environment: CPATH='/opt/local/include' CFLAGS='-pipe -O2 -arch x86_64' CPPFLAGS='-I/opt/local/include' CXXFLAGS='-pipe -O2 -arch x86_64' LIBRARY_PATH='/opt/local/lib' MACOSX_DEPLOYMENT_TARGET='10.6' CXX='/Developer/usr/bin/clang++' CC_PRINT_OPTIONS_FILE='/opt/local/var/macports/build/_opt_local_var_macports_sources_rsync.macports.org_release_ports_sysutils_rvm/rvm/work/.CC_PRINT_OPTIONS' F90FLAGS='-pipe -O2 -m64' LDFLAGS='-L/opt/local/lib -arch x86_64' OBJC='/Developer/usr/bin/clang' FCFLAGS='-pipe -O2 -m64' INSTALL='/usr/bin/install -c' OBJCFLAGS='-pipe -O2 -arch x86_64' FFLAGS='-pipe -O2 -m64' CC_PRINT_OPTIONS='YES' CC='/Developer/usr/bin/clang' |
---|
382 | :debug:configure Assembled command: 'cd "/opt/local/var/macports/build/_opt_local_var_macports_sources_rsync.macports.org_release_ports_sysutils_rvm/rvm/work/rvm-1.05" && ./configure --prefix=/opt/local --with-rsync=/opt/local/bin/rsync --with-default-config-file=/opt/local/etc/rvm.conf --with-default-log-dir=/opt/local/var/log/rvm --mandir=/opt/local/share/man ac_cv_cxx_exception_on_failed_alloc=yes' |
---|
383 | :debug:configure Executing command line: cd "/opt/local/var/macports/build/_opt_local_var_macports_sources_rsync.macports.org_release_ports_sysutils_rvm/rvm/work/rvm-1.05" && ./configure --prefix=/opt/local --with-rsync=/opt/local/bin/rsync --with-default-config-file=/opt/local/etc/rvm.conf --with-default-log-dir=/opt/local/var/log/rvm --mandir=/opt/local/share/man ac_cv_cxx_exception_on_failed_alloc=yes |
---|
384 | :info:configure checking build system type... i386-apple-darwin10.8.0 |
---|
385 | :info:configure checking host system type... i386-apple-darwin10.8.0 |
---|
386 | :info:configure checking target system type... i386-apple-darwin10.8.0 |
---|
387 | :info:configure checking for a BSD-compatible install... /usr/bin/install -c |
---|
388 | :info:configure checking whether build environment is sane... yes |
---|
389 | :info:configure checking for a thread-safe mkdir -p... ./install-sh -c -d |
---|
390 | :info:configure checking for gawk... no |
---|
391 | :info:configure checking for mawk... no |
---|
392 | :info:configure checking for nawk... no |
---|
393 | :info:configure checking for awk... awk |
---|
394 | :info:configure checking whether make sets $(MAKE)... yes |
---|
395 | :info:configure checking for gcc... /Developer/usr/bin/clang |
---|
396 | :info:configure checking whether the C compiler works... yes |
---|
397 | :info:configure checking for C compiler default output file name... a.out |
---|
398 | :info:configure checking for suffix of executables... |
---|
399 | :info:configure checking whether we are cross compiling... no |
---|
400 | :info:configure checking for suffix of object files... o |
---|
401 | :info:configure checking whether we are using the GNU C compiler... yes |
---|
402 | :info:configure checking whether /Developer/usr/bin/clang accepts -g... yes |
---|
403 | :info:configure checking for /Developer/usr/bin/clang option to accept ISO C89... none needed |
---|
404 | :info:configure checking for style of include used by make... GNU |
---|
405 | :info:configure checking dependency style of /Developer/usr/bin/clang... gcc3 |
---|
406 | :info:configure checking how to run the C preprocessor... /Developer/usr/bin/clang -E |
---|
407 | :info:configure checking for grep that handles long lines and -e... /usr/bin/grep |
---|
408 | :info:configure checking for egrep... /usr/bin/grep -E |
---|
409 | :info:configure checking for ANSI C header files... yes |
---|
410 | :info:configure checking for sys/types.h... yes |
---|
411 | :info:configure checking for sys/stat.h... yes |
---|
412 | :info:configure checking for stdlib.h... yes |
---|
413 | :info:configure checking for string.h... yes |
---|
414 | :info:configure checking for memory.h... yes |
---|
415 | :info:configure checking for strings.h... yes |
---|
416 | :info:configure checking for inttypes.h... yes |
---|
417 | :info:configure checking for stdint.h... yes |
---|
418 | :info:configure checking for unistd.h... yes |
---|
419 | :info:configure checking for stdlib.h... (cached) yes |
---|
420 | :info:configure checking for unistd.h... (cached) yes |
---|
421 | :info:configure checking errno.h usability... yes |
---|
422 | :info:configure checking errno.h presence... yes |
---|
423 | :info:configure checking for errno.h... yes |
---|
424 | :info:configure checking for string.h... (cached) yes |
---|
425 | :info:configure checking pwd.h usability... yes |
---|
426 | :info:configure checking pwd.h presence... yes |
---|
427 | :info:configure checking for pwd.h... yes |
---|
428 | :info:configure checking grp.h usability... yes |
---|
429 | :info:configure checking grp.h presence... yes |
---|
430 | :info:configure checking for grp.h... yes |
---|
431 | :info:configure checking ctype.h usability... yes |
---|
432 | :info:configure checking ctype.h presence... yes |
---|
433 | :info:configure checking for ctype.h... yes |
---|
434 | :info:configure checking fnmatch.h usability... yes |
---|
435 | :info:configure checking fnmatch.h presence... yes |
---|
436 | :info:configure checking for fnmatch.h... yes |
---|
437 | :info:configure checking sys/wait.h usability... yes |
---|
438 | :info:configure checking sys/wait.h presence... yes |
---|
439 | :info:configure checking for sys/wait.h... yes |
---|
440 | :info:configure checking signal.h usability... yes |
---|
441 | :info:configure checking signal.h presence... yes |
---|
442 | :info:configure checking for signal.h... yes |
---|
443 | :info:configure checking sys/select.h usability... yes |
---|
444 | :info:configure checking sys/select.h presence... yes |
---|
445 | :info:configure checking for sys/select.h... yes |
---|
446 | :info:configure checking fcntl.h usability... yes |
---|
447 | :info:configure checking fcntl.h presence... yes |
---|
448 | :info:configure checking for fcntl.h... yes |
---|
449 | :info:configure checking sys/time.h usability... yes |
---|
450 | :info:configure checking sys/time.h presence... yes |
---|
451 | :info:configure checking for sys/time.h... yes |
---|
452 | :info:configure checking sys/vfs.h usability... no |
---|
453 | :info:configure checking sys/vfs.h presence... no |
---|
454 | :info:configure checking for sys/vfs.h... no |
---|
455 | :info:configure checking sys/statvfs.h usability... yes |
---|
456 | :info:configure checking sys/statvfs.h presence... yes |
---|
457 | :info:configure checking for sys/statvfs.h... yes |
---|
458 | :info:configure checking sys/param.h usability... yes |
---|
459 | :info:configure checking sys/param.h presence... yes |
---|
460 | :info:configure checking for sys/param.h... yes |
---|
461 | :info:configure checking sys/mount.h usability... yes |
---|
462 | :info:configure checking sys/mount.h presence... yes |
---|
463 | :info:configure checking for sys/mount.h... yes |
---|
464 | :info:configure checking sys/mkdev.h usability... no |
---|
465 | :info:configure checking sys/mkdev.h presence... no |
---|
466 | :info:configure checking for sys/mkdev.h... no |
---|
467 | :info:configure checking if filesystem supports Large Files natively... yes |
---|
468 | :info:configure checking for getcwd... yes |
---|
469 | :info:configure checking for dirent.h that defines DIR... yes |
---|
470 | :info:configure checking for library containing opendir... none required |
---|
471 | :info:configure checking for struct stat.st_rdev... yes |
---|
472 | :info:configure checking whether stat file-mode macros are broken... no |
---|
473 | :info:configure checking whether time.h and sys/time.h may both be included... yes |
---|
474 | :info:configure checking whether struct tm is in sys/time.h or time.h... time.h |
---|
475 | :info:configure checking size of unsigned char... 1 |
---|
476 | :info:configure checking size of unsigned short... 2 |
---|
477 | :info:configure checking size of unsigned int... 4 |
---|
478 | :info:configure checking size of unsigned long... 8 |
---|
479 | :info:configure checking size of unsigned long long... 8 |
---|
480 | :info:configure checking size of size_t... 8 |
---|
481 | :info:configure checking whether we are using the GNU C++ compiler... yes |
---|
482 | :info:configure checking whether /Developer/usr/bin/clang++ accepts -g... yes |
---|
483 | :info:configure checking dependency style of /Developer/usr/bin/clang++... gcc3 |
---|
484 | :info:configure checking how to run the C++ preprocessor... /Developer/usr/bin/clang++ -E |
---|
485 | :info:configure checking iostream usability... yes |
---|
486 | :info:configure checking iostream presence... yes |
---|
487 | :info:configure checking for iostream... yes |
---|
488 | :info:configure checking string usability... yes |
---|
489 | :info:configure checking string presence... yes |
---|
490 | :info:configure checking for string... yes |
---|
491 | :info:configure checking vector usability... yes |
---|
492 | :info:configure checking vector presence... yes |
---|
493 | :info:configure checking for vector... yes |
---|
494 | :info:configure checking map usability... yes |
---|
495 | :info:configure checking map presence... yes |
---|
496 | :info:configure checking for map... yes |
---|
497 | :info:configure checking exception usability... yes |
---|
498 | :info:configure checking exception presence... yes |
---|
499 | :info:configure checking for exception... yes |
---|
500 | :info:configure checking cstdio usability... yes |
---|
501 | :info:configure checking cstdio presence... yes |
---|
502 | :info:configure checking for cstdio... yes |
---|
503 | :info:configure checking cassert usability... yes |
---|
504 | :info:configure checking cassert presence... yes |
---|
505 | :info:configure checking for cassert... yes |
---|
506 | :info:configure checking cerrno usability... yes |
---|
507 | :info:configure checking cerrno presence... yes |
---|
508 | :info:configure checking for cerrno... yes |
---|
509 | :info:configure checking cctype usability... yes |
---|
510 | :info:configure checking cctype presence... yes |
---|
511 | :info:configure checking for cctype... yes |
---|
512 | :info:configure checking streambuf usability... yes |
---|
513 | :info:configure checking streambuf presence... yes |
---|
514 | :info:configure checking for streambuf... yes |
---|
515 | :info:configure checking limits usability... yes |
---|
516 | :info:configure checking limits presence... yes |
---|
517 | :info:configure checking for limits... yes |
---|
518 | :info:configure checking if the stl throws an exception at memory allocation failure... (cached) yes |
---|
519 | :info:configure checking for rsync... /opt/local/bin/rsync |
---|
520 | :info:configure checking default config file... (cached) /opt/local/etc/rvm.conf |
---|
521 | :info:configure checking default log dir... (cached) /opt/local/var/log/rvm |
---|
522 | :info:configure configure: creating ./config.status |
---|
523 | :info:configure config.status: creating Makefile |
---|
524 | :info:configure config.status: creating rvm.1 |
---|
525 | :info:configure config.status: creating config.h |
---|
526 | :info:configure config.status: executing depfiles commands |
---|
527 | :debug:configure Privilege de-escalation not attempted as not running as root. |
---|
528 | :debug:build build phase started at Mon Nov 21 22:30:00 EST 2011 |
---|
529 | :notice:build ---> Building rvm |
---|
530 | :debug:build Executing org.macports.build (rvm) |
---|
531 | :debug:build Environment: CPATH='/opt/local/include' CC_PRINT_OPTIONS_FILE='/opt/local/var/macports/build/_opt_local_var_macports_sources_rsync.macports.org_release_ports_sysutils_rvm/rvm/work/.CC_PRINT_OPTIONS' LIBRARY_PATH='/opt/local/lib' CC_PRINT_OPTIONS='YES' MACOSX_DEPLOYMENT_TARGET='10.6' |
---|
532 | :debug:build Assembled command: 'cd "/opt/local/var/macports/build/_opt_local_var_macports_sources_rsync.macports.org_release_ports_sysutils_rvm/rvm/work/rvm-1.05" && /usr/bin/make -j4 -w all' |
---|
533 | :debug:build Executing command line: cd "/opt/local/var/macports/build/_opt_local_var_macports_sources_rsync.macports.org_release_ports_sysutils_rvm/rvm/work/rvm-1.05" && /usr/bin/make -j4 -w all |
---|
534 | :info:build make: Entering directory `/opt/local/var/macports/build/_opt_local_var_macports_sources_rsync.macports.org_release_ports_sysutils_rvm/rvm/work/rvm-1.05' |
---|
535 | :info:build /Developer/usr/bin/clang++ -DHAVE_CONFIG_H -I. -I/opt/local/include -MT test-fs.o -MD -MP -MF .deps/test-fs.Tpo -c -o test-fs.o test-fs.cc |
---|
536 | :info:build mv -f .deps/test-fs.Tpo .deps/test-fs.Po |
---|
537 | :info:build /bin/sh ./make-test-fs-cc |
---|
538 | :info:build /usr/bin/make all-am |
---|
539 | :info:build make[1]: Entering directory `/opt/local/var/macports/build/_opt_local_var_macports_sources_rsync.macports.org_release_ports_sysutils_rvm/rvm/work/rvm-1.05' |
---|
540 | :info:build /Developer/usr/bin/clang++ -DHAVE_CONFIG_H -I. -I/opt/local/include -MT types.o -MD -MP -MF .deps/types.Tpo -c -o types.o types.cc |
---|
541 | :info:build /Developer/usr/bin/clang++ -DHAVE_CONFIG_H -I. -I/opt/local/include -MT rmath.o -MD -MP -MF .deps/rmath.Tpo -c -o rmath.o rmath.cc |
---|
542 | :info:build /Developer/usr/bin/clang++ -DHAVE_CONFIG_H -I. -I/opt/local/include -MT error.o -MD -MP -MF .deps/error.Tpo -c -o error.o error.cc |
---|
543 | :info:build /Developer/usr/bin/clang++ -DHAVE_CONFIG_H -I. -I/opt/local/include -MT estring.o -MD -MP -MF .deps/estring.Tpo -c -o estring.o estring.cc |
---|
544 | :info:build mv -f .deps/types.Tpo .deps/types.Po |
---|
545 | :info:build /Developer/usr/bin/clang++ -DHAVE_CONFIG_H -I. -I/opt/local/include -MT fs.o -MD -MP -MF .deps/fs.Tpo -c -o fs.o fs.cc |
---|
546 | :info:build mv -f .deps/rmath.Tpo .deps/rmath.Po |
---|
547 | :info:build /Developer/usr/bin/clang++ -DHAVE_CONFIG_H -I. -I/opt/local/include -MT tstamp.o -MD -MP -MF .deps/tstamp.Tpo -c -o tstamp.o tstamp.cc |
---|
548 | :info:build mv -f .deps/error.Tpo .deps/error.Po |
---|
549 | :info:build /Developer/usr/bin/clang++ -DHAVE_CONFIG_H -I. -I/opt/local/include -MT rconfig.o -MD -MP -MF .deps/rconfig.Tpo -c -o rconfig.o rconfig.cc |
---|
550 | :info:build mv -f .deps/tstamp.Tpo .deps/tstamp.Po |
---|
551 | :info:build /Developer/usr/bin/clang++ -DHAVE_CONFIG_H -I. -I/opt/local/include -MT timer.o -MD -MP -MF .deps/timer.Tpo -c -o timer.o timer.cc |
---|
552 | :info:build mv -f .deps/fs.Tpo .deps/fs.Po |
---|
553 | :info:build /Developer/usr/bin/clang++ -DHAVE_CONFIG_H -I. -I/opt/local/include -MT logger.o -MD -MP -MF .deps/logger.Tpo -c -o logger.o logger.cc |
---|
554 | :info:build In file included from timer.cc:19: |
---|
555 | :info:build In file included from ./strfmt.h:7: |
---|
556 | :info:build ./rmath.h:372:26: warning: comparison of unsigned expression < 0 is always false [-Wtautological-compare] |
---|
557 | :info:build if ((lowest_value<T>() < 0) && (m_num < 0) && (a_arg < 0)) { |
---|
558 | :info:build ~~~~~~~~~~~~~~~~~ ^ ~ |
---|
559 | :info:build ./rmath.h:490:3: note: in instantiation of member function 'safe_num<unsigned int>::multiply' requested here |
---|
560 | :info:build multiply(a_class.value()); |
---|
561 | :info:build ^ |
---|
562 | :info:build ./rmath.h:638:3: note: in instantiation of member function 'safe_num<unsigned int>::multiply' requested here |
---|
563 | :info:build multiply(a_class); |
---|
564 | :info:build ^ |
---|
565 | :info:build timer.cc:510:2: note: in instantiation of member function 'safe_num<unsigned int>::operator*=' requested here |
---|
566 | :info:build TRY( |
---|
567 | :info:build ^ |
---|
568 | :info:build timer.cc:512:20: note: instantiated from: |
---|
569 | :info:build percent_complete *= 100; |
---|
570 | :info:build ^ |
---|
571 | :info:build In file included from timer.cc:19: |
---|
572 | :info:build In file included from ./strfmt.h:7: |
---|
573 | :info:build ./rmath.h:372:41: warning: comparison of unsigned expression < 0 is always false [-Wtautological-compare] |
---|
574 | :info:build if ((lowest_value<T>() < 0) && (m_num < 0) && (a_arg < 0)) { |
---|
575 | :info:build ~~~~~ ^ ~ |
---|
576 | :info:build ./rmath.h:372:56: warning: comparison of unsigned expression < 0 is always false [-Wtautological-compare] |
---|
577 | :info:build if ((lowest_value<T>() < 0) && (m_num < 0) && (a_arg < 0)) { |
---|
578 | :info:build ~~~~~ ^ ~ |
---|
579 | :info:build ./rmath.h:379:26: warning: comparison of unsigned expression < 0 is always false [-Wtautological-compare] |
---|
580 | :info:build if ((lowest_value<T>() < 0) && (m_num < 0) && (a_arg >= 0)) { |
---|
581 | :info:build ~~~~~~~~~~~~~~~~~ ^ ~ |
---|
582 | :info:build ./rmath.h:379:41: warning: comparison of unsigned expression < 0 is always false [-Wtautological-compare] |
---|
583 | :info:build if ((lowest_value<T>() < 0) && (m_num < 0) && (a_arg >= 0)) { |
---|
584 | :info:build ~~~~~ ^ ~ |
---|
585 | :info:build ./rmath.h:379:56: warning: comparison of unsigned expression >= 0 is always true [-Wtautological-compare] |
---|
586 | :info:build if ((lowest_value<T>() < 0) && (m_num < 0) && (a_arg >= 0)) { |
---|
587 | :info:build ~~~~~ ^ ~ |
---|
588 | :info:build ./rmath.h:384:26: warning: comparison of unsigned expression < 0 is always false [-Wtautological-compare] |
---|
589 | :info:build if ((lowest_value<T>() < 0) && (m_num >= 0) && (a_arg < 0)) { |
---|
590 | :info:build ~~~~~~~~~~~~~~~~~ ^ ~ |
---|
591 | :info:build ./rmath.h:384:41: warning: comparison of unsigned expression >= 0 is always true [-Wtautological-compare] |
---|
592 | :info:build if ((lowest_value<T>() < 0) && (m_num >= 0) && (a_arg < 0)) { |
---|
593 | :info:build ~~~~~ ^ ~ |
---|
594 | :info:build ./rmath.h:384:57: warning: comparison of unsigned expression < 0 is always false [-Wtautological-compare] |
---|
595 | :info:build if ((lowest_value<T>() < 0) && (m_num >= 0) && (a_arg < 0)) { |
---|
596 | :info:build ~~~~~ ^ ~ |
---|
597 | :info:build ./rmath.h:389:26: warning: comparison of unsigned expression < 0 is always false [-Wtautological-compare] |
---|
598 | :info:build if ((lowest_value<T>() < 0) && (m_num >= 0) && (a_arg >= 0)) { |
---|
599 | :info:build ~~~~~~~~~~~~~~~~~ ^ ~ |
---|
600 | :info:build ./rmath.h:389:41: warning: comparison of unsigned expression >= 0 is always true [-Wtautological-compare] |
---|
601 | :info:build if ((lowest_value<T>() < 0) && (m_num >= 0) && (a_arg >= 0)) { |
---|
602 | :info:build ~~~~~ ^ ~ |
---|
603 | :info:build ./rmath.h:389:57: warning: comparison of unsigned expression >= 0 is always true [-Wtautological-compare] |
---|
604 | :info:build if ((lowest_value<T>() < 0) && (m_num >= 0) && (a_arg >= 0)) { |
---|
605 | :info:build ~~~~~ ^ ~ |
---|
606 | :info:build ./rmath.h:394:26: warning: comparison of unsigned expression >= 0 is always true [-Wtautological-compare] |
---|
607 | :info:build if ((lowest_value<T>() >= 0) && (m_num >= 0) && (a_arg >= 0)) { |
---|
608 | :info:build ~~~~~~~~~~~~~~~~~ ^ ~ |
---|
609 | :info:build ./rmath.h:394:42: warning: comparison of unsigned expression >= 0 is always true [-Wtautological-compare] |
---|
610 | :info:build if ((lowest_value<T>() >= 0) && (m_num >= 0) && (a_arg >= 0)) { |
---|
611 | :info:build ~~~~~ ^ ~ |
---|
612 | :info:build ./rmath.h:394:58: warning: comparison of unsigned expression >= 0 is always true [-Wtautological-compare] |
---|
613 | :info:build if ((lowest_value<T>() >= 0) && (m_num >= 0) && (a_arg >= 0)) { |
---|
614 | :info:build ~~~~~ ^ ~ |
---|
615 | :info:build ./rmath.h:444:14: warning: comparison of unsigned expression < 0 is always false [-Wtautological-compare] |
---|
616 | :info:build if ((m_num < 0) && (a_arg < 0) && (num < 0)) { |
---|
617 | :info:build ~~~~~ ^ ~ |
---|
618 | :info:build ./rmath.h:496:3: note: in instantiation of member function 'safe_num<unsigned int>::divide' requested here |
---|
619 | :info:build divide(a_class.value()); |
---|
620 | :info:build ^ |
---|
621 | :info:build ./rmath.h:646:3: note: in instantiation of member function 'safe_num<unsigned int>::divide' requested here |
---|
622 | :info:build divide(a_class); |
---|
623 | :info:build ^ |
---|
624 | :info:build timer.cc:510:2: note: in instantiation of member function 'safe_num<unsigned int>::operator/=' requested here |
---|
625 | :info:build TRY( |
---|
626 | :info:build ^ |
---|
627 | :info:build timer.cc:513:20: note: instantiated from: |
---|
628 | :info:build percent_complete /= a_total; |
---|
629 | :info:build ^ |
---|
630 | :info:build In file included from timer.cc:19: |
---|
631 | :info:build In file included from ./strfmt.h:7: |
---|
632 | :info:build ./rmath.h:444:29: warning: comparison of unsigned expression < 0 is always false [-Wtautological-compare] |
---|
633 | :info:build if ((m_num < 0) && (a_arg < 0) && (num < 0)) { |
---|
634 | :info:build ~~~~~ ^ ~ |
---|
635 | :info:build ./rmath.h:444:42: warning: comparison of unsigned expression < 0 is always false [-Wtautological-compare] |
---|
636 | :info:build if ((m_num < 0) && (a_arg < 0) && (num < 0)) { |
---|
637 | :info:build ~~~ ^ ~ |
---|
638 | :info:build ./rmath.h:296:13: warning: comparison of unsigned expression < 0 is always false [-Wtautological-compare] |
---|
639 | :info:build if (a_arg < static_cast<T>(0)) { |
---|
640 | :info:build ~~~~~ ^ ~~~~~~~~~~~~~~~~~ |
---|
641 | :info:build ./rmath.h:726:10: note: in instantiation of member function 'safe_num<unsigned long>::add' requested here |
---|
642 | :info:build a_class.add(static_cast<T>(1)); |
---|
643 | :info:build ^ |
---|
644 | :info:build ./strfmt.h:54:35: note: in instantiation of function template specialization 'operator++<unsigned long>' requested here |
---|
645 | :info:build for (tmp = 1; tmp < a_precision; ++tmp) { |
---|
646 | :info:build ^ |
---|
647 | :info:build ./strfmt.h:146:2: note: in instantiation of function template specialization 'size_to_string<unsigned long>' requested here |
---|
648 | :info:build TRY_nomem( |
---|
649 | :info:build ^ |
---|
650 | :info:build ./strfmt.h:147:9: note: instantiated from: |
---|
651 | :info:build str = size_to_string(a_t, a_base_size_unit, a_width-2, a_precision, a_kilo) |
---|
652 | :info:build ^ |
---|
653 | :info:build timer.cc:536:2: note: in instantiation of function template specialization 'throughput_to_string<unsigned long>' requested here |
---|
654 | :info:build TRY_nomem(str = throughput_to_string(bps)); |
---|
655 | :info:build ^ |
---|
656 | :info:build timer.cc:536:18: note: instantiated from: |
---|
657 | :info:build TRY_nomem(str = throughput_to_string(bps)); |
---|
658 | :info:build ^ |
---|
659 | :info:build In file included from timer.cc:19: |
---|
660 | :info:build In file included from ./strfmt.h:7: |
---|
661 | :info:build ./rmath.h:215:11: warning: comparison of unsigned expression < 0 is always false [-Wtautological-compare] |
---|
662 | :info:build if ((num < 0) && (num == min_limit<T>())) { |
---|
663 | :info:build ~~~ ^ ~ |
---|
664 | :info:build ./rmath.h:297:10: note: in instantiation of function template specialization 'absolute<unsigned long>' requested here |
---|
665 | :info:build num = absolute(a_arg); |
---|
666 | :info:build ^ |
---|
667 | :info:build ./rmath.h:726:10: note: in instantiation of member function 'safe_num<unsigned long>::add' requested here |
---|
668 | :info:build a_class.add(static_cast<T>(1)); |
---|
669 | :info:build ^ |
---|
670 | :info:build ./strfmt.h:54:35: note: in instantiation of function template specialization 'operator++<unsigned long>' requested here |
---|
671 | :info:build for (tmp = 1; tmp < a_precision; ++tmp) { |
---|
672 | :info:build ^ |
---|
673 | :info:build ./strfmt.h:146:2: note: in instantiation of function template specialization 'size_to_string<unsigned long>' requested here |
---|
674 | :info:build TRY_nomem( |
---|
675 | :info:build ^ |
---|
676 | :info:build ./strfmt.h:147:9: note: instantiated from: |
---|
677 | :info:build str = size_to_string(a_t, a_base_size_unit, a_width-2, a_precision, a_kilo) |
---|
678 | :info:build ^ |
---|
679 | :info:build timer.cc:536:2: note: in instantiation of function template specialization 'throughput_to_string<unsigned long>' requested here |
---|
680 | :info:build TRY_nomem(str = throughput_to_string(bps)); |
---|
681 | :info:build ^ |
---|
682 | :info:build timer.cc:536:18: note: instantiated from: |
---|
683 | :info:build TRY_nomem(str = throughput_to_string(bps)); |
---|
684 | :info:build ^ |
---|
685 | :info:build In file included from timer.cc:19: |
---|
686 | :info:build In file included from ./strfmt.h:7: |
---|
687 | :info:build ./rmath.h:225:10: warning: comparison of unsigned expression < 0 is always false [-Wtautological-compare] |
---|
688 | :info:build if (num < 0) { |
---|
689 | :info:build ~~~ ^ ~ |
---|
690 | :info:build ./rmath.h:227:11: warning: comparison of unsigned expression < 0 is always false [-Wtautological-compare] |
---|
691 | :info:build if (num < 0) { |
---|
692 | :info:build ~~~ ^ ~ |
---|
693 | :info:build ./rmath.h:329:13: warning: comparison of unsigned expression < 0 is always false [-Wtautological-compare] |
---|
694 | :info:build if (a_arg < static_cast<T>(0)) { |
---|
695 | :info:build ~~~~~ ^ ~~~~~~~~~~~~~~~~~ |
---|
696 | :info:build ./rmath.h:298:4: note: in instantiation of member function 'safe_num<unsigned long>::subtract' requested here |
---|
697 | :info:build subtract(num); |
---|
698 | :info:build ^ |
---|
699 | :info:build ./rmath.h:726:10: note: in instantiation of member function 'safe_num<unsigned long>::add' requested here |
---|
700 | :info:build a_class.add(static_cast<T>(1)); |
---|
701 | :info:build ^ |
---|
702 | :info:build ./strfmt.h:54:35: note: in instantiation of function template specialization 'operator++<unsigned long>' requested here |
---|
703 | :info:build for (tmp = 1; tmp < a_precision; ++tmp) { |
---|
704 | :info:build ^ |
---|
705 | :info:build ./strfmt.h:146:2: note: in instantiation of function template specialization 'size_to_string<unsigned long>' requested here |
---|
706 | :info:build TRY_nomem( |
---|
707 | :info:build ^ |
---|
708 | :info:build ./strfmt.h:147:9: note: instantiated from: |
---|
709 | :info:build str = size_to_string(a_t, a_base_size_unit, a_width-2, a_precision, a_kilo) |
---|
710 | :info:build ^ |
---|
711 | :info:build timer.cc:536:2: note: in instantiation of function template specialization 'throughput_to_string<unsigned long>' requested here |
---|
712 | :info:build TRY_nomem(str = throughput_to_string(bps)); |
---|
713 | :info:build ^ |
---|
714 | :info:build timer.cc:536:18: note: instantiated from: |
---|
715 | :info:build TRY_nomem(str = throughput_to_string(bps)); |
---|
716 | :info:build ^ |
---|
717 | :info:build In file included from timer.cc:19: |
---|
718 | :info:build In file included from ./strfmt.h:7: |
---|
719 | :info:build ./rmath.h:335:25: warning: comparison of unsigned expression < 0 is always false [-Wtautological-compare] |
---|
720 | :info:build if (lowest_value<T>() < 0) { |
---|
721 | :info:build ~~~~~~~~~~~~~~~~~ ^ ~ |
---|
722 | :info:build ./rmath.h:372:26: warning: comparison of unsigned expression < 0 is always false [-Wtautological-compare] |
---|
723 | :info:build if ((lowest_value<T>() < 0) && (m_num < 0) && (a_arg < 0)) { |
---|
724 | :info:build ~~~~~~~~~~~~~~~~~ ^ ~ |
---|
725 | :info:build ./rmath.h:490:3: note: in instantiation of member function 'safe_num<unsigned long>::multiply' requested here |
---|
726 | :info:build multiply(a_class.value()); |
---|
727 | :info:build ^ |
---|
728 | :info:build ./rmath.h:638:3: note: in instantiation of member function 'safe_num<unsigned long>::multiply' requested here |
---|
729 | :info:build multiply(a_class); |
---|
730 | :info:build ^ |
---|
731 | :info:build ./strfmt.h:55:8: note: in instantiation of member function 'safe_num<unsigned long>::operator*=' requested here |
---|
732 | :info:build rmul *= 10; |
---|
733 | :info:build ^ |
---|
734 | :info:build ./strfmt.h:146:2: note: in instantiation of function template specialization 'size_to_string<unsigned long>' requested here |
---|
735 | :info:build TRY_nomem( |
---|
736 | :info:build ^ |
---|
737 | :info:build ./strfmt.h:147:9: note: instantiated from: |
---|
738 | :info:build str = size_to_string(a_t, a_base_size_unit, a_width-2, a_precision, a_kilo) |
---|
739 | :info:build ^ |
---|
740 | :info:build timer.cc:536:2: note: in instantiation of function template specialization 'throughput_to_string<unsigned long>' requested here |
---|
741 | :info:build TRY_nomem(str = throughput_to_string(bps)); |
---|
742 | :info:build ^ |
---|
743 | :info:build timer.cc:536:18: note: instantiated from: |
---|
744 | :info:build TRY_nomem(str = throughput_to_string(bps)); |
---|
745 | :info:build ^ |
---|
746 | :info:build In file included from timer.cc:19: |
---|
747 | :info:build In file included from ./strfmt.h:7: |
---|
748 | :info:build ./rmath.h:372:41: warning: comparison of unsigned expression < 0 is always false [-Wtautological-compare] |
---|
749 | :info:build if ((lowest_value<T>() < 0) && (m_num < 0) && (a_arg < 0)) { |
---|
750 | :info:build ~~~~~ ^ ~ |
---|
751 | :info:build ./rmath.h:372:56: warning: comparison of unsigned expression < 0 is always false [-Wtautological-compare] |
---|
752 | :info:build if ((lowest_value<T>() < 0) && (m_num < 0) && (a_arg < 0)) { |
---|
753 | :info:build ~~~~~ ^ ~ |
---|
754 | :info:build ./rmath.h:379:26: warning: comparison of unsigned expression < 0 is always false [-Wtautological-compare] |
---|
755 | :info:build if ((lowest_value<T>() < 0) && (m_num < 0) && (a_arg >= 0)) { |
---|
756 | :info:build ~~~~~~~~~~~~~~~~~ ^ ~ |
---|
757 | :info:build ./rmath.h:379:41: warning: comparison of unsigned expression < 0 is always false [-Wtautological-compare] |
---|
758 | :info:build if ((lowest_value<T>() < 0) && (m_num < 0) && (a_arg >= 0)) { |
---|
759 | :info:build ~~~~~ ^ ~ |
---|
760 | :info:build ./rmath.h:379:56: warning: comparison of unsigned expression >= 0 is always true [-Wtautological-compare] |
---|
761 | :info:build if ((lowest_value<T>() < 0) && (m_num < 0) && (a_arg >= 0)) { |
---|
762 | :info:build ~~~~~ ^ ~ |
---|
763 | :info:build ./rmath.h:384:26: warning: comparison of unsigned expression < 0 is always false [-Wtautological-compare] |
---|
764 | :info:build if ((lowest_value<T>() < 0) && (m_num >= 0) && (a_arg < 0)) { |
---|
765 | :info:build ~~~~~~~~~~~~~~~~~ ^ ~ |
---|
766 | :info:build ./rmath.h:384:41: warning: comparison of unsigned expression >= 0 is always true [-Wtautological-compare] |
---|
767 | :info:build if ((lowest_value<T>() < 0) && (m_num >= 0) && (a_arg < 0)) { |
---|
768 | :info:build ~~~~~ ^ ~ |
---|
769 | :info:build ./rmath.h:384:57: warning: comparison of unsigned expression < 0 is always false [-Wtautological-compare] |
---|
770 | :info:build if ((lowest_value<T>() < 0) && (m_num >= 0) && (a_arg < 0)) { |
---|
771 | :info:build ~~~~~ ^ ~ |
---|
772 | :info:build ./rmath.h:389:26: warning: comparison of unsigned expression < 0 is always false [-Wtautological-compare] |
---|
773 | :info:build if ((lowest_value<T>() < 0) && (m_num >= 0) && (a_arg >= 0)) { |
---|
774 | :info:build ~~~~~~~~~~~~~~~~~ ^ ~ |
---|
775 | :info:build ./rmath.h:389:41: warning: comparison of unsigned expression >= 0 is always true [-Wtautological-compare] |
---|
776 | :info:build if ((lowest_value<T>() < 0) && (m_num >= 0) && (a_arg >= 0)) { |
---|
777 | :info:build ~~~~~ ^ ~ |
---|
778 | :info:build ./rmath.h:389:57: warning: comparison of unsigned expression >= 0 is always true [-Wtautological-compare] |
---|
779 | :info:build if ((lowest_value<T>() < 0) && (m_num >= 0) && (a_arg >= 0)) { |
---|
780 | :info:build ~~~~~ ^ ~ |
---|
781 | :info:build ./rmath.h:394:26: warning: comparison of unsigned expression >= 0 is always true [-Wtautological-compare] |
---|
782 | :info:build if ((lowest_value<T>() >= 0) && (m_num >= 0) && (a_arg >= 0)) { |
---|
783 | :info:build ~~~~~~~~~~~~~~~~~ ^ ~ |
---|
784 | :info:build ./rmath.h:394:42: warning: comparison of unsigned expression >= 0 is always true [-Wtautological-compare] |
---|
785 | :info:build if ((lowest_value<T>() >= 0) && (m_num >= 0) && (a_arg >= 0)) { |
---|
786 | :info:build ~~~~~ ^ ~ |
---|
787 | :info:build ./rmath.h:394:58: warning: comparison of unsigned expression >= 0 is always true [-Wtautological-compare] |
---|
788 | :info:build if ((lowest_value<T>() >= 0) && (m_num >= 0) && (a_arg >= 0)) { |
---|
789 | :info:build ~~~~~ ^ ~ |
---|
790 | :info:build ./rmath.h:444:14: warning: comparison of unsigned expression < 0 is always false [-Wtautological-compare] |
---|
791 | :info:build if ((m_num < 0) && (a_arg < 0) && (num < 0)) { |
---|
792 | :info:build ~~~~~ ^ ~ |
---|
793 | :info:build ./rmath.h:496:3: note: in instantiation of member function 'safe_num<unsigned long>::divide' requested here |
---|
794 | :info:build divide(a_class.value()); |
---|
795 | :info:build ^ |
---|
796 | :info:build ./rmath.h:706:9: note: in instantiation of member function 'safe_num<unsigned long>::divide' requested here |
---|
797 | :info:build result.divide(a_class2); |
---|
798 | :info:build ^ |
---|
799 | :info:build ./strfmt.h:58:3: note: in instantiation of function template specialization 'operator/<unsigned long>' requested here |
---|
800 | :info:build TRY( |
---|
801 | :info:build ^ |
---|
802 | :info:build ./strfmt.h:66:21: note: instantiated from: |
---|
803 | :info:build remainder = (tmp / safe_num<T>(a_kilo)) % rmul; |
---|
804 | :info:build ^ |
---|
805 | :info:build ./strfmt.h:146:2: note: in instantiation of function template specialization 'size_to_string<unsigned long>' requested here |
---|
806 | :info:build TRY_nomem( |
---|
807 | :info:build ^ |
---|
808 | :info:build ./strfmt.h:147:9: note: instantiated from: |
---|
809 | :info:build str = size_to_string(a_t, a_base_size_unit, a_width-2, a_precision, a_kilo) |
---|
810 | :info:build ^ |
---|
811 | :info:build timer.cc:536:2: note: in instantiation of function template specialization 'throughput_to_string<unsigned long>' requested here |
---|
812 | :info:build TRY_nomem(str = throughput_to_string(bps)); |
---|
813 | :info:build ^ |
---|
814 | :info:build timer.cc:536:18: note: instantiated from: |
---|
815 | :info:build TRY_nomem(str = throughput_to_string(bps)); |
---|
816 | :info:build ^ |
---|
817 | :info:build In file included from timer.cc:19: |
---|
818 | :info:build In file included from ./strfmt.h:7: |
---|
819 | :info:build ./rmath.h:444:29: warning: comparison of unsigned expression < 0 is always false [-Wtautological-compare] |
---|
820 | :info:build if ((m_num < 0) && (a_arg < 0) && (num < 0)) { |
---|
821 | :info:build ~~~~~ ^ ~ |
---|
822 | :info:build ./rmath.h:444:42: warning: comparison of unsigned expression < 0 is always false [-Wtautological-compare] |
---|
823 | :info:build if ((m_num < 0) && (a_arg < 0) && (num < 0)) { |
---|
824 | :info:build ~~~ ^ ~ |
---|
825 | :info:build ./rmath.h:96:14: warning: function 'max_limit<double>' has internal linkage but is not defined |
---|
826 | :info:build const double max_limit<double>(); |
---|
827 | :info:build ^ |
---|
828 | :info:build ./rmath.h:178:11: note: used here |
---|
829 | :info:build value = -max_limit<T>(); |
---|
830 | :info:build ^ |
---|
831 | :info:build ./rmath.h:106:14: warning: function 'min_limit<double>' has internal linkage but is not defined |
---|
832 | :info:build const double min_limit<double>(); |
---|
833 | :info:build ^ |
---|
834 | :info:build ./rmath.h:179:14: note: used here |
---|
835 | :info:build if (value > min_limit<T>()) |
---|
836 | :info:build ^ |
---|
837 | :info:build mv -f .deps/logger.Tpo .deps/logger.Po |
---|
838 | :info:build /Developer/usr/bin/clang++ -DHAVE_CONFIG_H -I. -I/opt/local/include -MT estat.o -MD -MP -MF .deps/estat.Tpo -c -o estat.o estat.cc |
---|
839 | :info:build mv -f .deps/estat.Tpo .deps/estat.Po |
---|
840 | :info:build /Developer/usr/bin/clang++ -DHAVE_CONFIG_H -I. -I/opt/local/include -MT vaulter.o -MD -MP -MF .deps/vaulter.Tpo -c -o vaulter.o vaulter.cc |
---|
841 | :info:build mv -f .deps/estring.Tpo .deps/estring.Po |
---|
842 | :info:build /Developer/usr/bin/clang++ -DHAVE_CONFIG_H -I. -I/opt/local/include -MT exec.o -MD -MP -MF .deps/exec.Tpo -c -o exec.o exec.cc |
---|
843 | :info:build 44 warnings generated. |
---|
844 | :info:build mv -f .deps/timer.Tpo .deps/timer.Po |
---|
845 | :info:build /Developer/usr/bin/clang++ -DHAVE_CONFIG_H -I. -I/opt/local/include -MT table.o -MD -MP -MF .deps/table.Tpo -c -o table.o table.cc |
---|
846 | :info:build In file included from vaulter.cc:10: |
---|
847 | :info:build ./rmath.h:444:14: warning: comparison of unsigned expression < 0 is always false [-Wtautological-compare] |
---|
848 | :info:build if ((m_num < 0) && (a_arg < 0) && (num < 0)) { |
---|
849 | :info:build ~~~~~ ^ ~ |
---|
850 | :info:build ./rmath.h:496:3: note: in instantiation of member function 'safe_num<unsigned long>::divide' requested here |
---|
851 | :info:build divide(a_class.value()); |
---|
852 | :info:build ^ |
---|
853 | :info:build ./rmath.h:646:3: note: in instantiation of member function 'safe_num<unsigned long>::divide' requested here |
---|
854 | :info:build divide(a_class); |
---|
855 | :info:build ^ |
---|
856 | :info:build vaulter.cc:337:11: note: in instantiation of member function 'safe_num<unsigned long>::operator/=' requested here |
---|
857 | :info:build blocks /= fsys.total_blocks() / 100; |
---|
858 | :info:build ^ |
---|
859 | :info:build In file included from vaulter.cc:10: |
---|
860 | :info:build ./rmath.h:444:29: warning: comparison of unsigned expression < 0 is always false [-Wtautological-compare] |
---|
861 | :info:build if ((m_num < 0) && (a_arg < 0) && (num < 0)) { |
---|
862 | :info:build ~~~~~ ^ ~ |
---|
863 | :info:build ./rmath.h:444:42: warning: comparison of unsigned expression < 0 is always false [-Wtautological-compare] |
---|
864 | :info:build if ((m_num < 0) && (a_arg < 0) && (num < 0)) { |
---|
865 | :info:build ~~~ ^ ~ |
---|
866 | :info:build ./rmath.h:372:26: warning: comparison of unsigned expression < 0 is always false [-Wtautological-compare] |
---|
867 | :info:build if ((lowest_value<T>() < 0) && (m_num < 0) && (a_arg < 0)) { |
---|
868 | :info:build ~~~~~~~~~~~~~~~~~ ^ ~ |
---|
869 | :info:build ./rmath.h:490:3: note: in instantiation of member function 'safe_num<unsigned long>::multiply' requested here |
---|
870 | :info:build multiply(a_class.value()); |
---|
871 | :info:build ^ |
---|
872 | :info:build ./rmath.h:694:9: note: in instantiation of member function 'safe_num<unsigned long>::multiply' requested here |
---|
873 | :info:build result.multiply(a_class2); |
---|
874 | :info:build ^ |
---|
875 | :info:build ./rmath.h:35:15: note: in instantiation of function template specialization 'operator*<unsigned long>' requested here |
---|
876 | :info:build tmp = (tmp * T(2)) + T(1); |
---|
877 | :info:build ^ |
---|
878 | :info:build ./rmath.h:121:10: note: in instantiation of function template specialization 'max_limit<safe_num<unsigned long> >' requested here |
---|
879 | :info:build value = max_limit<T>(); |
---|
880 | :info:build ^ |
---|
881 | :info:build vaulter.cc:370:2: note: in instantiation of function template specialization 'max_limit<safe_num<unsigned long> >' requested here |
---|
882 | :info:build ASSERT(blocks <= max_limit(blocks)); |
---|
883 | :info:build ^ |
---|
884 | :info:build ./asserts.h:9:23: note: instantiated from: |
---|
885 | :info:build #define ASSERT(code) assert(code) |
---|
886 | :info:build ^ |
---|
887 | :info:build vaulter.cc:370:2: note: instantiated from: |
---|
888 | :info:build ASSERT(blocks <= max_limit(blocks)); |
---|
889 | :info:build ^ |
---|
890 | :info:build vaulter.cc:370:19: note: instantiated from: |
---|
891 | :info:build ASSERT(blocks <= max_limit(blocks)); |
---|
892 | :info:build ^ |
---|
893 | :info:build In file included from vaulter.cc:10: |
---|
894 | :info:build ./rmath.h:372:41: warning: comparison of unsigned expression < 0 is always false [-Wtautological-compare] |
---|
895 | :info:build if ((lowest_value<T>() < 0) && (m_num < 0) && (a_arg < 0)) { |
---|
896 | :info:build ~~~~~ ^ ~ |
---|
897 | :info:build ./rmath.h:372:56: warning: comparison of unsigned expression < 0 is always false [-Wtautological-compare] |
---|
898 | :info:build if ((lowest_value<T>() < 0) && (m_num < 0) && (a_arg < 0)) { |
---|
899 | :info:build ~~~~~ ^ ~ |
---|
900 | :info:build ./rmath.h:379:26: warning: comparison of unsigned expression < 0 is always false [-Wtautological-compare] |
---|
901 | :info:build if ((lowest_value<T>() < 0) && (m_num < 0) && (a_arg >= 0)) { |
---|
902 | :info:build ~~~~~~~~~~~~~~~~~ ^ ~ |
---|
903 | :info:build ./rmath.h:379:41: warning: comparison of unsigned expression < 0 is always false [-Wtautological-compare] |
---|
904 | :info:build if ((lowest_value<T>() < 0) && (m_num < 0) && (a_arg >= 0)) { |
---|
905 | :info:build ~~~~~ ^ ~ |
---|
906 | :info:build ./rmath.h:379:56: warning: comparison of unsigned expression >= 0 is always true [-Wtautological-compare] |
---|
907 | :info:build if ((lowest_value<T>() < 0) && (m_num < 0) && (a_arg >= 0)) { |
---|
908 | :info:build ~~~~~ ^ ~ |
---|
909 | :info:build ./rmath.h:384:26: warning: comparison of unsigned expression < 0 is always false [-Wtautological-compare] |
---|
910 | :info:build if ((lowest_value<T>() < 0) && (m_num >= 0) && (a_arg < 0)) { |
---|
911 | :info:build ~~~~~~~~~~~~~~~~~ ^ ~ |
---|
912 | :info:build ./rmath.h:384:41: warning: comparison of unsigned expression >= 0 is always true [-Wtautological-compare] |
---|
913 | :info:build if ((lowest_value<T>() < 0) && (m_num >= 0) && (a_arg < 0)) { |
---|
914 | :info:build ~~~~~ ^ ~ |
---|
915 | :info:build ./rmath.h:384:57: warning: comparison of unsigned expression < 0 is always false [-Wtautological-compare] |
---|
916 | :info:build if ((lowest_value<T>() < 0) && (m_num >= 0) && (a_arg < 0)) { |
---|
917 | :info:build ~~~~~ ^ ~ |
---|
918 | :info:build ./rmath.h:389:26: warning: comparison of unsigned expression < 0 is always false [-Wtautological-compare] |
---|
919 | :info:build if ((lowest_value<T>() < 0) && (m_num >= 0) && (a_arg >= 0)) { |
---|
920 | :info:build ~~~~~~~~~~~~~~~~~ ^ ~ |
---|
921 | :info:build ./rmath.h:389:41: warning: comparison of unsigned expression >= 0 is always true [-Wtautological-compare] |
---|
922 | :info:build if ((lowest_value<T>() < 0) && (m_num >= 0) && (a_arg >= 0)) { |
---|
923 | :info:build ~~~~~ ^ ~ |
---|
924 | :info:build ./rmath.h:389:57: warning: comparison of unsigned expression >= 0 is always true [-Wtautological-compare] |
---|
925 | :info:build if ((lowest_value<T>() < 0) && (m_num >= 0) && (a_arg >= 0)) { |
---|
926 | :info:build ~~~~~ ^ ~ |
---|
927 | :info:build ./rmath.h:394:26: warning: comparison of unsigned expression >= 0 is always true [-Wtautological-compare] |
---|
928 | :info:build if ((lowest_value<T>() >= 0) && (m_num >= 0) && (a_arg >= 0)) { |
---|
929 | :info:build ~~~~~~~~~~~~~~~~~ ^ ~ |
---|
930 | :info:build ./rmath.h:394:42: warning: comparison of unsigned expression >= 0 is always true [-Wtautological-compare] |
---|
931 | :info:build if ((lowest_value<T>() >= 0) && (m_num >= 0) && (a_arg >= 0)) { |
---|
932 | :info:build ~~~~~ ^ ~ |
---|
933 | :info:build ./rmath.h:394:58: warning: comparison of unsigned expression >= 0 is always true [-Wtautological-compare] |
---|
934 | :info:build if ((lowest_value<T>() >= 0) && (m_num >= 0) && (a_arg >= 0)) { |
---|
935 | :info:build ~~~~~ ^ ~ |
---|
936 | :info:build ./rmath.h:296:13: warning: comparison of unsigned expression < 0 is always false [-Wtautological-compare] |
---|
937 | :info:build if (a_arg < static_cast<T>(0)) { |
---|
938 | :info:build ~~~~~ ^ ~~~~~~~~~~~~~~~~~ |
---|
939 | :info:build ./rmath.h:478:3: note: in instantiation of member function 'safe_num<unsigned long>::add' requested here |
---|
940 | :info:build add(a_class.value()); |
---|
941 | :info:build ^ |
---|
942 | :info:build ./rmath.h:670:9: note: in instantiation of member function 'safe_num<unsigned long>::add' requested here |
---|
943 | :info:build result.add(a_class2); |
---|
944 | :info:build ^ |
---|
945 | :info:build ./rmath.h:35:23: note: in instantiation of function template specialization 'operator+<unsigned long>' requested here |
---|
946 | :info:build tmp = (tmp * T(2)) + T(1); |
---|
947 | :info:build ^ |
---|
948 | :info:build ./rmath.h:121:10: note: in instantiation of function template specialization 'max_limit<safe_num<unsigned long> >' requested here |
---|
949 | :info:build value = max_limit<T>(); |
---|
950 | :info:build ^ |
---|
951 | :info:build vaulter.cc:370:2: note: in instantiation of function template specialization 'max_limit<safe_num<unsigned long> >' requested here |
---|
952 | :info:build ASSERT(blocks <= max_limit(blocks)); |
---|
953 | :info:build ^ |
---|
954 | :info:build ./asserts.h:9:23: note: instantiated from: |
---|
955 | :info:build #define ASSERT(code) assert(code) |
---|
956 | :info:build ^ |
---|
957 | :info:build vaulter.cc:370:2: note: instantiated from: |
---|
958 | :info:build ASSERT(blocks <= max_limit(blocks)); |
---|
959 | :info:build ^ |
---|
960 | :info:build vaulter.cc:370:19: note: instantiated from: |
---|
961 | :info:build ASSERT(blocks <= max_limit(blocks)); |
---|
962 | :info:build ^ |
---|
963 | :info:build In file included from vaulter.cc:10: |
---|
964 | :info:build ./rmath.h:215:11: warning: comparison of unsigned expression < 0 is always false [-Wtautological-compare] |
---|
965 | :info:build if ((num < 0) && (num == min_limit<T>())) { |
---|
966 | :info:build ~~~ ^ ~ |
---|
967 | :info:build ./rmath.h:297:10: note: in instantiation of function template specialization 'absolute<unsigned long>' requested here |
---|
968 | :info:build num = absolute(a_arg); |
---|
969 | :info:build ^ |
---|
970 | :info:build ./rmath.h:478:3: note: in instantiation of member function 'safe_num<unsigned long>::add' requested here |
---|
971 | :info:build add(a_class.value()); |
---|
972 | :info:build ^ |
---|
973 | :info:build ./rmath.h:670:9: note: in instantiation of member function 'safe_num<unsigned long>::add' requested here |
---|
974 | :info:build result.add(a_class2); |
---|
975 | :info:build ^ |
---|
976 | :info:build ./rmath.h:35:23: note: in instantiation of function template specialization 'operator+<unsigned long>' requested here |
---|
977 | :info:build tmp = (tmp * T(2)) + T(1); |
---|
978 | :info:build ^ |
---|
979 | :info:build ./rmath.h:121:10: note: in instantiation of function template specialization 'max_limit<safe_num<unsigned long> >' requested here |
---|
980 | :info:build value = max_limit<T>(); |
---|
981 | :info:build ^ |
---|
982 | :info:build vaulter.cc:370:2: note: in instantiation of function template specialization 'max_limit<safe_num<unsigned long> >' requested here |
---|
983 | :info:build ASSERT(blocks <= max_limit(blocks)); |
---|
984 | :info:build ^ |
---|
985 | :info:build ./asserts.h:9:23: note: instantiated from: |
---|
986 | :info:build #define ASSERT(code) assert(code) |
---|
987 | :info:build ^ |
---|
988 | :info:build vaulter.cc:370:2: note: instantiated from: |
---|
989 | :info:build ASSERT(blocks <= max_limit(blocks)); |
---|
990 | :info:build ^ |
---|
991 | :info:build vaulter.cc:370:19: note: instantiated from: |
---|
992 | :info:build ASSERT(blocks <= max_limit(blocks)); |
---|
993 | :info:build ^ |
---|
994 | :info:build In file included from vaulter.cc:10: |
---|
995 | :info:build ./rmath.h:225:10: warning: comparison of unsigned expression < 0 is always false [-Wtautological-compare] |
---|
996 | :info:build if (num < 0) { |
---|
997 | :info:build ~~~ ^ ~ |
---|
998 | :info:build ./rmath.h:227:11: warning: comparison of unsigned expression < 0 is always false [-Wtautological-compare] |
---|
999 | :info:build if (num < 0) { |
---|
1000 | :info:build ~~~ ^ ~ |
---|
1001 | :info:build ./rmath.h:329:13: warning: comparison of unsigned expression < 0 is always false [-Wtautological-compare] |
---|
1002 | :info:build if (a_arg < static_cast<T>(0)) { |
---|
1003 | :info:build ~~~~~ ^ ~~~~~~~~~~~~~~~~~ |
---|
1004 | :info:build ./rmath.h:298:4: note: in instantiation of member function 'safe_num<unsigned long>::subtract' requested here |
---|
1005 | :info:build subtract(num); |
---|
1006 | :info:build ^ |
---|
1007 | :info:build ./rmath.h:478:3: note: in instantiation of member function 'safe_num<unsigned long>::add' requested here |
---|
1008 | :info:build add(a_class.value()); |
---|
1009 | :info:build ^ |
---|
1010 | :info:build ./rmath.h:670:9: note: in instantiation of member function 'safe_num<unsigned long>::add' requested here |
---|
1011 | :info:build result.add(a_class2); |
---|
1012 | :info:build ^ |
---|
1013 | :info:build ./rmath.h:35:23: note: in instantiation of function template specialization 'operator+<unsigned long>' requested here |
---|
1014 | :info:build tmp = (tmp * T(2)) + T(1); |
---|
1015 | :info:build ^ |
---|
1016 | :info:build ./rmath.h:121:10: note: in instantiation of function template specialization 'max_limit<safe_num<unsigned long> >' requested here |
---|
1017 | :info:build value = max_limit<T>(); |
---|
1018 | :info:build ^ |
---|
1019 | :info:build vaulter.cc:370:2: note: in instantiation of function template specialization 'max_limit<safe_num<unsigned long> >' requested here |
---|
1020 | :info:build ASSERT(blocks <= max_limit(blocks)); |
---|
1021 | :info:build ^ |
---|
1022 | :info:build ./asserts.h:9:23: note: instantiated from: |
---|
1023 | :info:build #define ASSERT(code) assert(code) |
---|
1024 | :info:build ^ |
---|
1025 | :info:build vaulter.cc:370:2: note: instantiated from: |
---|
1026 | :info:build ASSERT(blocks <= max_limit(blocks)); |
---|
1027 | :info:build ^ |
---|
1028 | :info:build vaulter.cc:370:19: note: instantiated from: |
---|
1029 | :info:build ASSERT(blocks <= max_limit(blocks)); |
---|
1030 | :info:build ^ |
---|
1031 | :info:build In file included from vaulter.cc:10: |
---|
1032 | :info:build ./rmath.h:335:25: warning: comparison of unsigned expression < 0 is always false [-Wtautological-compare] |
---|
1033 | :info:build if (lowest_value<T>() < 0) { |
---|
1034 | :info:build ~~~~~~~~~~~~~~~~~ ^ ~ |
---|
1035 | :info:build ./rmath.h:96:14: warning: function 'max_limit<double>' has internal linkage but is not defined |
---|
1036 | :info:build const double max_limit<double>(); |
---|
1037 | :info:build ^ |
---|
1038 | :info:build ./rmath.h:178:11: note: used here |
---|
1039 | :info:build value = -max_limit<T>(); |
---|
1040 | :info:build ^ |
---|
1041 | :info:build ./rmath.h:106:14: warning: function 'min_limit<double>' has internal linkage but is not defined |
---|
1042 | :info:build const double min_limit<double>(); |
---|
1043 | :info:build ^ |
---|
1044 | :info:build ./rmath.h:179:14: note: used here |
---|
1045 | :info:build if (value > min_limit<T>()) |
---|
1046 | :info:build ^ |
---|
1047 | :info:build mv -f .deps/exec.Tpo .deps/exec.Po |
---|
1048 | :info:build /Developer/usr/bin/clang++ -DHAVE_CONFIG_H -I. -I/opt/local/include -MT help.o -MD -MP -MF .deps/help.Tpo -c -o help.o help.cc |
---|
1049 | :info:build mv -f .deps/help.Tpo .deps/help.Po |
---|
1050 | :info:build /Developer/usr/bin/clang++ -DHAVE_CONFIG_H -I. -I/opt/local/include -MT archiver.o -MD -MP -MF .deps/archiver.Tpo -c -o archiver.o archiver.cc |
---|
1051 | :info:build mv -f .deps/table.Tpo .deps/table.Po |
---|
1052 | :info:build /Developer/usr/bin/clang++ -DHAVE_CONFIG_H -I. -I/opt/local/include -MT cataloger.o -MD -MP -MF .deps/cataloger.Tpo -c -o cataloger.o cataloger.cc |
---|
1053 | :info:build 26 warnings generated. |
---|
1054 | :info:build mv -f .deps/vaulter.Tpo .deps/vaulter.Po |
---|
1055 | :info:build /Developer/usr/bin/clang++ -DHAVE_CONFIG_H -I. -I/opt/local/include -MT reporter.o -MD -MP -MF .deps/reporter.Tpo -c -o reporter.o reporter.cc |
---|
1056 | :info:build mv -f .deps/cataloger.Tpo .deps/cataloger.Po |
---|
1057 | :info:build /Developer/usr/bin/clang++ -DHAVE_CONFIG_H -I. -I/opt/local/include -MT rvm.o -MD -MP -MF .deps/rvm.Tpo -c -o rvm.o rvm.cc |
---|
1058 | :info:build In file included from reporter.cc:17: |
---|
1059 | :info:build In file included from ./strfmt.h:7: |
---|
1060 | :info:build ./rmath.h:96:14: warning: function 'max_limit<double>' has internal linkage but is not defined |
---|
1061 | :info:build const double max_limit<double>(); |
---|
1062 | :info:build ^ |
---|
1063 | :info:build ./rmath.h:178:11: note: used here |
---|
1064 | :info:build value = -max_limit<T>(); |
---|
1065 | :info:build ^ |
---|
1066 | :info:build ./rmath.h:106:14: warning: function 'min_limit<double>' has internal linkage but is not defined |
---|
1067 | :info:build const double min_limit<double>(); |
---|
1068 | :info:build ^ |
---|
1069 | :info:build ./rmath.h:179:14: note: used here |
---|
1070 | :info:build if (value > min_limit<T>()) |
---|
1071 | :info:build ^ |
---|
1072 | :info:build mv -f .deps/rvm.Tpo .deps/rvm.Po |
---|
1073 | :info:build /Developer/usr/bin/clang++ -DHAVE_CONFIG_H -I. -I/opt/local/include -MT test-types.o -MD -MP -MF .deps/test-types.Tpo -c -o test-types.o test-types.cc |
---|
1074 | :info:build 2 warnings generated. |
---|
1075 | :info:build mv -f .deps/test-types.Tpo .deps/test-types.Po |
---|
1076 | :info:build /Developer/usr/bin/clang++ -DHAVE_CONFIG_H -I. -I/opt/local/include -MT test-error.o -MD -MP -MF .deps/test-error.Tpo -c -o test-error.o test-error.cc |
---|
1077 | :info:build mv -f .deps/reporter.Tpo .deps/reporter.Po |
---|
1078 | :info:build /Developer/usr/bin/clang++ -DHAVE_CONFIG_H -I. -I/opt/local/include -MT test-estring.o -MD -MP -MF .deps/test-estring.Tpo -c -o test-estring.o test-estring.cc |
---|
1079 | :info:build mv -f .deps/archiver.Tpo .deps/archiver.Po |
---|
1080 | :info:build /Developer/usr/bin/clang++ -DHAVE_CONFIG_H -I. -I/opt/local/include -MT test-rmath.o -MD -MP -MF .deps/test-rmath.Tpo -c -o test-rmath.o test-rmath.cc |
---|
1081 | :info:build mv -f .deps/rconfig.Tpo .deps/rconfig.Po |
---|
1082 | :info:build /Developer/usr/bin/clang++ -DHAVE_CONFIG_H -I. -I/opt/local/include -MT test-strfmt.o -MD -MP -MF .deps/test-strfmt.Tpo -c -o test-strfmt.o test-strfmt.cc |
---|
1083 | :info:build mv -f .deps/test-error.Tpo .deps/test-error.Po |
---|
1084 | :info:build /Developer/usr/bin/clang++ -DHAVE_CONFIG_H -I. -I/opt/local/include -MT test-strfmt-001.o -MD -MP -MF .deps/test-strfmt-001.Tpo -c -o test-strfmt-001.o test-strfmt-001.cc |
---|
1085 | :info:build mv -f .deps/test-estring.Tpo .deps/test-estring.Po |
---|
1086 | :info:build /Developer/usr/bin/clang++ -DHAVE_CONFIG_H -I. -I/opt/local/include -MT test-strfmt-002.o -MD -MP -MF .deps/test-strfmt-002.Tpo -c -o test-strfmt-002.o test-strfmt-002.cc |
---|
1087 | :info:build In file included from test-rmath.cc:16: |
---|
1088 | :info:build ./rmath.h:296:13: warning: comparison of unsigned expression < 0 is always false [-Wtautological-compare] |
---|
1089 | :info:build if (a_arg < static_cast<T>(0)) { |
---|
1090 | :info:build ~~~~~ ^ ~~~~~~~~~~~~~~~~~ |
---|
1091 | :info:build ./rmath.h:726:10: note: in instantiation of member function 'safe_num<unsigned long>::add' requested here |
---|
1092 | :info:build a_class.add(static_cast<T>(1)); |
---|
1093 | :info:build ^ |
---|
1094 | :info:build test-rmath.cc:104:26: note: in instantiation of function template specialization 'operator++<unsigned long>' requested here |
---|
1095 | :info:build for (n1 = 0; n1 < 1250; ++n1) { |
---|
1096 | :info:build ^ |
---|
1097 | :info:build In file included from test-rmath.cc:16: |
---|
1098 | :info:build ./rmath.h:215:11: warning: comparison of unsigned expression < 0 is always false [-Wtautological-compare] |
---|
1099 | :info:build if ((num < 0) && (num == min_limit<T>())) { |
---|
1100 | :info:build ~~~ ^ ~ |
---|
1101 | :info:build ./rmath.h:297:10: note: in instantiation of function template specialization 'absolute<unsigned long>' requested here |
---|
1102 | :info:build num = absolute(a_arg); |
---|
1103 | :info:build ^ |
---|
1104 | :info:build ./rmath.h:726:10: note: in instantiation of member function 'safe_num<unsigned long>::add' requested here |
---|
1105 | :info:build a_class.add(static_cast<T>(1)); |
---|
1106 | :info:build ^ |
---|
1107 | :info:build test-rmath.cc:104:26: note: in instantiation of function template specialization 'operator++<unsigned long>' requested here |
---|
1108 | :info:build for (n1 = 0; n1 < 1250; ++n1) { |
---|
1109 | :info:build ^ |
---|
1110 | :info:build In file included from test-rmath.cc:16: |
---|
1111 | :info:build ./rmath.h:225:10: warning: comparison of unsigned expression < 0 is always false [-Wtautological-compare] |
---|
1112 | :info:build if (num < 0) { |
---|
1113 | :info:build ~~~ ^ ~ |
---|
1114 | :info:build ./rmath.h:227:11: warning: comparison of unsigned expression < 0 is always false [-Wtautological-compare] |
---|
1115 | :info:build if (num < 0) { |
---|
1116 | :info:build ~~~ ^ ~ |
---|
1117 | :info:build ./rmath.h:329:13: warning: comparison of unsigned expression < 0 is always false [-Wtautological-compare] |
---|
1118 | :info:build if (a_arg < static_cast<T>(0)) { |
---|
1119 | :info:build ~~~~~ ^ ~~~~~~~~~~~~~~~~~ |
---|
1120 | :info:build ./rmath.h:298:4: note: in instantiation of member function 'safe_num<unsigned long>::subtract' requested here |
---|
1121 | :info:build subtract(num); |
---|
1122 | :info:build ^ |
---|
1123 | :info:build ./rmath.h:726:10: note: in instantiation of member function 'safe_num<unsigned long>::add' requested here |
---|
1124 | :info:build a_class.add(static_cast<T>(1)); |
---|
1125 | :info:build ^ |
---|
1126 | :info:build test-rmath.cc:104:26: note: in instantiation of function template specialization 'operator++<unsigned long>' requested here |
---|
1127 | :info:build for (n1 = 0; n1 < 1250; ++n1) { |
---|
1128 | :info:build ^ |
---|
1129 | :info:build In file included from test-rmath.cc:16: |
---|
1130 | :info:build ./rmath.h:335:25: warning: comparison of unsigned expression < 0 is always false [-Wtautological-compare] |
---|
1131 | :info:build if (lowest_value<T>() < 0) { |
---|
1132 | :info:build ~~~~~~~~~~~~~~~~~ ^ ~ |
---|
1133 | :info:build In file included from test-strfmt.cc:11: |
---|
1134 | :info:build In file included from ./strfmt.h:7: |
---|
1135 | :info:build ./rmath.h:296:13: warning: comparison of unsigned expression < 0 is always false [-Wtautological-compare] |
---|
1136 | :info:build if (a_arg < static_cast<T>(0)) { |
---|
1137 | :info:build ~~~~~ ^ ~~~~~~~~~~~~~~~~~ |
---|
1138 | :info:build ./rmath.h:726:10: note: in instantiation of member function 'safe_num<unsigned long>::add' requested here |
---|
1139 | :info:build a_class.add(static_cast<T>(1)); |
---|
1140 | :info:build ^ |
---|
1141 | :info:build ./strfmt.h:54:35: note: in instantiation of function template specialization 'operator++<unsigned long>' requested here |
---|
1142 | :info:build for (tmp = 1; tmp < a_precision; ++tmp) { |
---|
1143 | :info:build ^ |
---|
1144 | :info:build test-strfmt.cc:43:2: note: in instantiation of function template specialization 'size_to_string<unsigned long>' requested here |
---|
1145 | :info:build TEST(str = size_to_string(ui64)); |
---|
1146 | :info:build ^ |
---|
1147 | :info:build test-strfmt.cc:43:13: note: instantiated from: |
---|
1148 | :info:build TEST(str = size_to_string(ui64)); |
---|
1149 | :info:build ^ |
---|
1150 | :info:build ./rmath.h:372:26: warning: comparison of unsigned expression < 0 is always false [-Wtautological-compare] |
---|
1151 | :info:build if ((lowest_value<T>() < 0) && (m_num < 0) && (a_arg < 0)) { |
---|
1152 | :info:build ~~~~~~~~~~~~~~~~~ ^ ~ |
---|
1153 | :info:build ./rmath.h:490:3: note: in instantiation of member function 'safe_num<unsigned long>::multiply' requested here |
---|
1154 | :info:build multiply(a_class.value()); |
---|
1155 | :info:build ^ |
---|
1156 | :info:build ./rmath.h:694:9: note: in instantiation of member function 'safe_num<unsigned long>::multiply' requested here |
---|
1157 | :info:build result.multiply(a_class2); |
---|
1158 | :info:build ^ |
---|
1159 | :info:build test-rmath.cc:107:4: note: in instantiation of function template specialization 'operator*<unsigned long>' requested here |
---|
1160 | :info:build TEST(false,num = n1 * n2);In file included from test-strfmt.cc: |
---|
1161 | :info:build ^ |
---|
1162 | :info:build test-rmath.cc:107:24: note: instantiated from: |
---|
1163 | :info:build TEST(false,num = n1 * n2); |
---|
1164 | :info:build ^ |
---|
1165 | :info:build In file included from test-rmath.cc:16: |
---|
1166 | :info:build ./rmath.h:372:41: warning: comparison of unsigned expression < 0 is always false [-Wtautological-compare] |
---|
1167 | :info:build if ((lowest_value<T>() < 0) && (m_num < 0) && (a_arg < 0)) { |
---|
1168 | :info:build ~~~~~ ^ ~ |
---|
1169 | :info:build ./rmath.h:372:56: warning: comparison of unsigned expression < 0 is always false [-Wtautological-compare] |
---|
1170 | :info:build if ((lowest_value<T>() < 0) && (m_num < 0) && (a_arg < 0)) { |
---|
1171 | :info:build ~~~~~ ^ ~ |
---|
1172 | :info:build ./rmath.h:379:26: warning: comparison of unsigned expression < 0 is always false [-Wtautological-compare] |
---|
1173 | :info:build if ((lowest_value<T>() < 0) && (m_num < 0) && (a_arg >= 0)) { |
---|
1174 | :info:build ~~~~~~~~~~~~~~~~~ ^ ~ |
---|
1175 | :info:build ./rmath.h:379:41: warning: comparison of unsigned expression < 0 is always false [-Wtautological-compare] |
---|
1176 | :info:build if ((lowest_value<T>() < 0) && (m_num < 0) && (a_arg >= 0)) { |
---|
1177 | :info:build ~~~~~ ^ ~ |
---|
1178 | :info:build ./rmath.h:379:56: warning: comparison of unsigned expression >= 0 is always true [-Wtautological-compare] |
---|
1179 | :info:build if ((lowest_value<T>() < 0) && (m_num < 0) && (a_arg >= 0)) { |
---|
1180 | :info:build ~~~~~ ^ ~ |
---|
1181 | :info:build ./rmath.h:384:26: warning: comparison of unsigned expression < 0 is always false [-Wtautological-compare] |
---|
1182 | :info:build if ((lowest_value<T>() < 0) && (m_num >= 0) && (a_arg < 0)) { |
---|
1183 | :info:build ~~~~~~~~~~~~~~~~~ ^ ~ |
---|
1184 | :info:build ./rmath.h:384:41: warning: comparison of unsigned expression >= 0 is always true [-Wtautological-compare] |
---|
1185 | :info:build if ((lowest_value<T>() < 0) && (m_num >= 0) && (a_arg < 0)) { |
---|
1186 | :info:build ~~~~~ ^ ~ |
---|
1187 | :info:build ./rmath.h:384:57: warning: comparison of unsigned expression < 0 is always false [-Wtautological-compare] |
---|
1188 | :info:build if ((lowest_value<T>() < 0) && (m_num >= 0) && (a_arg < 0)) { |
---|
1189 | :info:build ~~~~~ ^ ~ |
---|
1190 | :info:build ./rmath.h:389:26: warning: comparison of unsigned expression < 0 is always false [-Wtautological-compare] |
---|
1191 | :info:build if ((lowest_value<T>() < 0) && (m_num >= 0) && (a_arg >= 0)) { |
---|
1192 | :info:build ~~~~~~~~~~~~~~~~~ ^ ~ |
---|
1193 | :info:build ./rmath.h:389:41: warning: comparison of unsigned expression >= 0 is always true [-Wtautological-compare] |
---|
1194 | :info:build if ((lowest_value<T>() < 0) && (m_num >= 0) && (a_arg >= 0)) { |
---|
1195 | :info:build ~~~~~ ^ ~ |
---|
1196 | :info:build ./rmath.h:389:57: warning: comparison of unsigned expression >= 0 is always true [-Wtautological-compare] |
---|
1197 | :info:build if ((lowest_value<T>() < 0) && (m_num >= 0) && (a_arg >= 0)) { |
---|
1198 | :info:build ~~~~~ ^ ~ |
---|
1199 | :info:build ./rmath.h:394:26: warning: comparison of unsigned expression >= 0 is always true [-Wtautological-compare] |
---|
1200 | :info:build if ((lowest_value<T>() >= 0) && (m_num >= 0) && (a_arg >= 0)) { |
---|
1201 | :info:build ~~~~~~~~~~~~~~~~~ ^ ~ |
---|
1202 | :info:build ./rmath.h:394:42: warning: comparison of unsigned expression >= 0 is always true [-Wtautological-compare] |
---|
1203 | :info:build if ((lowest_value<T>() >= 0) && (m_num >= 0) && (a_arg >= 0)) { |
---|
1204 | :info:build ~~~~~ ^ ~ |
---|
1205 | :info:build ./rmath.h:394:58: warning: comparison of unsigned expression >= 0 is always true [-Wtautological-compare] |
---|
1206 | :info:build if ((lowest_value<T>() >= 0) && (m_num >= 0) && (a_arg >= 0)) { |
---|
1207 | :info:build ~~~~~ ^ ~ |
---|
1208 | :info:build 11: |
---|
1209 | :info:build In file included from ./strfmt.h:7: |
---|
1210 | :info:build ./rmath.h:215:11: warning: comparison of unsigned expression < 0 is always false [-Wtautological-compare] |
---|
1211 | :info:build if ((num < 0) && (num == min_limit<T>())) { |
---|
1212 | :info:build ~~~ ^ ~ |
---|
1213 | :info:build ./rmath.h:297:10: note: in instantiation of function template specialization 'absolute<unsigned long>' requested here |
---|
1214 | :info:build num = absolute(a_arg); |
---|
1215 | :info:build ^ |
---|
1216 | :info:build ./rmath.h:726:10: note: in instantiation of member function 'safe_num<unsigned long>::add' requested here |
---|
1217 | :info:build a_class.add(static_cast<T>(1)); |
---|
1218 | :info:build ^ |
---|
1219 | :info:build ./strfmt.h:54:35: note: in instantiation of function template specialization 'operator++<unsigned long>' requested here |
---|
1220 | :info:build for (tmp = 1; tmp < a_precision; ++tmp) { |
---|
1221 | :info:build ^ |
---|
1222 | :info:build test-strfmt.cc:43:2: note: in instantiation of function template specialization 'size_to_string<unsigned long>' requested here |
---|
1223 | :info:build TEST(str = size_to_string(ui64)); |
---|
1224 | :info:build ^ |
---|
1225 | :info:build test-strfmt.cc:43:13: note: instantiated from: |
---|
1226 | :info:build TEST(str = size_to_string(ui64)); |
---|
1227 | :info:build ^ |
---|
1228 | :info:build In file included from test-strfmt.cc:11: |
---|
1229 | :info:build In file included from ./strfmt.h:7: |
---|
1230 | :info:build ./rmath.h:225:10: warning: comparison of unsigned expression < 0 is always false [-Wtautological-compare] |
---|
1231 | :info:build if (num < 0) { |
---|
1232 | :info:build ~~~ ^ ~ |
---|
1233 | :info:build ./rmath.h:227:11: warning: comparison of unsigned expression < 0 is always false [-Wtautological-compare] |
---|
1234 | :info:build if (num < 0) { |
---|
1235 | :info:build ~~~ ^ ~ |
---|
1236 | :info:build ./rmath.h:329:13: warning: comparison of unsigned expression < 0 is always false [-Wtautological-compare] |
---|
1237 | :info:build if (a_arg < static_cast<T>(0)) { |
---|
1238 | :info:build ~~~~~ ^ ~~~~~~~~~~~~~~~~~ |
---|
1239 | :info:build ./rmath.h:298:4: note: in instantiation of member function 'safe_num<unsigned long>::subtract' requested here |
---|
1240 | :info:build subtract(num); |
---|
1241 | :info:build ^ |
---|
1242 | :info:build ./rmath.h:726:10: note: in instantiation of member function 'safe_num<unsigned long>::add' requested here |
---|
1243 | :info:build a_class.add(static_cast<T>(1)); |
---|
1244 | :info:build ^ |
---|
1245 | :info:build ./strfmt.h:54:35: note: in instantiation of function template specialization 'operator++<unsigned long>' requested here |
---|
1246 | :info:build for (tmp = 1; tmp < a_precision; ++tmp) { |
---|
1247 | :info:build ^ |
---|
1248 | :info:build test-strfmt.cc:43:2: note: in instantiation of function template specialization 'size_to_string<unsigned long>' requested here |
---|
1249 | :info:build TEST(str = size_to_string(ui64)); |
---|
1250 | :info:build ^ |
---|
1251 | :info:build test-strfmt.cc:43:13: note: instantiated from: |
---|
1252 | :info:build TEST(str = size_to_string(ui64)); |
---|
1253 | :info:build ^ |
---|
1254 | :info:build In file included from test-strfmt.cc:11: |
---|
1255 | :info:build In file included from ./strfmt.h:7: |
---|
1256 | :info:build ./rmath.h:335:25: warning: comparison of unsigned expression < 0 is always false [-Wtautological-compare] |
---|
1257 | :info:build if (lowest_value<T>() < 0) { |
---|
1258 | :info:build ~~~~~~~~~~~~~~~~~ ^ ~ |
---|
1259 | :info:build ./rmath.h:372:26: warning: comparison of unsigned expression < 0 is always false [-Wtautological-compare] |
---|
1260 | :info:build if ((lowest_value<T>() < 0) && (m_num < 0) && (a_arg < 0)) { |
---|
1261 | :info:build ~~~~~~~~~~~~~~~~~ ^ ~ |
---|
1262 | :info:build ./rmath.h:490:3: note: in instantiation of member function 'safe_num<unsigned long>::multiply' requested here |
---|
1263 | :info:build multiply(a_class.value()); |
---|
1264 | :info:build ^ |
---|
1265 | :info:build ./rmath.h:638:3: note: in instantiation of member function 'safe_num<unsigned long>::multiply' requested here |
---|
1266 | :info:build multiply(a_class); |
---|
1267 | :info:build ^ |
---|
1268 | :info:build ./strfmt.h:55:8: note: in instantiation of member function 'safe_num<unsigned long>::operator*=' requested here |
---|
1269 | :info:build rmul *= 10; |
---|
1270 | :info:build ^ |
---|
1271 | :info:build test-strfmt.cc:43:2: note: in instantiation of function template specialization 'size_to_string<unsigned long>' requested here |
---|
1272 | :info:build TEST(str = size_to_string(ui64)); |
---|
1273 | :info:build ^ |
---|
1274 | :info:build test-strfmt.cc:43:13: note: instantiated from: |
---|
1275 | :info:build TEST(str = size_to_string(ui64)); |
---|
1276 | :info:build ^ |
---|
1277 | :info:build In file included from test-strfmt.cc:11: |
---|
1278 | :info:build In file included from ./strfmt.h:7: |
---|
1279 | :info:build ./rmath.h:372:41: warning: comparison of unsigned expression < 0 is always false [-Wtautological-compare] |
---|
1280 | :info:build if ((lowest_value<T>() < 0) && (m_num < 0) && (a_arg < 0)) { |
---|
1281 | :info:build ~~~~~ ^ ~ |
---|
1282 | :info:build ./rmath.h:372:56: warning: comparison of unsigned expression < 0 is always false [-Wtautological-compare] |
---|
1283 | :info:build if ((lowest_value<T>() < 0) && (m_num < 0) && (a_arg < 0)) { |
---|
1284 | :info:build ~~~~~ ^ ~ |
---|
1285 | :info:build ./rmath.h:379:26: warning: comparison of unsigned expression < 0 is always false [-Wtautological-compare] |
---|
1286 | :info:build if ((lowest_value<T>() < 0) && (m_num < 0) && (a_arg >= 0)) { |
---|
1287 | :info:build ~~~~~~~~~~~~~~~~~ ^ ~ |
---|
1288 | :info:build ./rmath.h:379:41: warning: comparison of unsigned expression < 0 is always false [-Wtautological-compare] |
---|
1289 | :info:build if ((lowest_value<T>() < 0) && (m_num < 0) && (a_arg >= 0)) { |
---|
1290 | :info:build ~~~~~ ^ ~ |
---|
1291 | :info:build ./rmath.h:379:56: warning: comparison of unsigned expression >= 0 is always true [-Wtautological-compare] |
---|
1292 | :info:build if ((lowest_value<T>() < 0) && (m_num < 0) && (a_arg >= 0)) { |
---|
1293 | :info:build ~~~~~ ^ ~ |
---|
1294 | :info:build ./rmath.h:384:26: warning: comparison of unsigned expression < 0 is always false [-Wtautological-compare] |
---|
1295 | :info:build if ((lowest_value<T>() < 0) && (m_num >= 0) && (a_arg < 0)) { |
---|
1296 | :info:build ~~~~~~~~~~~~~~~~~ ^ ~ |
---|
1297 | :info:build ./rmath.h:384:41: warning: comparison of unsigned expression >= 0 is always true [-Wtautological-compare] |
---|
1298 | :info:build if ((lowest_value<T>() < 0) && (m_num >= 0) && (a_arg < 0)) { |
---|
1299 | :info:build ~~~~~ ^ ~ |
---|
1300 | :info:build ./rmath.h:384:57: warning: comparison of unsigned expression < 0 is always false [-Wtautological-compare] |
---|
1301 | :info:build if ((lowest_value<T>() < 0) && (m_num >= 0) && (a_arg < 0)) { |
---|
1302 | :info:build ~~~~~ ^ ~ |
---|
1303 | :info:build ./rmath.h:389:26: warning: comparison of unsigned expression < 0 is always false [-Wtautological-compare] |
---|
1304 | :info:build if ((lowest_value<T>() < 0) && (m_num >= 0) && (a_arg >= 0)) { |
---|
1305 | :info:build ~~~~~~~~~~~~~~~~~ ^ ~ |
---|
1306 | :info:build ./rmath.h:389:41: warning: comparison of unsigned expression >= 0 is always true [-Wtautological-compare] |
---|
1307 | :info:build if ((lowest_value<T>() < 0) && (m_num >= 0) && (a_arg >= 0)) { |
---|
1308 | :info:build ~~~~~ ^ ~ |
---|
1309 | :info:build ./rmath.h:389:57: warning: comparison of unsigned expression >= 0 is always true [-Wtautological-compare] |
---|
1310 | :info:build if ((lowest_value<T>() < 0) && (m_num >= 0) && (a_arg >= 0)) { |
---|
1311 | :info:build ~~~~~ ^ ~ |
---|
1312 | :info:build ./rmath.h:394:26: warning: comparison of unsigned expression >= 0 is always true [-Wtautological-compare] |
---|
1313 | :info:build if ((lowest_value<T>() >= 0) && (m_num >= 0) && (a_arg >= 0)) { |
---|
1314 | :info:build ~~~~~~~~~~~~~~~~~ ^ ~ |
---|
1315 | :info:build ./rmath.h:394:42: warning: comparison of unsigned expression >= 0 is always true [-Wtautological-compare] |
---|
1316 | :info:build if ((lowest_value<T>() >= 0) && (m_num >= 0) && (a_arg >= 0)) { |
---|
1317 | :info:build ~~~~~ ^ ~ |
---|
1318 | :info:build ./rmath.h:394:58: warning: comparison of unsigned expression >= 0 is always true [-Wtautological-compare] |
---|
1319 | :info:build if ((lowest_value<T>() >= 0) && (m_num >= 0) && (a_arg >= 0)) { |
---|
1320 | :info:build ~~~~~ ^ ~ |
---|
1321 | :info:build ./rmath.h:444:14: warning: comparison of unsigned expression < 0 is always false [-Wtautological-compare] |
---|
1322 | :info:build if ((m_num < 0) && (a_arg < 0) && (num < 0)) { |
---|
1323 | :info:build ~~~~~ ^ ~ |
---|
1324 | :info:build ./rmath.h:496:3: note: in instantiation of member function 'safe_num<unsigned long>::divide' requested here |
---|
1325 | :info:build divide(a_class.value()); |
---|
1326 | :info:build ^ |
---|
1327 | :info:build ./rmath.h:706:9: note: in instantiation of member function 'safe_num<unsigned long>::divide' requested here |
---|
1328 | :info:build result.divide(a_class2); |
---|
1329 | :info:build ^ |
---|
1330 | :info:build ./strfmt.h:58:3: note: in instantiation of function template specialization 'operator/<unsigned long>' requested here |
---|
1331 | :info:build TRY( |
---|
1332 | :info:build ^ |
---|
1333 | :info:build ./strfmt.h:66:21: note: instantiated from: |
---|
1334 | :info:build remainder = (tmp / safe_num<T>(a_kilo)) % rmul; |
---|
1335 | :info:build ^ |
---|
1336 | :info:build test-strfmt.cc:43:2: note: in instantiation of function template specialization 'size_to_string<unsigned long>' requested here |
---|
1337 | :info:build TEST(str = size_to_string(ui64)); |
---|
1338 | :info:build ^ |
---|
1339 | :info:build test-strfmt.cc:43:13: note: instantiated from: |
---|
1340 | :info:build TEST(str = size_to_string(ui64)); |
---|
1341 | :info:build ^ |
---|
1342 | :info:build In file included from test-strfmt.cc:11: |
---|
1343 | :info:build In file included from ./strfmt.h:7: |
---|
1344 | :info:build ./rmath.h:444:29: warning: comparison of unsigned expression < 0 is always false [-Wtautological-compare] |
---|
1345 | :info:build if ((m_num < 0) && (a_arg < 0) && (num < 0)) { |
---|
1346 | :info:build ~~~~~ ^ ~ |
---|
1347 | :info:build ./rmath.h:444:42: warning: comparison of unsigned expression < 0 is always false [-Wtautological-compare] |
---|
1348 | :info:build if ((m_num < 0) && (a_arg < 0) && (num < 0)) { |
---|
1349 | :info:build ~~~ ^ ~ |
---|
1350 | :info:build ./rmath.h:96:14: warning: function 'max_limit<double>' has internal linkage but is not defined |
---|
1351 | :info:build const double max_limit<double>(); |
---|
1352 | :info:build ^ |
---|
1353 | :info:build ./rmath.h:178:11: note: used here |
---|
1354 | :info:build value = -max_limit<T>(); |
---|
1355 | :info:build ^ |
---|
1356 | :info:build ./rmath.h:106:14: warning: function 'min_limit<double>' has internal linkage but is not defined |
---|
1357 | :info:build const double min_limit<double>(); |
---|
1358 | :info:build ^ |
---|
1359 | :info:build ./rmath.h:179:14: note: used here |
---|
1360 | :info:build if (value > min_limit<T>()) |
---|
1361 | :info:build ./rmath.h:444 ^ |
---|
1362 | :info:build :14: warning: comparison of unsigned expression < 0 is always false [-Wtautological-compare] |
---|
1363 | :info:build if ((m_num < 0) && (a_arg < 0) && (num < 0)) { |
---|
1364 | :info:build ~~~~~ ^ ~ |
---|
1365 | :info:build ./rmath.h:496:3: note: in instantiation of member function 'safe_num<unsigned long>::divide' requested here |
---|
1366 | :info:build divide(a_class.value()); |
---|
1367 | :info:build ^ |
---|
1368 | :info:build ./rmath.h:646:3: note: in instantiation of member function 'safe_num<unsigned long>::divide' requested here |
---|
1369 | :info:build divide(a_class); |
---|
1370 | :info:build ^ |
---|
1371 | :info:build test-rmath.cc:371:6: note: in instantiation of member function 'safe_num<unsigned long>::operator/=' requested here |
---|
1372 | :info:build num /= total; |
---|
1373 | :info:build ^ |
---|
1374 | :info:build In file included from test-rmath.cc:16: |
---|
1375 | :info:build ./rmath.h:444:29: warning: comparison of unsigned expression < 0 is always false [-Wtautological-compare] |
---|
1376 | :info:build if ((m_num < 0) && (a_arg < 0) && (num < 0)) { |
---|
1377 | :info:build ~~~~~ ^ ~ |
---|
1378 | :info:build ./rmath.h:444:42: warning: comparison of unsigned expression < 0 is always false [-Wtautological-compare] |
---|
1379 | :info:build if ((m_num < 0) && (a_arg < 0) && (num < 0)) { |
---|
1380 | :info:build ~~~ ^ ~ |
---|
1381 | :info:build ./rmath.h:82:13: warning: function 'max_limit<float>' has internal linkage but is not defined |
---|
1382 | :info:build const float max_limit<float>(); |
---|
1383 | :info:build ^ |
---|
1384 | :info:build test-rmath.cc:155:2: note: used here |
---|
1385 | :info:build assert(max_limit<float>() == FLT_MAX); |
---|
1386 | :info:build ^ |
---|
1387 | :info:build test-rmath.cc:155:9: note: instantiated from: |
---|
1388 | :info:build assert(max_limit<float>() == FLT_MAX); |
---|
1389 | :info:build ^ |
---|
1390 | :info:build In file included from test-rmath.cc:16: |
---|
1391 | :info:build ./rmath.h:92:13: warning: function 'min_limit<float>' has internal linkage but is not defined |
---|
1392 | :info:build const float min_limit<float>(); |
---|
1393 | :info:build ^ |
---|
1394 | :info:build test-rmath.cc:156:2: note: used here |
---|
1395 | :info:build assert(min_limit<float>() == FLT_MIN); |
---|
1396 | :info:build ^ |
---|
1397 | :info:build test-rmath.cc:156:9: note: instantiated from: |
---|
1398 | :info:build assert(min_limit<float>() == FLT_MIN); |
---|
1399 | :info:build ^ |
---|
1400 | :info:build In file included from test-rmath.cc:16: |
---|
1401 | :info:build ./rmath.h:96:14: warning: function 'max_limit<double>' has internal linkage but is not defined |
---|
1402 | :info:build const double max_limit<double>(); |
---|
1403 | :info:build ^ |
---|
1404 | :info:build test-rmath.cc:158:2: note: used here |
---|
1405 | :info:build assert(max_limit<double>() == DBL_MAX); |
---|
1406 | :info:build ^ |
---|
1407 | :info:build test-rmath.cc:158:9: note: instantiated from: |
---|
1408 | :info:build assert(max_limit<double>() == DBL_MAX); |
---|
1409 | :info:build ^ |
---|
1410 | :info:build In file included from test-rmath.cc:16: |
---|
1411 | :info:build ./rmath.h:106:14: warning: function 'min_limit<double>' has internal linkage but is not defined |
---|
1412 | :info:build const double min_limit<double>(); |
---|
1413 | :info:build ^ |
---|
1414 | :info:build test-rmath.cc:159:2: note: used here |
---|
1415 | :info:build assert(min_limit<double>() == DBL_MIN); |
---|
1416 | :info:build ^ |
---|
1417 | :info:build test-rmath.cc:159:9: note: instantiated from: |
---|
1418 | :info:build assert(min_limit<double>() == DBL_MIN); |
---|
1419 | :info:build ^ |
---|
1420 | :info:build In file included from test-strfmt-001.cc:10: |
---|
1421 | :info:build In file included from ./strfmt.h:7: |
---|
1422 | :info:build ./rmath.h:96:14: warning: function 'max_limit<double>' has internal linkage but is not defined |
---|
1423 | :info:build const double max_limit<double>(); |
---|
1424 | :info:build ^ |
---|
1425 | :info:build ./rmath.h:178:11: note: used here |
---|
1426 | :info:build value = -max_limit<T>(); |
---|
1427 | :info:build ^ |
---|
1428 | :info:build ./rmath.h:106:14: warning: function 'min_limit<double>' has internal linkage but is not defined |
---|
1429 | :info:build const double min_limit<double>(); |
---|
1430 | :info:build ^ |
---|
1431 | :info:build ./rmath.h:179:14: note: used here |
---|
1432 | :info:build if (value > min_limit<T>()) |
---|
1433 | :info:build ^ |
---|
1434 | :info:build 2 warnings generated. |
---|
1435 | :info:build mv -f .deps/test-strfmt-001.Tpo .deps/test-strfmt-001.Po |
---|
1436 | :info:build /Developer/usr/bin/clang++ -DHAVE_CONFIG_H -I. -I/opt/local/include -MT test-strfmt-003.o -MD -MP -MF .deps/test-strfmt-003.Tpo -c -o test-strfmt-003.o test-strfmt-003.cc |
---|
1437 | :info:build In file included from test-strfmt-002.cc:10: |
---|
1438 | :info:build In file included from ./strfmt.h:7: |
---|
1439 | :info:build ./rmath.h:96:14: warning: function 'max_limit<double>' has internal linkage but is not defined |
---|
1440 | :info:build const double max_limit<double>(); |
---|
1441 | :info:build ^ |
---|
1442 | :info:build ./rmath.h:178:11: note: used here |
---|
1443 | :info:build value = -max_limit<T>(); |
---|
1444 | :info:build ^ |
---|
1445 | :info:build ./rmath.h:106:14: warning: function 'min_limit<double>' has internal linkage but is not defined |
---|
1446 | :info:build const double min_limit<double>(); |
---|
1447 | :info:build ^ |
---|
1448 | :info:build ./rmath.h:179:14: note: used here |
---|
1449 | :info:build if (value > min_limit<T>()) |
---|
1450 | :info:build ^ |
---|
1451 | :info:build 2 warnings generated. |
---|
1452 | :info:build mv -f .deps/test-strfmt-002.Tpo .deps/test-strfmt-002.Po |
---|
1453 | :info:build /Developer/usr/bin/clang++ -DHAVE_CONFIG_H -I. -I/opt/local/include -MT test-strfmt-004.o -MD -MP -MF .deps/test-strfmt-004.Tpo -c -o test-strfmt-004.o test-strfmt-004.cc |
---|
1454 | :info:build 26 warnings generated. |
---|
1455 | :info:build mv -f .deps/test-strfmt.Tpo .deps/test-strfmt.Po |
---|
1456 | :info:build /Developer/usr/bin/clang++ -DHAVE_CONFIG_H -I. -I/opt/local/include -MT test-fs-cwd.o -MD -MP -MF .deps/test-fs-cwd.Tpo -c -o test-fs-cwd.o test-fs-cwd.cc |
---|
1457 | :info:build mv -f .deps/test-fs-cwd.Tpo .deps/test-fs-cwd.Po |
---|
1458 | :info:build /Developer/usr/bin/clang++ -DHAVE_CONFIG_H -I. -I/opt/local/include -MT test-tstamp.o -MD -MP -MF .deps/test-tstamp.Tpo -c -o test-tstamp.o test-tstamp.cc |
---|
1459 | :info:build 28 warnings generated. |
---|
1460 | :info:build mv -f .deps/test-rmath.Tpo .deps/test-rmath.Po |
---|
1461 | :info:build /Developer/usr/bin/clang++ -DHAVE_CONFIG_H -I. -I/opt/local/include -MT fdstream.o -MD -MP -MF .deps/fdstream.Tpo -c -o fdstream.o fdstream.cc |
---|
1462 | :info:build In file included from test-strfmt-003.cc:10: |
---|
1463 | :info:build In file included from ./strfmt.h:7: |
---|
1464 | :info:build ./rmath.h:96:14: warning: function 'max_limit<double>' has internal linkage but is not defined |
---|
1465 | :info:build const double max_limit<double>(); |
---|
1466 | :info:build ^ |
---|
1467 | :info:build ./rmath.h:178:11: note: used here |
---|
1468 | :info:build value = -max_limit<T>(); |
---|
1469 | :info:build ^ |
---|
1470 | :info:build ./rmath.h:106:14: warning: function 'min_limit<double>' has internal linkage but is not defined |
---|
1471 | :info:build const double min_limit<double>(); |
---|
1472 | :info:build ^ |
---|
1473 | :info:build ./rmath.h:179:14: note: used here |
---|
1474 | :info:build if (value > min_limit<T>()) |
---|
1475 | :info:build ^ |
---|
1476 | :info:build 2 warnings generated. |
---|
1477 | :info:build mv -f .deps/test-strfmt-003.Tpo .deps/test-strfmt-003.Po |
---|
1478 | :info:build /Developer/usr/bin/clang++ -DHAVE_CONFIG_H -I. -I/opt/local/include -MT test-exec.o -MD -MP -MF .deps/test-exec.Tpo -c -o test-exec.o test-exec.cc |
---|
1479 | :info:build In file included from test-strfmt-004.cc:10: |
---|
1480 | :info:build In file included from ./strfmt.h:7: |
---|
1481 | :info:build ./rmath.h:96:14: warning: function 'max_limit<double>' has internal linkage but is not defined |
---|
1482 | :info:build const double max_limit<double>(); |
---|
1483 | :info:build ^ |
---|
1484 | :info:build ./rmath.h:178:11: note: used here |
---|
1485 | :info:build value = -max_limit<T>(); |
---|
1486 | :info:build ^ |
---|
1487 | :info:build ./rmath.h:106:14: warning: function 'min_limit<double>' has internal linkage but is not defined |
---|
1488 | :info:build const double min_limit<double>(); |
---|
1489 | :info:build ^ |
---|
1490 | :info:build ./rmath.h:179:14: note: used here |
---|
1491 | :info:build if (value > min_limit<T>()) |
---|
1492 | :info:build ^ |
---|
1493 | :info:build 2 warnings generated. |
---|
1494 | :info:build mv -f .deps/test-strfmt-004.Tpo .deps/test-strfmt-004.Po |
---|
1495 | :info:build /Developer/usr/bin/clang++ -DHAVE_CONFIG_H -I. -I/opt/local/include -MT test-timer.o -MD -MP -MF .deps/test-timer.Tpo -c -o test-timer.o test-timer.cc |
---|
1496 | :info:build mv -f .deps/fdstream.Tpo .deps/fdstream.Po |
---|
1497 | :info:build mv -f .deps/test-tstamp.Tpo .deps/test-tstamp.Po |
---|
1498 | :info:build /Developer/usr/bin/clang++ -DHAVE_CONFIG_H -I. -I/opt/local/include -MT test-rconfig-setup.o -MD -MP -MF .deps/test-rconfig-setup.Tpo -c -o test-rconfig-setup.o test-rconfig-setup.cc |
---|
1499 | :info:build /Developer/usr/bin/clang++ -DHAVE_CONFIG_H -I. -I/opt/local/include -MT test-rconfig-001.o -MD -MP -MF .deps/test-rconfig-001.Tpo -c -o test-rconfig-001.o test-rconfig-001.cc |
---|
1500 | :info:build mv -f .deps/test-exec.Tpo .deps/test-exec.Po |
---|
1501 | :info:build /Developer/usr/bin/clang++ -DHAVE_CONFIG_H -I. -I/opt/local/include -MT test-rconfig-002.o -MD -MP -MF .deps/test-rconfig-002.Tpo -c -o test-rconfig-002.o test-rconfig-002.cc |
---|
1502 | :info:build mv -f .deps/test-timer.Tpo .deps/test-timer.Po |
---|
1503 | :info:build /Developer/usr/bin/clang++ -DHAVE_CONFIG_H -I. -I/opt/local/include -MT test-rconfig-003.o -MD -MP -MF .deps/test-rconfig-003.Tpo -c -o test-rconfig-003.o test-rconfig-003.cc |
---|
1504 | :info:build mv -f .deps/test-rconfig-001.Tpo .deps/test-rconfig-001.Po |
---|
1505 | :info:build /Developer/usr/bin/clang++ -DHAVE_CONFIG_H -I. -I/opt/local/include -MT test-rconfig-004.o -MD -MP -MF .deps/test-rconfig-004.Tpo -c -o test-rconfig-004.o test-rconfig-004.cc |
---|
1506 | :info:build mv -f .deps/test-rconfig-002.Tpo .deps/test-rconfig-002.Po |
---|
1507 | :info:build /Developer/usr/bin/clang++ -DHAVE_CONFIG_H -I. -I/opt/local/include -MT test-rconfig-005.o -MD -MP -MF .deps/test-rconfig-005.Tpo -c -o test-rconfig-005.o test-rconfig-005.cc |
---|
1508 | :info:build mv -f .deps/test-rconfig-setup.Tpo .deps/test-rconfig-setup.Po |
---|
1509 | :info:build /Developer/usr/bin/clang++ -DHAVE_CONFIG_H -I. -I/opt/local/include -MT test-rconfig-006.o -MD -MP -MF .deps/test-rconfig-006.Tpo -c -o test-rconfig-006.o test-rconfig-006.cc |
---|
1510 | :info:build mv -f .deps/test-rconfig-003.Tpo .deps/test-rconfig-003.Po |
---|
1511 | :info:build /Developer/usr/bin/clang++ -DHAVE_CONFIG_H -I. -I/opt/local/include -MT test-rconfig-007.o -MD -MP -MF .deps/test-rconfig-007.Tpo -c -o test-rconfig-007.o test-rconfig-007.cc |
---|
1512 | :info:build mv -f .deps/test-rconfig-004.Tpo .deps/test-rconfig-004.Po |
---|
1513 | :info:build /Developer/usr/bin/clang++ -DHAVE_CONFIG_H -I. -I/opt/local/include -MT test-rconfig-008.o -MD -MP -MF .deps/test-rconfig-008.Tpo -c -o test-rconfig-008.o test-rconfig-008.cc |
---|
1514 | :info:build mv -f .deps/test-rconfig-005.Tpo .deps/test-rconfig-005.Po |
---|
1515 | :info:build /Developer/usr/bin/clang++ -DHAVE_CONFIG_H -I. -I/opt/local/include -MT test-rconfig-009.o -MD -MP -MF .deps/test-rconfig-009.Tpo -c -o test-rconfig-009.o test-rconfig-009.cc |
---|
1516 | :info:build mv -f .deps/test-rconfig-006.Tpo .deps/test-rconfig-006.Po |
---|
1517 | :info:build /Developer/usr/bin/clang++ -DHAVE_CONFIG_H -I. -I/opt/local/include -MT test-rconfig-010.o -MD -MP -MF .deps/test-rconfig-010.Tpo -c -o test-rconfig-010.o test-rconfig-010.cc |
---|
1518 | :info:build mv -f .deps/test-rconfig-007.Tpo .deps/test-rconfig-007.Po |
---|
1519 | :info:build /Developer/usr/bin/clang++ -DHAVE_CONFIG_H -I. -I/opt/local/include -MT test-rconfig-011.o -MD -MP -MF .deps/test-rconfig-011.Tpo -c -o test-rconfig-011.o test-rconfig-011.cc |
---|
1520 | :info:build mv -f .deps/test-rconfig-008.Tpo .deps/test-rconfig-008.Po |
---|
1521 | :info:build /Developer/usr/bin/clang++ -DHAVE_CONFIG_H -I. -I/opt/local/include -MT test-rconfig-012.o -MD -MP -MF .deps/test-rconfig-012.Tpo -c -o test-rconfig-012.o test-rconfig-012.cc |
---|
1522 | :info:build mv -f .deps/test-rconfig-009.Tpo .deps/test-rconfig-009.Po |
---|
1523 | :info:build /Developer/usr/bin/clang++ -DHAVE_CONFIG_H -I. -I/opt/local/include -MT test-rconfig-013.o -MD -MP -MF .deps/test-rconfig-013.Tpo -c -o test-rconfig-013.o test-rconfig-013.cc |
---|
1524 | :info:build mv -f .deps/test-rconfig-010.Tpo .deps/test-rconfig-010.Po |
---|
1525 | :info:build /Developer/usr/bin/clang++ -DHAVE_CONFIG_H -I. -I/opt/local/include -MT test-rconfig-014.o -MD -MP -MF .deps/test-rconfig-014.Tpo -c -o test-rconfig-014.o test-rconfig-014.cc |
---|
1526 | :info:build mv -f .deps/test-rconfig-011.Tpo .deps/test-rconfig-011.Po |
---|
1527 | :info:build /Developer/usr/bin/clang++ -DHAVE_CONFIG_H -I. -I/opt/local/include -MT test-rconfig-015.o -MD -MP -MF .deps/test-rconfig-015.Tpo -c -o test-rconfig-015.o test-rconfig-015.cc |
---|
1528 | :info:build mv -f .deps/test-rconfig-012.Tpo .deps/test-rconfig-012.Po |
---|
1529 | :info:build /Developer/usr/bin/clang++ -DHAVE_CONFIG_H -I. -I/opt/local/include -MT test-rconfig-016.o -MD -MP -MF .deps/test-rconfig-016.Tpo -c -o test-rconfig-016.o test-rconfig-016.cc |
---|
1530 | :info:build mv -f .deps/test-rconfig-013.Tpo .deps/test-rconfig-013.Po |
---|
1531 | :info:build /Developer/usr/bin/clang++ -DHAVE_CONFIG_H -I. -I/opt/local/include -MT test-rconfig-017.o -MD -MP -MF .deps/test-rconfig-017.Tpo -c -o test-rconfig-017.o test-rconfig-017.cc |
---|
1532 | :info:build mv -f .deps/test-rconfig-014.Tpo .deps/test-rconfig-014.Po |
---|
1533 | :info:build /Developer/usr/bin/clang++ -DHAVE_CONFIG_H -I. -I/opt/local/include -MT test-rconfig-018.o -MD -MP -MF .deps/test-rconfig-018.Tpo -c -o test-rconfig-018.o test-rconfig-018.cc |
---|
1534 | :info:build mv -f .deps/test-rconfig-015.Tpo .deps/test-rconfig-015.Po |
---|
1535 | :info:build /Developer/usr/bin/clang++ -DHAVE_CONFIG_H -I. -I/opt/local/include -MT test-rconfig-019.o -MD -MP -MF .deps/test-rconfig-019.Tpo -c -o test-rconfig-019.o test-rconfig-019.cc |
---|
1536 | :info:build mv -f .deps/test-rconfig-016.Tpo .deps/test-rconfig-016.Po |
---|
1537 | :info:build /Developer/usr/bin/clang++ -DHAVE_CONFIG_H -I. -I/opt/local/include -MT test-rconfig-020.o -MD -MP -MF .deps/test-rconfig-020.Tpo -c -o test-rconfig-020.o test-rconfig-020.cc |
---|
1538 | :info:build mv -f .deps/test-rconfig-017.Tpo .deps/test-rconfig-017.Po |
---|
1539 | :info:build /Developer/usr/bin/clang++ -DHAVE_CONFIG_H -I. -I/opt/local/include -MT test-rconfig-021.o -MD -MP -MF .deps/test-rconfig-021.Tpo -c -o test-rconfig-021.o test-rconfig-021.cc |
---|
1540 | :info:build mv -f .deps/test-rconfig-018.Tpo .deps/test-rconfig-018.Po |
---|
1541 | :info:build /Developer/usr/bin/clang++ -DHAVE_CONFIG_H -I. -I/opt/local/include -MT test-rconfig-022.o -MD -MP -MF .deps/test-rconfig-022.Tpo -c -o test-rconfig-022.o test-rconfig-022.cc |
---|
1542 | :info:build mv -f .deps/test-rconfig-019.Tpo .deps/test-rconfig-019.Po |
---|
1543 | :info:build /Developer/usr/bin/clang++ -DHAVE_CONFIG_H -I. -I/opt/local/include -MT test-rconfig-023.o -MD -MP -MF .deps/test-rconfig-023.Tpo -c -o test-rconfig-023.o test-rconfig-023.cc |
---|
1544 | :info:build mv -f .deps/test-rconfig-020.Tpo .deps/test-rconfig-020.Po |
---|
1545 | :info:build /Developer/usr/bin/clang++ -DHAVE_CONFIG_H -I. -I/opt/local/include -MT test-rconfig-024.o -MD -MP -MF .deps/test-rconfig-024.Tpo -c -o test-rconfig-024.o test-rconfig-024.cc |
---|
1546 | :info:build mv -f .deps/test-rconfig-021.Tpo .deps/test-rconfig-021.Po |
---|
1547 | :info:build /Developer/usr/bin/clang++ -DHAVE_CONFIG_H -I. -I/opt/local/include -MT test-rconfig-025.o -MD -MP -MF .deps/test-rconfig-025.Tpo -c -o test-rconfig-025.o test-rconfig-025.cc |
---|
1548 | :info:build mv -f .deps/test-rconfig-022.Tpo .deps/test-rconfig-022.Po |
---|
1549 | :info:build /Developer/usr/bin/clang++ -DHAVE_CONFIG_H -I. -I/opt/local/include -MT test-rconfig-026.o -MD -MP -MF .deps/test-rconfig-026.Tpo -c -o test-rconfig-026.o test-rconfig-026.cc |
---|
1550 | :info:build mv -f .deps/test-rconfig-023.Tpo .deps/test-rconfig-023.Po |
---|
1551 | :info:build /Developer/usr/bin/clang++ -DHAVE_CONFIG_H -I. -I/opt/local/include -MT test-rconfig-027.o -MD -MP -MF .deps/test-rconfig-027.Tpo -c -o test-rconfig-027.o test-rconfig-027.cc |
---|
1552 | :info:build mv -f .deps/test-rconfig-024.Tpo .deps/test-rconfig-024.Po |
---|
1553 | :info:build /Developer/usr/bin/clang++ -DHAVE_CONFIG_H -I. -I/opt/local/include -MT test-rconfig-028.o -MD -MP -MF .deps/test-rconfig-028.Tpo -c -o test-rconfig-028.o test-rconfig-028.cc |
---|
1554 | :info:build mv -f .deps/test-rconfig-025.Tpo .deps/test-rconfig-025.Po |
---|
1555 | :info:build /Developer/usr/bin/clang++ -DHAVE_CONFIG_H -I. -I/opt/local/include -MT test-rconfig-029.o -MD -MP -MF .deps/test-rconfig-029.Tpo -c -o test-rconfig-029.o test-rconfig-029.cc |
---|
1556 | :info:build mv -f .deps/test-rconfig-026.Tpo .deps/test-rconfig-026.Po |
---|
1557 | :info:build /Developer/usr/bin/clang++ -DHAVE_CONFIG_H -I. -I/opt/local/include -MT test-rconfig-030.o -MD -MP -MF .deps/test-rconfig-030.Tpo -c -o test-rconfig-030.o test-rconfig-030.cc |
---|
1558 | :info:build mv -f .deps/test-rconfig-027.Tpo .deps/test-rconfig-027.Po |
---|
1559 | :info:build /Developer/usr/bin/clang++ -DHAVE_CONFIG_H -I. -I/opt/local/include -MT test-rconfig-031.o -MD -MP -MF .deps/test-rconfig-031.Tpo -c -o test-rconfig-031.o test-rconfig-031.cc |
---|
1560 | :info:build mv -f .deps/test-rconfig-028.Tpo .deps/test-rconfig-028.Po |
---|
1561 | :info:build /Developer/usr/bin/clang++ -DHAVE_CONFIG_H -I. -I/opt/local/include -MT test-rconfig-032.o -MD -MP -MF .deps/test-rconfig-032.Tpo -c -o test-rconfig-032.o test-rconfig-032.cc |
---|
1562 | :info:build mv -f .deps/test-rconfig-029.Tpo .deps/test-rconfig-029.Po |
---|
1563 | :info:build /Developer/usr/bin/clang++ -DHAVE_CONFIG_H -I. -I/opt/local/include -MT test-rconfig-033.o -MD -MP -MF .deps/test-rconfig-033.Tpo -c -o test-rconfig-033.o test-rconfig-033.cc |
---|
1564 | :info:build mv -f .deps/test-rconfig-030.Tpo .deps/test-rconfig-030.Po |
---|
1565 | :info:build /Developer/usr/bin/clang++ -DHAVE_CONFIG_H -I. -I/opt/local/include -MT test-rconfig-034.o -MD -MP -MF .deps/test-rconfig-034.Tpo -c -o test-rconfig-034.o test-rconfig-034.cc |
---|
1566 | :info:build mv -f .deps/test-rconfig-031.Tpo .deps/test-rconfig-031.Po |
---|
1567 | :info:build /Developer/usr/bin/clang++ -DHAVE_CONFIG_H -I. -I/opt/local/include -MT test-rconfig-035.o -MD -MP -MF .deps/test-rconfig-035.Tpo -c -o test-rconfig-035.o test-rconfig-035.cc |
---|
1568 | :info:build mv -f .deps/test-rconfig-032.Tpo .deps/test-rconfig-032.Po |
---|
1569 | :info:build /Developer/usr/bin/clang++ -DHAVE_CONFIG_H -I. -I/opt/local/include -MT test-rconfig-036.o -MD -MP -MF .deps/test-rconfig-036.Tpo -c -o test-rconfig-036.o test-rconfig-036.cc |
---|
1570 | :info:build mv -f .deps/test-rconfig-033.Tpo .deps/test-rconfig-033.Po |
---|
1571 | :info:build /Developer/usr/bin/clang++ -DHAVE_CONFIG_H -I. -I/opt/local/include -MT test-rconfig-037.o -MD -MP -MF .deps/test-rconfig-037.Tpo -c -o test-rconfig-037.o test-rconfig-037.cc |
---|
1572 | :info:build mv -f .deps/test-rconfig-034.Tpo .deps/test-rconfig-034.Po |
---|
1573 | :info:build /Developer/usr/bin/clang++ -DHAVE_CONFIG_H -I. -I/opt/local/include -MT test-rconfig-038.o -MD -MP -MF .deps/test-rconfig-038.Tpo -c -o test-rconfig-038.o test-rconfig-038.cc |
---|
1574 | :info:build mv -f .deps/test-rconfig-035.Tpo .deps/test-rconfig-035.Po |
---|
1575 | :info:build /Developer/usr/bin/clang++ -DHAVE_CONFIG_H -I. -I/opt/local/include -MT test-rconfig-039.o -MD -MP -MF .deps/test-rconfig-039.Tpo -c -o test-rconfig-039.o test-rconfig-039.cc |
---|
1576 | :info:build mv -f .deps/test-rconfig-036.Tpo .deps/test-rconfig-036.Po |
---|
1577 | :info:build /Developer/usr/bin/clang++ -DHAVE_CONFIG_H -I. -I/opt/local/include -MT test-rconfig-040.o -MD -MP -MF .deps/test-rconfig-040.Tpo -c -o test-rconfig-040.o test-rconfig-040.cc |
---|
1578 | :info:build mv -f .deps/test-rconfig-037.Tpo .deps/test-rconfig-037.Po |
---|
1579 | :info:build /Developer/usr/bin/clang++ -DHAVE_CONFIG_H -I. -I/opt/local/include -MT test-rconfig-041.o -MD -MP -MF .deps/test-rconfig-041.Tpo -c -o test-rconfig-041.o test-rconfig-041.cc |
---|
1580 | :info:build mv -f .deps/test-rconfig-040.Tpo .deps/test-rconfig-040.Po |
---|
1581 | :info:build /Developer/usr/bin/clang++ -DHAVE_CONFIG_H -I. -I/opt/local/include -MT test-rconfig-042.o -MD -MP -MF .deps/test-rconfig-042.Tpo -c -o test-rconfig-042.o test-rconfig-042.cc |
---|
1582 | :info:build mv -f .deps/test-rconfig-039.Tpo .deps/test-rconfig-039.Po |
---|
1583 | :info:build /Developer/usr/bin/clang++ -DHAVE_CONFIG_H -I. -I/opt/local/include -MT test-rconfig-043.o -MD -MP -MF .deps/test-rconfig-043.Tpo -c -o test-rconfig-043.o test-rconfig-043.cc |
---|
1584 | :info:build mv -f .deps/test-rconfig-038.Tpo .deps/test-rconfig-038.Po |
---|
1585 | :info:build /Developer/usr/bin/clang++ -DHAVE_CONFIG_H -I. -I/opt/local/include -MT test-rconfig-044.o -MD -MP -MF .deps/test-rconfig-044.Tpo -c -o test-rconfig-044.o test-rconfig-044.cc |
---|
1586 | :info:build mv -f .deps/test-rconfig-041.Tpo .deps/test-rconfig-041.Po |
---|
1587 | :info:build /Developer/usr/bin/clang++ -DHAVE_CONFIG_H -I. -I/opt/local/include -MT test-rconfig-045.o -MD -MP -MF .deps/test-rconfig-045.Tpo -c -o test-rconfig-045.o test-rconfig-045.cc |
---|
1588 | :info:build mv -f .deps/test-rconfig-044.Tpo .deps/test-rconfig-044.Po |
---|
1589 | :info:build /Developer/usr/bin/clang++ -DHAVE_CONFIG_H -I. -I/opt/local/include -MT test-rconfig-046.o -MD -MP -MF .deps/test-rconfig-046.Tpo -c -o test-rconfig-046.o test-rconfig-046.cc |
---|
1590 | :info:build mv -f .deps/test-rconfig-042.Tpo .deps/test-rconfig-042.Po |
---|
1591 | :info:build mv -f .deps/test-rconfig-043.Tpo .deps/test-rconfig-043.Po |
---|
1592 | :info:build /Developer/usr/bin/clang++ -DHAVE_CONFIG_H -I. -I/opt/local/include -MT test-rconfig-047.o -MD -MP -MF .deps/test-rconfig-047.Tpo -c -o test-rconfig-047.o test-rconfig-047.cc |
---|
1593 | :info:build /Developer/usr/bin/clang++ -DHAVE_CONFIG_H -I. -I/opt/local/include -MT test-rconfig-048.o -MD -MP -MF .deps/test-rconfig-048.Tpo -c -o test-rconfig-048.o test-rconfig-048.cc |
---|
1594 | :info:build mv -f .deps/test-rconfig-045.Tpo .deps/test-rconfig-045.Po |
---|
1595 | :info:build /Developer/usr/bin/clang++ -DHAVE_CONFIG_H -I. -I/opt/local/include -MT test-rconfig-049.o -MD -MP -MF .deps/test-rconfig-049.Tpo -c -o test-rconfig-049.o test-rconfig-049.cc |
---|
1596 | :info:build mv -f .deps/test-rconfig-046.Tpo .deps/test-rconfig-046.Po |
---|
1597 | :info:build /Developer/usr/bin/clang++ -DHAVE_CONFIG_H -I. -I/opt/local/include -MT test-rconfig-050.o -MD -MP -MF .deps/test-rconfig-050.Tpo -c -o test-rconfig-050.o test-rconfig-050.cc |
---|
1598 | :info:build mv -f .deps/test-rconfig-048.Tpo .deps/test-rconfig-048.Po |
---|
1599 | :info:build /Developer/usr/bin/clang++ -DHAVE_CONFIG_H -I. -I/opt/local/include -MT test-rconfig-051.o -MD -MP -MF .deps/test-rconfig-051.Tpo -c -o test-rconfig-051.o test-rconfig-051.cc |
---|
1600 | :info:build mv -f .deps/test-rconfig-047.Tpo .deps/test-rconfig-047.Po |
---|
1601 | :info:build /Developer/usr/bin/clang++ -DHAVE_CONFIG_H -I. -I/opt/local/include -MT test-rconfig-052.o -MD -MP -MF .deps/test-rconfig-052.Tpo -c -o test-rconfig-052.o test-rconfig-052.cc |
---|
1602 | :info:build mv -f .deps/test-rconfig-049.Tpo .deps/test-rconfig-049.Po |
---|
1603 | :info:build /Developer/usr/bin/clang++ -DHAVE_CONFIG_H -I. -I/opt/local/include -MT test-rconfig-053.o -MD -MP -MF .deps/test-rconfig-053.Tpo -c -o test-rconfig-053.o test-rconfig-053.cc |
---|
1604 | :info:build mv -f .deps/test-rconfig-050.Tpo .deps/test-rconfig-050.Po |
---|
1605 | :info:build /Developer/usr/bin/clang++ -DHAVE_CONFIG_H -I. -I/opt/local/include -MT test-rconfig-054.o -MD -MP -MF .deps/test-rconfig-054.Tpo -c -o test-rconfig-054.o test-rconfig-054.cc |
---|
1606 | :info:build mv -f .deps/test-rconfig-051.Tpo .deps/test-rconfig-051.Po |
---|
1607 | :info:build /Developer/usr/bin/clang++ -DHAVE_CONFIG_H -I. -I/opt/local/include -MT test-rconfig-055.o -MD -MP -MF .deps/test-rconfig-055.Tpo -c -o test-rconfig-055.o test-rconfig-055.cc |
---|
1608 | :info:build mv -f .deps/test-rconfig-052.Tpo .deps/test-rconfig-052.Po |
---|
1609 | :info:build /Developer/usr/bin/clang++ -DHAVE_CONFIG_H -I. -I/opt/local/include -MT test-rconfig-056.o -MD -MP -MF .deps/test-rconfig-056.Tpo -c -o test-rconfig-056.o test-rconfig-056.cc |
---|
1610 | :info:build mv -f .deps/test-rconfig-053.Tpo .deps/test-rconfig-053.Po |
---|
1611 | :info:build /Developer/usr/bin/clang++ -DHAVE_CONFIG_H -I. -I/opt/local/include -MT test-logger.o -MD -MP -MF .deps/test-logger.Tpo -c -o test-logger.o test-logger.cc |
---|
1612 | :info:build mv -f .deps/test-rconfig-054.Tpo .deps/test-rconfig-054.Po |
---|
1613 | :info:build /Developer/usr/bin/clang++ -DHAVE_CONFIG_H -I. -I/opt/local/include -MT test-table.o -MD -MP -MF .deps/test-table.Tpo -c -o test-table.o test-table.cc |
---|
1614 | :info:build mv -f .deps/test-rconfig-056.Tpo .deps/test-rconfig-056.Po |
---|
1615 | :info:build mv -f .deps/test-rconfig-055.Tpo .deps/test-rconfig-055.Po |
---|
1616 | :info:build /Developer/usr/bin/clang++ -DHAVE_CONFIG_H -I. -I/opt/local/include -MT test-vaulter-setup.o -MD -MP -MF .deps/test-vaulter-setup.Tpo -c -o test-vaulter-setup.o test-vaulter-setup.cc |
---|
1617 | :info:build /Developer/usr/bin/clang++ -DHAVE_CONFIG_H -I. -I/opt/local/include -MT test-vaulter-001.o -MD -MP -MF .deps/test-vaulter-001.Tpo -c -o test-vaulter-001.o test-vaulter-001.cc |
---|
1618 | :info:build mv -f .deps/test-logger.Tpo .deps/test-logger.Po |
---|
1619 | :info:build /Developer/usr/bin/clang++ -DHAVE_CONFIG_H -I. -I/opt/local/include -MT test-vaulter-002.o -MD -MP -MF .deps/test-vaulter-002.Tpo -c -o test-vaulter-002.o test-vaulter-002.cc |
---|
1620 | :info:build mv -f .deps/test-vaulter-001.Tpo .deps/test-vaulter-001.Po |
---|
1621 | :info:build /Developer/usr/bin/clang++ -DHAVE_CONFIG_H -I. -I/opt/local/include -MT test-vaulter-003.o -MD -MP -MF .deps/test-vaulter-003.Tpo -c -o test-vaulter-003.o test-vaulter-003.cc |
---|
1622 | :info:build mv -f .deps/test-vaulter-setup.Tpo .deps/test-vaulter-setup.Po |
---|
1623 | :info:build /Developer/usr/bin/clang++ -DHAVE_CONFIG_H -I. -I/opt/local/include -MT test-vaulter-004.o -MD -MP -MF .deps/test-vaulter-004.Tpo -c -o test-vaulter-004.o test-vaulter-004.cc |
---|
1624 | :info:build mv -f .deps/test-table.Tpo .deps/test-table.Po |
---|
1625 | :info:build /Developer/usr/bin/clang++ -DHAVE_CONFIG_H -I. -I/opt/local/include -MT test-vaulter-005.o -MD -MP -MF .deps/test-vaulter-005.Tpo -c -o test-vaulter-005.o test-vaulter-005.cc |
---|
1626 | :info:build mv -f .deps/test-vaulter-002.Tpo .deps/test-vaulter-002.Po |
---|
1627 | :info:build /Developer/usr/bin/clang++ -DHAVE_CONFIG_H -I. -I/opt/local/include -MT test-vaulter-006.o -MD -MP -MF .deps/test-vaulter-006.Tpo -c -o test-vaulter-006.o test-vaulter-006.cc |
---|
1628 | :info:build mv -f .deps/test-vaulter-003.Tpo .deps/test-vaulter-003.Po |
---|
1629 | :info:build /Developer/usr/bin/clang++ -DHAVE_CONFIG_H -I. -I/opt/local/include -MT test-rvm-001.o -MD -MP -MF .deps/test-rvm-001.Tpo -c -o test-rvm-001.o test-rvm-001.cc |
---|
1630 | :info:build mv -f .deps/test-vaulter-004.Tpo .deps/test-vaulter-004.Po |
---|
1631 | :info:build /Developer/usr/bin/clang++ -DHAVE_CONFIG_H -I. -I/opt/local/include -MT test-rvm-002.o -MD -MP -MF .deps/test-rvm-002.Tpo -c -o test-rvm-002.o test-rvm-002.cc |
---|
1632 | :info:build mv -f .deps/test-vaulter-005.Tpo .deps/test-vaulter-005.Po |
---|
1633 | :info:build /Developer/usr/bin/clang++ -DHAVE_CONFIG_H -I. -I/opt/local/include -MT test-rvm-003.o -MD -MP -MF .deps/test-rvm-003.Tpo -c -o test-rvm-003.o test-rvm-003.cc |
---|
1634 | :info:build mv -f .deps/test-vaulter-006.Tpo .deps/test-vaulter-006.Po |
---|
1635 | :info:build /Developer/usr/bin/clang++ -L/opt/local/lib -arch x86_64 -o rvm types.o rmath.o error.o estring.o fs.o tstamp.o rconfig.o timer.o logger.o estat.o vaulter.o exec.o table.o help.o archiver.o cataloger.o reporter.o rvm.o |
---|
1636 | :info:build Undefined symbols for architecture x86_64: |
---|
1637 | :info:build "__ZL9min_limitIdEKT_v", referenced from: |
---|
1638 | :info:build __ZL12lowest_valueIdEKT_v in timer.o |
---|
1639 | :info:build double absolute<double>(double const&) in timer.o |
---|
1640 | :info:build __ZL12lowest_valueIdEKT_v in vaulter.o |
---|
1641 | :info:build __ZL12lowest_valueIdEKT_v in reporter.o |
---|
1642 | :info:build "__ZL9max_limitIdEKT_v", referenced from: |
---|
1643 | :info:build __ZL12lowest_valueIdEKT_v in timer.o |
---|
1644 | :info:build __ZL13highest_valueIdEKT_v in timer.o |
---|
1645 | :info:build __ZL12lowest_valueIdEKT_v in vaulter.o |
---|
1646 | :info:build __ZL13highest_valueIdEKT_v in vaulter.o |
---|
1647 | :info:build __ZL12lowest_valueIdEKT_v in reporter.o |
---|
1648 | :info:build __ZL13highest_valueIdEKT_v in reporter.o |
---|
1649 | :info:build ld: symbol(s) not found for architecture x86_64 |
---|
1650 | :info:build clang: error: linker command failed with exit code 1 (use -v to see invocation) |
---|
1651 | :info:build make[1]: *** [rvm] Error 1 |
---|
1652 | :info:build make[1]: *** Waiting for unfinished jobs.... |
---|
1653 | :info:build mv -f .deps/test-rvm-002.Tpo .deps/test-rvm-002.Po |
---|
1654 | :info:build mv -f .deps/test-rvm-001.Tpo .deps/test-rvm-001.Po |
---|
1655 | :info:build mv -f .deps/test-rvm-003.Tpo .deps/test-rvm-003.Po |
---|
1656 | :info:build make[1]: Leaving directory `/opt/local/var/macports/build/_opt_local_var_macports_sources_rsync.macports.org_release_ports_sysutils_rvm/rvm/work/rvm-1.05' |
---|
1657 | :info:build make: *** [all] Error 2 |
---|
1658 | :info:build make: Leaving directory `/opt/local/var/macports/build/_opt_local_var_macports_sources_rsync.macports.org_release_ports_sysutils_rvm/rvm/work/rvm-1.05' |
---|
1659 | :info:build shell command " cd "/opt/local/var/macports/build/_opt_local_var_macports_sources_rsync.macports.org_release_ports_sysutils_rvm/rvm/work/rvm-1.05" && /usr/bin/make -j4 -w all " returned error 2 |
---|
1660 | :error:build Target org.macports.build returned: shell command failed (see log for details) |
---|
1661 | :debug:build Backtrace: shell command failed (see log for details) |
---|
1662 | while executing |
---|
1663 | "command_exec build" |
---|
1664 | (procedure "portbuild::build_main" line 8) |
---|
1665 | invoked from within |
---|
1666 | "$procedure $targetname" |
---|
1667 | :info:build Warning: the following items did not execute (for rvm): org.macports.activate org.macports.build org.macports.destroot org.macports.install |
---|
1668 | :notice:build Log for rvm is at: /opt/local/var/macports/logs/_opt_local_var_macports_sources_rsync.macports.org_release_ports_sysutils_rvm/rvm/main.log |
---|