1 | version:1 |
---|
2 | :debug:main epoch: in tree: 0 installed: 0 |
---|
3 | :debug:main file 5.24_0 exists in the ports tree |
---|
4 | :debug:main file 5.24_0 is the latest installed |
---|
5 | :debug:main file 5.24_0 is active |
---|
6 | :debug:main Merging existing variants '' into variants |
---|
7 | :debug:main new fully merged portvariants: |
---|
8 | :debug:main Changing to port directory: /opt/local/var/macports/sources/rsync.macports.org/release/tarballs/ports/sysutils/file |
---|
9 | :debug:main OS darwin/14.4.0 (Mac OS X 10.10) arch i386 |
---|
10 | :debug:main adding the default universal variant |
---|
11 | :debug:main Reading variant descriptions from /opt/local/var/macports/sources/rsync.macports.org/release/tarballs/ports/_resources/port1.0/variant_descriptions.conf |
---|
12 | :debug:main Running callback portconfigure::add_automatic_compiler_dependencies |
---|
13 | :debug:main Finished running callback portconfigure::add_automatic_compiler_dependencies |
---|
14 | :debug:main Running callback portbuild::add_automatic_buildsystem_dependencies |
---|
15 | :debug:main Finished running callback portbuild::add_automatic_buildsystem_dependencies |
---|
16 | :debug:main No need to upgrade! file 5.24_0 >= file 5.24_0 |
---|
17 | :debug:main epoch: in tree: 0 installed: 0 |
---|
18 | :debug:main zlib 1.2.8_0 exists in the ports tree |
---|
19 | :debug:main zlib 1.2.8_0 is the latest installed |
---|
20 | :debug:main zlib 1.2.8_0 is active |
---|
21 | :debug:main Merging existing variants '' into variants |
---|
22 | :debug:main new fully merged portvariants: |
---|
23 | :debug:main Changing to port directory: /opt/local/var/macports/sources/rsync.macports.org/release/tarballs/ports/archivers/zlib |
---|
24 | :debug:main OS darwin/14.4.0 (Mac OS X 10.10) arch i386 |
---|
25 | :debug:main Sourcing PortGroup xcodeversion 1.0 from /opt/local/var/macports/sources/rsync.macports.org/release/tarballs/ports/_resources/port1.0/group/xcodeversion-1.0.tcl |
---|
26 | :debug:main adding the default universal variant |
---|
27 | :debug:main Reading variant descriptions from /opt/local/var/macports/sources/rsync.macports.org/release/tarballs/ports/_resources/port1.0/variant_descriptions.conf |
---|
28 | :debug:main Running callback portconfigure::add_automatic_compiler_dependencies |
---|
29 | :debug:main Finished running callback portconfigure::add_automatic_compiler_dependencies |
---|
30 | :debug:main Running callback portbuild::add_automatic_buildsystem_dependencies |
---|
31 | :debug:main Finished running callback portbuild::add_automatic_buildsystem_dependencies |
---|
32 | :debug:main No need to upgrade! zlib 1.2.8_0 >= zlib 1.2.8_0 |
---|
33 | :debug:main epoch: in tree: 0 installed: 0 |
---|
34 | :debug:main libmagic 5.24_0 exists in the ports tree |
---|
35 | :debug:main libmagic 5.24_0 is the latest installed |
---|
36 | :debug:main libmagic 5.24_0 is active |
---|
37 | :debug:main Merging existing variants '' into variants |
---|
38 | :debug:main new fully merged portvariants: |
---|
39 | :debug:main Changing to port directory: /opt/local/var/macports/sources/rsync.macports.org/release/tarballs/ports/sysutils/file |
---|
40 | :debug:main OS darwin/14.4.0 (Mac OS X 10.10) arch i386 |
---|
41 | :debug:main adding the default universal variant |
---|
42 | :debug:main Reading variant descriptions from /opt/local/var/macports/sources/rsync.macports.org/release/tarballs/ports/_resources/port1.0/variant_descriptions.conf |
---|
43 | :debug:main Running callback portconfigure::add_automatic_compiler_dependencies |
---|
44 | :debug:main Finished running callback portconfigure::add_automatic_compiler_dependencies |
---|
45 | :debug:main Running callback portbuild::add_automatic_buildsystem_dependencies |
---|
46 | :debug:main Finished running callback portbuild::add_automatic_buildsystem_dependencies |
---|
47 | :debug:main No need to upgrade! libmagic 5.24_0 >= libmagic 5.24_0 |
---|
48 | :debug:main epoch: in tree: 0 installed: 0 |
---|
49 | :debug:main perl5.16 5.16.3_1 exists in the ports tree |
---|
50 | :debug:main perl5.16 5.16.3_1 is the latest installed |
---|
51 | :debug:main perl5.16 5.16.3_1 is active |
---|
52 | :debug:main Merging existing variants '' into variants |
---|
53 | :debug:main new fully merged portvariants: |
---|
54 | :debug:main Changing to port directory: /opt/local/var/macports/sources/rsync.macports.org/release/tarballs/ports/lang/perl5.16 |
---|
55 | :debug:main OS darwin/14.4.0 (Mac OS X 10.10) arch i386 |
---|
56 | :debug:main adding the default universal variant |
---|
57 | :debug:main Reading variant descriptions from /opt/local/var/macports/sources/rsync.macports.org/release/tarballs/ports/_resources/port1.0/variant_descriptions.conf |
---|
58 | :debug:main Running callback portconfigure::add_automatic_compiler_dependencies |
---|
59 | :debug:main Finished running callback portconfigure::add_automatic_compiler_dependencies |
---|
60 | :debug:main Running callback portbuild::add_automatic_buildsystem_dependencies |
---|
61 | :debug:main Finished running callback portbuild::add_automatic_buildsystem_dependencies |
---|
62 | :debug:main No need to upgrade! perl5.16 5.16.3_1 >= perl5.16 5.16.3_1 |
---|
63 | :debug:main epoch: in tree: 0 installed: 0 |
---|
64 | :debug:main gdbm 1.11_1 exists in the ports tree |
---|
65 | :debug:main gdbm 1.11_1 is the latest installed |
---|
66 | :debug:main gdbm 1.11_1 is active |
---|
67 | :debug:main Merging existing variants '' into variants |
---|
68 | :debug:main new fully merged portvariants: |
---|
69 | :debug:main Changing to port directory: /opt/local/var/macports/sources/rsync.macports.org/release/tarballs/ports/databases/gdbm |
---|
70 | :debug:main OS darwin/14.4.0 (Mac OS X 10.10) arch i386 |
---|
71 | :debug:main adding the default universal variant |
---|
72 | :debug:main Reading variant descriptions from /opt/local/var/macports/sources/rsync.macports.org/release/tarballs/ports/_resources/port1.0/variant_descriptions.conf |
---|
73 | :debug:main Running callback portconfigure::add_automatic_compiler_dependencies |
---|
74 | :debug:main Finished running callback portconfigure::add_automatic_compiler_dependencies |
---|
75 | :debug:main Running callback portbuild::add_automatic_buildsystem_dependencies |
---|
76 | :debug:main Finished running callback portbuild::add_automatic_buildsystem_dependencies |
---|
77 | :debug:main No need to upgrade! gdbm 1.11_1 >= gdbm 1.11_1 |
---|
78 | :debug:main epoch: in tree: 2 installed: 2 |
---|
79 | :debug:main gettext 0.19.5_0 exists in the ports tree |
---|
80 | :debug:main gettext 0.19.5_0 is the latest installed |
---|
81 | :debug:main gettext 0.19.5_0 is active |
---|
82 | :debug:main Merging existing variants '' into variants |
---|
83 | :debug:main new fully merged portvariants: |
---|
84 | :debug:main Changing to port directory: /opt/local/var/macports/sources/rsync.macports.org/release/tarballs/ports/devel/gettext |
---|
85 | :debug:main OS darwin/14.4.0 (Mac OS X 10.10) arch i386 |
---|
86 | :debug:main Sourcing PortGroup compiler_blacklist_versions 1.0 from /opt/local/var/macports/sources/rsync.macports.org/release/tarballs/ports/_resources/port1.0/group/compiler_blacklist_versions-1.0.tcl |
---|
87 | :debug:main Reading variant descriptions from /opt/local/var/macports/sources/rsync.macports.org/release/tarballs/ports/_resources/port1.0/variant_descriptions.conf |
---|
88 | :debug:main Sourcing PortGroup muniversal 1.0 from /opt/local/var/macports/sources/rsync.macports.org/release/tarballs/ports/_resources/port1.0/group/muniversal-1.0.tcl |
---|
89 | :debug:main compiler clang 602.0.53 not blacklisted because it doesn't match {clang < 211.10.1} |
---|
90 | :debug:main universal variant already exists, so not adding the default one |
---|
91 | :debug:main Running callback portconfigure::add_automatic_compiler_dependencies |
---|
92 | :debug:main Finished running callback portconfigure::add_automatic_compiler_dependencies |
---|
93 | :debug:main Running callback portbuild::add_automatic_buildsystem_dependencies |
---|
94 | :debug:main Finished running callback portbuild::add_automatic_buildsystem_dependencies |
---|
95 | :debug:main No need to upgrade! gettext 0.19.5_0 >= gettext 0.19.5_0 |
---|
96 | :debug:main epoch: in tree: 0 installed: 0 |
---|
97 | :debug:main expat 2.1.0_0 exists in the ports tree |
---|
98 | :debug:main expat 2.1.0_0 is the latest installed |
---|
99 | :debug:main expat 2.1.0_0 is active |
---|
100 | :debug:main Merging existing variants '' into variants |
---|
101 | :debug:main new fully merged portvariants: |
---|
102 | :debug:main Changing to port directory: /opt/local/var/macports/sources/rsync.macports.org/release/tarballs/ports/textproc/expat |
---|
103 | :debug:main OS darwin/14.4.0 (Mac OS X 10.10) arch i386 |
---|
104 | :debug:main adding the default universal variant |
---|
105 | :debug:main Reading variant descriptions from /opt/local/var/macports/sources/rsync.macports.org/release/tarballs/ports/_resources/port1.0/variant_descriptions.conf |
---|
106 | :debug:main Running callback portconfigure::add_automatic_compiler_dependencies |
---|
107 | :debug:main Finished running callback portconfigure::add_automatic_compiler_dependencies |
---|
108 | :debug:main Running callback portbuild::add_automatic_buildsystem_dependencies |
---|
109 | :debug:main Finished running callback portbuild::add_automatic_buildsystem_dependencies |
---|
110 | :debug:main No need to upgrade! expat 2.1.0_0 >= expat 2.1.0_0 |
---|
111 | :debug:main epoch: in tree: 0 installed: 0 |
---|
112 | :debug:main libiconv 1.14_0 exists in the ports tree |
---|
113 | :debug:main libiconv 1.14_0 is the latest installed |
---|
114 | :debug:main libiconv 1.14_0 is active |
---|
115 | :debug:main Merging existing variants '' into variants |
---|
116 | :debug:main new fully merged portvariants: |
---|
117 | :debug:main Changing to port directory: /opt/local/var/macports/sources/rsync.macports.org/release/tarballs/ports/textproc/libiconv |
---|
118 | :debug:main OS darwin/14.4.0 (Mac OS X 10.10) arch i386 |
---|
119 | :debug:main Reading variant descriptions from /opt/local/var/macports/sources/rsync.macports.org/release/tarballs/ports/_resources/port1.0/variant_descriptions.conf |
---|
120 | :debug:main Sourcing PortGroup muniversal 1.0 from /opt/local/var/macports/sources/rsync.macports.org/release/tarballs/ports/_resources/port1.0/group/muniversal-1.0.tcl |
---|
121 | :debug:main universal variant already exists, so not adding the default one |
---|
122 | :debug:main Running callback portconfigure::add_automatic_compiler_dependencies |
---|
123 | :debug:main Finished running callback portconfigure::add_automatic_compiler_dependencies |
---|
124 | :debug:main Running callback portbuild::add_automatic_buildsystem_dependencies |
---|
125 | :debug:main Finished running callback portbuild::add_automatic_buildsystem_dependencies |
---|
126 | :debug:main No need to upgrade! libiconv 1.14_0 >= libiconv 1.14_0 |
---|
127 | :debug:main epoch: in tree: 0 installed: 0 |
---|
128 | :debug:main ncurses 5.9_2 exists in the ports tree |
---|
129 | :debug:main ncurses 5.9_2 is the latest installed |
---|
130 | :debug:main ncurses 5.9_2 is active |
---|
131 | :debug:main Merging existing variants '' into variants |
---|
132 | :debug:main new fully merged portvariants: |
---|
133 | :debug:main Changing to port directory: /opt/local/var/macports/sources/rsync.macports.org/release/tarballs/ports/devel/ncurses |
---|
134 | :debug:main OS darwin/14.4.0 (Mac OS X 10.10) arch i386 |
---|
135 | :debug:main adding the default universal variant |
---|
136 | :debug:main Reading variant descriptions from /opt/local/var/macports/sources/rsync.macports.org/release/tarballs/ports/_resources/port1.0/variant_descriptions.conf |
---|
137 | :debug:main Running callback portconfigure::add_automatic_compiler_dependencies |
---|
138 | :debug:main Finished running callback portconfigure::add_automatic_compiler_dependencies |
---|
139 | :debug:main Running callback portbuild::add_automatic_buildsystem_dependencies |
---|
140 | :debug:main Finished running callback portbuild::add_automatic_buildsystem_dependencies |
---|
141 | :debug:main No need to upgrade! ncurses 5.9_2 >= ncurses 5.9_2 |
---|
142 | :debug:main epoch: in tree: 0 installed: 0 |
---|
143 | :debug:main libewf 20131230_1 exists in the ports tree |
---|
144 | :debug:main libewf 20131230_1 is the latest installed |
---|
145 | :debug:main libewf 20131230_1 is active |
---|
146 | :debug:main Merging existing variants '' into variants |
---|
147 | :debug:main new fully merged portvariants: |
---|
148 | :debug:main Changing to port directory: /opt/local/var/macports/sources/rsync.macports.org/release/tarballs/ports/security/libewf |
---|
149 | :debug:main OS darwin/14.4.0 (Mac OS X 10.10) arch i386 |
---|
150 | :debug:main adding the default universal variant |
---|
151 | :debug:main Reading variant descriptions from /opt/local/var/macports/sources/rsync.macports.org/release/tarballs/ports/_resources/port1.0/variant_descriptions.conf |
---|
152 | :debug:main Running callback portconfigure::add_automatic_compiler_dependencies |
---|
153 | :debug:main Finished running callback portconfigure::add_automatic_compiler_dependencies |
---|
154 | :debug:main Running callback portbuild::add_automatic_buildsystem_dependencies |
---|
155 | :debug:main Finished running callback portbuild::add_automatic_buildsystem_dependencies |
---|
156 | :debug:main No need to upgrade! libewf 20131230_1 >= libewf 20131230_1 |
---|
157 | :debug:main epoch: in tree: 1 installed: 1 |
---|
158 | :debug:main openssl 1.0.2d_0 exists in the ports tree |
---|
159 | :debug:main openssl 1.0.2d_0 is the latest installed |
---|
160 | :debug:main openssl 1.0.2d_0 is active |
---|
161 | :debug:main Merging existing variants '' into variants |
---|
162 | :debug:main new fully merged portvariants: |
---|
163 | :debug:main Changing to port directory: /opt/local/var/macports/sources/rsync.macports.org/release/tarballs/ports/devel/openssl |
---|
164 | :debug:main OS darwin/14.4.0 (Mac OS X 10.10) arch i386 |
---|
165 | :debug:main Reading variant descriptions from /opt/local/var/macports/sources/rsync.macports.org/release/tarballs/ports/_resources/port1.0/variant_descriptions.conf |
---|
166 | :debug:main Sourcing PortGroup muniversal 1.0 from /opt/local/var/macports/sources/rsync.macports.org/release/tarballs/ports/_resources/port1.0/group/muniversal-1.0.tcl |
---|
167 | :debug:main universal variant already exists, so not adding the default one |
---|
168 | :debug:main Running callback portconfigure::add_automatic_compiler_dependencies |
---|
169 | :debug:main Finished running callback portconfigure::add_automatic_compiler_dependencies |
---|
170 | :debug:main Running callback portbuild::add_automatic_buildsystem_dependencies |
---|
171 | :debug:main Finished running callback portbuild::add_automatic_buildsystem_dependencies |
---|
172 | :debug:main No need to upgrade! openssl 1.0.2d_0 >= openssl 1.0.2d_0 |
---|
173 | :debug:main epoch: in tree: 0 installed: 0 |
---|
174 | :debug:main osxfuse 2.7.5_0 exists in the ports tree |
---|
175 | :debug:main osxfuse 2.7.5_0 is the latest installed |
---|
176 | :debug:main osxfuse 2.7.5_0 is active |
---|
177 | :debug:main Merging existing variants '' into variants |
---|
178 | :debug:main new fully merged portvariants: |
---|
179 | :debug:main Changing to port directory: /opt/local/var/macports/sources/rsync.macports.org/release/tarballs/ports/fuse/osxfuse |
---|
180 | :debug:main OS darwin/14.4.0 (Mac OS X 10.10) arch i386 |
---|
181 | :debug:main universal_variant is false, so not adding the default universal variant |
---|
182 | :debug:main Running callback portconfigure::add_automatic_compiler_dependencies |
---|
183 | :debug:main Finished running callback portconfigure::add_automatic_compiler_dependencies |
---|
184 | :debug:main Running callback portbuild::add_automatic_buildsystem_dependencies |
---|
185 | :debug:main Finished running callback portbuild::add_automatic_buildsystem_dependencies |
---|
186 | :debug:main No need to upgrade! osxfuse 2.7.5_0 >= osxfuse 2.7.5_0 |
---|
187 | :debug:main epoch: in tree: 0 installed: 0 |
---|
188 | :debug:main p5.16-datemanip 6.500.0_0 exists in the ports tree |
---|
189 | :debug:main p5.16-datemanip 6.500.0_0 is the latest installed |
---|
190 | :debug:main p5.16-datemanip 6.500.0_0 is active |
---|
191 | :debug:main Merging existing variants '' into variants |
---|
192 | :debug:main new fully merged portvariants: |
---|
193 | :debug:main Changing to port directory: /opt/local/var/macports/sources/rsync.macports.org/release/tarballs/ports/perl/p5-datemanip |
---|
194 | :debug:main OS darwin/14.4.0 (Mac OS X 10.10) arch i386 |
---|
195 | :debug:main Re-registering default for configure.universal_args |
---|
196 | :debug:main Sourcing PortGroup perl5 1.0 from /opt/local/var/macports/sources/rsync.macports.org/release/tarballs/ports/_resources/port1.0/group/perl5-1.0.tcl |
---|
197 | :debug:main Re-registering default for livecheck.version |
---|
198 | :debug:main Re-registering default for configure.args |
---|
199 | :debug:main only one arch supported, so not adding the default universal variant |
---|
200 | :debug:main Running callback portconfigure::add_automatic_compiler_dependencies |
---|
201 | :debug:main Finished running callback portconfigure::add_automatic_compiler_dependencies |
---|
202 | :debug:main Running callback portbuild::add_automatic_buildsystem_dependencies |
---|
203 | :debug:main Finished running callback portbuild::add_automatic_buildsystem_dependencies |
---|
204 | :debug:main No need to upgrade! p5.16-datemanip 6.500.0_0 >= p5.16-datemanip 6.500.0_0 |
---|
205 | :debug:main epoch: in tree: 2 installed: 2 |
---|
206 | :debug:main p5.16-module-build 0.421.400_0 exists in the ports tree |
---|
207 | :debug:main p5.16-module-build 0.421.400_0 is the latest installed |
---|
208 | :debug:main p5.16-module-build 0.421.400_0 is active |
---|
209 | :debug:main Merging existing variants '' into variants |
---|
210 | :debug:main new fully merged portvariants: |
---|
211 | :debug:main Changing to port directory: /opt/local/var/macports/sources/rsync.macports.org/release/tarballs/ports/perl/p5-module-build |
---|
212 | :debug:main OS darwin/14.4.0 (Mac OS X 10.10) arch i386 |
---|
213 | :debug:main Re-registering default for configure.universal_args |
---|
214 | :debug:main Sourcing PortGroup perl5 1.0 from /opt/local/var/macports/sources/rsync.macports.org/release/tarballs/ports/_resources/port1.0/group/perl5-1.0.tcl |
---|
215 | :debug:main Re-registering default for livecheck.version |
---|
216 | :debug:main Re-registering default for configure.args |
---|
217 | :debug:main only one arch supported, so not adding the default universal variant |
---|
218 | :debug:main Running callback portconfigure::add_automatic_compiler_dependencies |
---|
219 | :debug:main Finished running callback portconfigure::add_automatic_compiler_dependencies |
---|
220 | :debug:main Running callback portbuild::add_automatic_buildsystem_dependencies |
---|
221 | :debug:main Finished running callback portbuild::add_automatic_buildsystem_dependencies |
---|
222 | :debug:main No need to upgrade! p5.16-module-build 0.421.400_0 >= p5.16-module-build 0.421.400_0 |
---|
223 | :debug:main epoch: in tree: 0 installed: 0 |
---|
224 | :debug:main p5.16-cpan-meta 2.150.5_0 exists in the ports tree |
---|
225 | :debug:main p5.16-cpan-meta 2.150.5_0 is the latest installed |
---|
226 | :debug:main p5.16-cpan-meta 2.150.5_0 is active |
---|
227 | :debug:main Merging existing variants '' into variants |
---|
228 | :debug:main new fully merged portvariants: |
---|
229 | :debug:main Changing to port directory: /opt/local/var/macports/sources/rsync.macports.org/release/tarballs/ports/perl/p5-cpan-meta |
---|
230 | :debug:main OS darwin/14.4.0 (Mac OS X 10.10) arch i386 |
---|
231 | :debug:main Re-registering default for configure.universal_args |
---|
232 | :debug:main Sourcing PortGroup perl5 1.0 from /opt/local/var/macports/sources/rsync.macports.org/release/tarballs/ports/_resources/port1.0/group/perl5-1.0.tcl |
---|
233 | :debug:main Re-registering default for livecheck.version |
---|
234 | :debug:main only one arch supported, so not adding the default universal variant |
---|
235 | :debug:main Running callback portconfigure::add_automatic_compiler_dependencies |
---|
236 | :debug:main Finished running callback portconfigure::add_automatic_compiler_dependencies |
---|
237 | :debug:main Running callback portbuild::add_automatic_buildsystem_dependencies |
---|
238 | :debug:main Finished running callback portbuild::add_automatic_buildsystem_dependencies |
---|
239 | :debug:main No need to upgrade! p5.16-cpan-meta 2.150.5_0 >= p5.16-cpan-meta 2.150.5_0 |
---|
240 | :debug:main epoch: in tree: 0 installed: 0 |
---|
241 | :debug:main p5.16-cpan-meta-requirements 2.133.0_0 exists in the ports tree |
---|
242 | :debug:main p5.16-cpan-meta-requirements 2.133.0_0 is the latest installed |
---|
243 | :debug:main p5.16-cpan-meta-requirements 2.133.0_0 is active |
---|
244 | :debug:main Merging existing variants '' into variants |
---|
245 | :debug:main new fully merged portvariants: |
---|
246 | :debug:main Changing to port directory: /opt/local/var/macports/sources/rsync.macports.org/release/tarballs/ports/perl/p5-cpan-meta-requirements |
---|
247 | :debug:main OS darwin/14.4.0 (Mac OS X 10.10) arch i386 |
---|
248 | :debug:main Re-registering default for configure.universal_args |
---|
249 | :debug:main Sourcing PortGroup perl5 1.0 from /opt/local/var/macports/sources/rsync.macports.org/release/tarballs/ports/_resources/port1.0/group/perl5-1.0.tcl |
---|
250 | :debug:main Re-registering default for livecheck.version |
---|
251 | :debug:main only one arch supported, so not adding the default universal variant |
---|
252 | :debug:main Running callback portconfigure::add_automatic_compiler_dependencies |
---|
253 | :debug:main Finished running callback portconfigure::add_automatic_compiler_dependencies |
---|
254 | :debug:main Running callback portbuild::add_automatic_buildsystem_dependencies |
---|
255 | :debug:main Finished running callback portbuild::add_automatic_buildsystem_dependencies |
---|
256 | :debug:main No need to upgrade! p5.16-cpan-meta-requirements 2.133.0_0 >= p5.16-cpan-meta-requirements 2.133.0_0 |
---|
257 | :debug:main epoch: in tree: 0 installed: 0 |
---|
258 | :debug:main p5.16-cpan-meta-yaml 0.16.0_0 exists in the ports tree |
---|
259 | :debug:main p5.16-cpan-meta-yaml 0.16.0_0 is the latest installed |
---|
260 | :debug:main p5.16-cpan-meta-yaml 0.16.0_0 is active |
---|
261 | :debug:main Merging existing variants '' into variants |
---|
262 | :debug:main new fully merged portvariants: |
---|
263 | :debug:main Changing to port directory: /opt/local/var/macports/sources/rsync.macports.org/release/tarballs/ports/perl/p5-cpan-meta-yaml |
---|
264 | :debug:main OS darwin/14.4.0 (Mac OS X 10.10) arch i386 |
---|
265 | :debug:main Re-registering default for configure.universal_args |
---|
266 | :debug:main Sourcing PortGroup perl5 1.0 from /opt/local/var/macports/sources/rsync.macports.org/release/tarballs/ports/_resources/port1.0/group/perl5-1.0.tcl |
---|
267 | :debug:main Re-registering default for livecheck.version |
---|
268 | :debug:main only one arch supported, so not adding the default universal variant |
---|
269 | :debug:main Running callback portconfigure::add_automatic_compiler_dependencies |
---|
270 | :debug:main Finished running callback portconfigure::add_automatic_compiler_dependencies |
---|
271 | :debug:main Running callback portbuild::add_automatic_buildsystem_dependencies |
---|
272 | :debug:main Finished running callback portbuild::add_automatic_buildsystem_dependencies |
---|
273 | :debug:main No need to upgrade! p5.16-cpan-meta-yaml 0.16.0_0 >= p5.16-cpan-meta-yaml 0.16.0_0 |
---|
274 | :debug:main epoch: in tree: 0 installed: 0 |
---|
275 | :debug:main p5.16-parse-cpan-meta 1.441.700_0 exists in the ports tree |
---|
276 | :debug:main p5.16-parse-cpan-meta 1.441.700_0 is the latest installed |
---|
277 | :debug:main p5.16-parse-cpan-meta 1.441.700_0 is active |
---|
278 | :debug:main Merging existing variants '' into variants |
---|
279 | :debug:main new fully merged portvariants: |
---|
280 | :debug:main Changing to port directory: /opt/local/var/macports/sources/rsync.macports.org/release/tarballs/ports/perl/p5-parse-cpan-meta |
---|
281 | :debug:main OS darwin/14.4.0 (Mac OS X 10.10) arch i386 |
---|
282 | :debug:main Re-registering default for configure.universal_args |
---|
283 | :debug:main Sourcing PortGroup perl5 1.0 from /opt/local/var/macports/sources/rsync.macports.org/release/tarballs/ports/_resources/port1.0/group/perl5-1.0.tcl |
---|
284 | :debug:main Re-registering default for livecheck.version |
---|
285 | :debug:main only one arch supported, so not adding the default universal variant |
---|
286 | :debug:main Running callback portconfigure::add_automatic_compiler_dependencies |
---|
287 | :debug:main Finished running callback portconfigure::add_automatic_compiler_dependencies |
---|
288 | :debug:main Running callback portbuild::add_automatic_buildsystem_dependencies |
---|
289 | :debug:main Finished running callback portbuild::add_automatic_buildsystem_dependencies |
---|
290 | :debug:main No need to upgrade! p5.16-parse-cpan-meta 1.441.700_0 >= p5.16-parse-cpan-meta 1.441.700_0 |
---|
291 | :debug:main epoch: in tree: 0 installed: 0 |
---|
292 | :debug:main p5.16-scalar-list-utils 1.420.0_0 exists in the ports tree |
---|
293 | :debug:main p5.16-scalar-list-utils 1.420.0_0 is the latest installed |
---|
294 | :debug:main p5.16-scalar-list-utils 1.420.0_0 is active |
---|
295 | :debug:main Merging existing variants '' into variants |
---|
296 | :debug:main new fully merged portvariants: |
---|
297 | :debug:main Changing to port directory: /opt/local/var/macports/sources/rsync.macports.org/release/tarballs/ports/perl/p5-scalar-list-utils |
---|
298 | :debug:main OS darwin/14.4.0 (Mac OS X 10.10) arch i386 |
---|
299 | :debug:main Re-registering default for configure.universal_args |
---|
300 | :debug:main Sourcing PortGroup perl5 1.0 from /opt/local/var/macports/sources/rsync.macports.org/release/tarballs/ports/_resources/port1.0/group/perl5-1.0.tcl |
---|
301 | :debug:main Re-registering default for livecheck.version |
---|
302 | :debug:main adding the default universal variant |
---|
303 | :debug:main Reading variant descriptions from /opt/local/var/macports/sources/rsync.macports.org/release/tarballs/ports/_resources/port1.0/variant_descriptions.conf |
---|
304 | :debug:main Running callback portconfigure::add_automatic_compiler_dependencies |
---|
305 | :debug:main Finished running callback portconfigure::add_automatic_compiler_dependencies |
---|
306 | :debug:main Running callback portbuild::add_automatic_buildsystem_dependencies |
---|
307 | :debug:main Finished running callback portbuild::add_automatic_buildsystem_dependencies |
---|
308 | :debug:main No need to upgrade! p5.16-scalar-list-utils 1.420.0_0 >= p5.16-scalar-list-utils 1.420.0_0 |
---|
309 | :debug:main epoch: in tree: 2 installed: 2 |
---|
310 | :debug:main p5.16-version 0.991.200_0 exists in the ports tree |
---|
311 | :debug:main p5.16-version 0.991.200_0 is the latest installed |
---|
312 | :debug:main p5.16-version 0.991.200_0 is active |
---|
313 | :debug:main Merging existing variants '' into variants |
---|
314 | :debug:main new fully merged portvariants: |
---|
315 | :debug:main Changing to port directory: /opt/local/var/macports/sources/rsync.macports.org/release/tarballs/ports/perl/p5-version |
---|
316 | :debug:main OS darwin/14.4.0 (Mac OS X 10.10) arch i386 |
---|
317 | :debug:main Re-registering default for configure.universal_args |
---|
318 | :debug:main Sourcing PortGroup perl5 1.0 from /opt/local/var/macports/sources/rsync.macports.org/release/tarballs/ports/_resources/port1.0/group/perl5-1.0.tcl |
---|
319 | :debug:main Re-registering default for livecheck.version |
---|
320 | :debug:main adding the default universal variant |
---|
321 | :debug:main Reading variant descriptions from /opt/local/var/macports/sources/rsync.macports.org/release/tarballs/ports/_resources/port1.0/variant_descriptions.conf |
---|
322 | :debug:main Running callback portconfigure::add_automatic_compiler_dependencies |
---|
323 | :debug:main Finished running callback portconfigure::add_automatic_compiler_dependencies |
---|
324 | :debug:main Running callback portbuild::add_automatic_buildsystem_dependencies |
---|
325 | :debug:main Finished running callback portbuild::add_automatic_buildsystem_dependencies |
---|
326 | :debug:main No need to upgrade! p5.16-version 0.991.200_0 >= p5.16-version 0.991.200_0 |
---|
327 | :debug:main epoch: in tree: 0 installed: 0 |
---|
328 | :debug:main p5.16-inc-latest 0.500.0_0 exists in the ports tree |
---|
329 | :debug:main p5.16-inc-latest 0.500.0_0 is the latest installed |
---|
330 | :debug:main p5.16-inc-latest 0.500.0_0 is active |
---|
331 | :debug:main Merging existing variants '' into variants |
---|
332 | :debug:main new fully merged portvariants: |
---|
333 | :debug:main Changing to port directory: /opt/local/var/macports/sources/rsync.macports.org/release/tarballs/ports/perl/p5-inc-latest |
---|
334 | :debug:main OS darwin/14.4.0 (Mac OS X 10.10) arch i386 |
---|
335 | :debug:main Re-registering default for configure.universal_args |
---|
336 | :debug:main Sourcing PortGroup perl5 1.0 from /opt/local/var/macports/sources/rsync.macports.org/release/tarballs/ports/_resources/port1.0/group/perl5-1.0.tcl |
---|
337 | :debug:main Re-registering default for livecheck.version |
---|
338 | :debug:main only one arch supported, so not adding the default universal variant |
---|
339 | :debug:main Running callback portconfigure::add_automatic_compiler_dependencies |
---|
340 | :debug:main Finished running callback portconfigure::add_automatic_compiler_dependencies |
---|
341 | :debug:main Running callback portbuild::add_automatic_buildsystem_dependencies |
---|
342 | :debug:main Finished running callback portbuild::add_automatic_buildsystem_dependencies |
---|
343 | :debug:main No need to upgrade! p5.16-inc-latest 0.500.0_0 >= p5.16-inc-latest 0.500.0_0 |
---|
344 | :debug:main epoch: in tree: 0 installed: 0 |
---|
345 | :debug:main p5.16-module-metadata 1.0.27_0 exists in the ports tree |
---|
346 | :debug:main p5.16-module-metadata 1.0.27_0 is the latest installed |
---|
347 | :debug:main p5.16-module-metadata 1.0.27_0 is active |
---|
348 | :debug:main Merging existing variants '' into variants |
---|
349 | :debug:main new fully merged portvariants: |
---|
350 | :debug:main Changing to port directory: /opt/local/var/macports/sources/rsync.macports.org/release/tarballs/ports/perl/p5-module-metadata |
---|
351 | :debug:main OS darwin/14.4.0 (Mac OS X 10.10) arch i386 |
---|
352 | :debug:main Re-registering default for configure.universal_args |
---|
353 | :debug:main Sourcing PortGroup perl5 1.0 from /opt/local/var/macports/sources/rsync.macports.org/release/tarballs/ports/_resources/port1.0/group/perl5-1.0.tcl |
---|
354 | :debug:main Re-registering default for livecheck.version |
---|
355 | :debug:main only one arch supported, so not adding the default universal variant |
---|
356 | :debug:main Running callback portconfigure::add_automatic_compiler_dependencies |
---|
357 | :debug:main Finished running callback portconfigure::add_automatic_compiler_dependencies |
---|
358 | :debug:main Running callback portbuild::add_automatic_buildsystem_dependencies |
---|
359 | :debug:main Finished running callback portbuild::add_automatic_buildsystem_dependencies |
---|
360 | :debug:main No need to upgrade! p5.16-module-metadata 1.0.27_0 >= p5.16-module-metadata 1.0.27_0 |
---|
361 | :debug:main epoch: in tree: 0 installed: 0 |
---|
362 | :debug:main p5.16-perl-ostype 1.8.0_0 exists in the ports tree |
---|
363 | :debug:main p5.16-perl-ostype 1.8.0_0 is the latest installed |
---|
364 | :debug:main p5.16-perl-ostype 1.8.0_0 is active |
---|
365 | :debug:main Merging existing variants '' into variants |
---|
366 | :debug:main new fully merged portvariants: |
---|
367 | :debug:main Changing to port directory: /opt/local/var/macports/sources/rsync.macports.org/release/tarballs/ports/perl/p5-perl-ostype |
---|
368 | :debug:main OS darwin/14.4.0 (Mac OS X 10.10) arch i386 |
---|
369 | :debug:main Re-registering default for configure.universal_args |
---|
370 | :debug:main Sourcing PortGroup perl5 1.0 from /opt/local/var/macports/sources/rsync.macports.org/release/tarballs/ports/_resources/port1.0/group/perl5-1.0.tcl |
---|
371 | :debug:main Re-registering default for livecheck.version |
---|
372 | :debug:main only one arch supported, so not adding the default universal variant |
---|
373 | :debug:main Running callback portconfigure::add_automatic_compiler_dependencies |
---|
374 | :debug:main Finished running callback portconfigure::add_automatic_compiler_dependencies |
---|
375 | :debug:main Running callback portbuild::add_automatic_buildsystem_dependencies |
---|
376 | :debug:main Finished running callback portbuild::add_automatic_buildsystem_dependencies |
---|
377 | :debug:main No need to upgrade! p5.16-perl-ostype 1.8.0_0 >= p5.16-perl-ostype 1.8.0_0 |
---|
378 | :debug:main epoch: in tree: 0 installed: 0 |
---|
379 | :debug:main p5.16-test-simple 1.1.14_0 exists in the ports tree |
---|
380 | :debug:main p5.16-test-simple 1.1.14_0 is the latest installed |
---|
381 | :debug:main p5.16-test-simple 1.1.14_0 is active |
---|
382 | :debug:main Merging existing variants '' into variants |
---|
383 | :debug:main new fully merged portvariants: |
---|
384 | :debug:main Changing to port directory: /opt/local/var/macports/sources/rsync.macports.org/release/tarballs/ports/perl/p5-test-simple |
---|
385 | :debug:main OS darwin/14.4.0 (Mac OS X 10.10) arch i386 |
---|
386 | :debug:main Re-registering default for configure.universal_args |
---|
387 | :debug:main Sourcing PortGroup perl5 1.0 from /opt/local/var/macports/sources/rsync.macports.org/release/tarballs/ports/_resources/port1.0/group/perl5-1.0.tcl |
---|
388 | :debug:main Re-registering default for livecheck.version |
---|
389 | :debug:main only one arch supported, so not adding the default universal variant |
---|
390 | :debug:main Running callback portconfigure::add_automatic_compiler_dependencies |
---|
391 | :debug:main Finished running callback portconfigure::add_automatic_compiler_dependencies |
---|
392 | :debug:main Running callback portbuild::add_automatic_buildsystem_dependencies |
---|
393 | :debug:main Finished running callback portbuild::add_automatic_buildsystem_dependencies |
---|
394 | :debug:main No need to upgrade! p5.16-test-simple 1.1.14_0 >= p5.16-test-simple 1.1.14_0 |
---|
395 | :debug:main epoch: in tree: 0 installed: 0 |
---|
396 | :debug:main p5.16-podlators 2.5.3_1 exists in the ports tree |
---|
397 | :debug:main p5.16-podlators 2.5.3_1 is the latest installed |
---|
398 | :debug:main p5.16-podlators 2.5.3_1 is active |
---|
399 | :debug:main Merging existing variants '' into variants |
---|
400 | :debug:main new fully merged portvariants: |
---|
401 | :debug:main Changing to port directory: /opt/local/var/macports/sources/rsync.macports.org/release/tarballs/ports/perl/p5-podlators |
---|
402 | :debug:main OS darwin/14.4.0 (Mac OS X 10.10) arch i386 |
---|
403 | :debug:main Re-registering default for configure.universal_args |
---|
404 | :debug:main Sourcing PortGroup perl5 1.0 from /opt/local/var/macports/sources/rsync.macports.org/release/tarballs/ports/_resources/port1.0/group/perl5-1.0.tcl |
---|
405 | :debug:main Re-registering default for livecheck.version |
---|
406 | :debug:main only one arch supported, so not adding the default universal variant |
---|
407 | :debug:main Running callback portconfigure::add_automatic_compiler_dependencies |
---|
408 | :debug:main Finished running callback portconfigure::add_automatic_compiler_dependencies |
---|
409 | :debug:main Running callback portbuild::add_automatic_buildsystem_dependencies |
---|
410 | :debug:main Finished running callback portbuild::add_automatic_buildsystem_dependencies |
---|
411 | :debug:main No need to upgrade! p5.16-podlators 2.5.3_1 >= p5.16-podlators 2.5.3_1 |
---|
412 | :debug:main epoch: in tree: 0 installed: 0 |
---|
413 | :debug:main p5.16-pod-simple 3.300.0_0 exists in the ports tree |
---|
414 | :debug:main p5.16-pod-simple 3.300.0_0 is the latest installed |
---|
415 | :debug:main p5.16-pod-simple 3.300.0_0 is active |
---|
416 | :debug:main Merging existing variants '' into variants |
---|
417 | :debug:main new fully merged portvariants: |
---|
418 | :debug:main Changing to port directory: /opt/local/var/macports/sources/rsync.macports.org/release/tarballs/ports/perl/p5-pod-simple |
---|
419 | :debug:main OS darwin/14.4.0 (Mac OS X 10.10) arch i386 |
---|
420 | :debug:main Re-registering default for configure.universal_args |
---|
421 | :debug:main Sourcing PortGroup perl5 1.0 from /opt/local/var/macports/sources/rsync.macports.org/release/tarballs/ports/_resources/port1.0/group/perl5-1.0.tcl |
---|
422 | :debug:main Re-registering default for livecheck.version |
---|
423 | :debug:main only one arch supported, so not adding the default universal variant |
---|
424 | :debug:main Running callback portconfigure::add_automatic_compiler_dependencies |
---|
425 | :debug:main Finished running callback portconfigure::add_automatic_compiler_dependencies |
---|
426 | :debug:main Running callback portbuild::add_automatic_buildsystem_dependencies |
---|
427 | :debug:main Finished running callback portbuild::add_automatic_buildsystem_dependencies |
---|
428 | :debug:main No need to upgrade! p5.16-pod-simple 3.300.0_0 >= p5.16-pod-simple 3.300.0_0 |
---|
429 | :debug:main epoch: in tree: 0 installed: 0 |
---|
430 | :debug:main p5.16-pod-escapes 1.70.0_0 exists in the ports tree |
---|
431 | :debug:main p5.16-pod-escapes 1.70.0_0 is the latest installed |
---|
432 | :debug:main p5.16-pod-escapes 1.70.0_0 is active |
---|
433 | :debug:main Merging existing variants '' into variants |
---|
434 | :debug:main new fully merged portvariants: |
---|
435 | :debug:main Changing to port directory: /opt/local/var/macports/sources/rsync.macports.org/release/tarballs/ports/perl/p5-pod-escapes |
---|
436 | :debug:main OS darwin/14.4.0 (Mac OS X 10.10) arch i386 |
---|
437 | :debug:main Re-registering default for configure.universal_args |
---|
438 | :debug:main Sourcing PortGroup perl5 1.0 from /opt/local/var/macports/sources/rsync.macports.org/release/tarballs/ports/_resources/port1.0/group/perl5-1.0.tcl |
---|
439 | :debug:main Re-registering default for livecheck.version |
---|
440 | :debug:main only one arch supported, so not adding the default universal variant |
---|
441 | :debug:main Running callback portconfigure::add_automatic_compiler_dependencies |
---|
442 | :debug:main Finished running callback portconfigure::add_automatic_compiler_dependencies |
---|
443 | :debug:main Running callback portbuild::add_automatic_buildsystem_dependencies |
---|
444 | :debug:main Finished running callback portbuild::add_automatic_buildsystem_dependencies |
---|
445 | :debug:main No need to upgrade! p5.16-pod-escapes 1.70.0_0 >= p5.16-pod-escapes 1.70.0_0 |
---|
446 | :msg:main ---> Computing dependencies for sleuthkit:info:main .:debug:main sleuthkit has no conflicts |
---|
447 | :debug:main Searching for dependency: file |
---|
448 | :debug:main Found Dependency: receipt exists for file |
---|
449 | :debug:main Searching for dependency: perl5.16 |
---|
450 | :debug:main Found Dependency: receipt exists for perl5.16 |
---|
451 | :debug:main Searching for dependency: libewf |
---|
452 | :debug:main Found Dependency: receipt exists for libewf |
---|
453 | :debug:main Searching for dependency: openssl |
---|
454 | :debug:main Found Dependency: receipt exists for openssl |
---|
455 | :debug:main Searching for dependency: p5.16-datemanip |
---|
456 | :debug:main Found Dependency: receipt exists for p5.16-datemanip |
---|
457 | :debug:main Searching for dependency: zlib |
---|
458 | :debug:main Found Dependency: receipt exists for zlib |
---|
459 | :msg:main |
---|
460 | :debug:main Executing org.macports.main (sleuthkit) |
---|
461 | :debug:main changing euid/egid - current euid: 0 - current egid: 0 |
---|
462 | :debug:main egid changed to: 501 |
---|
463 | :debug:main euid changed to: 502 |
---|
464 | :debug:archivefetch archivefetch phase started at Tue Jul 21 18:07:13 CEST 2015 |
---|
465 | :msg:archivefetch ---> Fetching archive for sleuthkit |
---|
466 | :debug:archivefetch Executing org.macports.archivefetch (sleuthkit) |
---|
467 | :debug:archivefetch euid/egid changed to: 0/0 |
---|
468 | :debug:archivefetch chowned /opt/local/var/macports/incoming to macports |
---|
469 | :debug:archivefetch euid/egid changed to: 502/501 |
---|
470 | :info:archivefetch ---> sleuthkit-4.1.3_2.darwin_14.x86_64.tbz2 doesn't seem to exist in /opt/local/var/macports/incoming/verified |
---|
471 | :msg:archivefetch ---> Attempting to fetch sleuthkit-4.1.3_2.darwin_14.x86_64.tbz2 from http://nue.de.packages.macports.org/macports/packages/sleuthkit |
---|
472 | :debug:archivefetch Fetching archive failed:: The requested URL returned error: 404 Not Found |
---|
473 | :msg:archivefetch ---> Attempting to fetch sleuthkit-4.1.3_2.darwin_14.x86_64.tbz2 from http://lil.fr.packages.macports.org/sleuthkit |
---|
474 | :debug:archivefetch Fetching archive failed:: The requested URL returned error: 404 Not Found |
---|
475 | :msg:archivefetch ---> Attempting to fetch sleuthkit-4.1.3_2.darwin_14.x86_64.tbz2 from http://mse.uk.packages.macports.org/sites/packages.macports.org/sleuthkit |
---|
476 | :debug:archivefetch Fetching archive failed:: The requested URL returned error: 404 Not Found |
---|
477 | :debug:archivefetch Privilege de-escalation not attempted as not running as root. |
---|
478 | :debug:fetch fetch phase started at Tue Jul 21 18:07:17 CEST 2015 |
---|
479 | :notice:fetch ---> Fetching distfiles for sleuthkit |
---|
480 | :debug:fetch Executing org.macports.fetch (sleuthkit) |
---|
481 | :debug:fetch Privilege de-escalation not attempted as not running as root. |
---|
482 | :debug:checksum checksum phase started at Tue Jul 21 18:07:17 CEST 2015 |
---|
483 | :notice:checksum ---> Verifying checksums for sleuthkit |
---|
484 | :debug:checksum Executing org.macports.checksum (sleuthkit) |
---|
485 | :info:checksum ---> Checksumming sleuthkit-4.1.3.tar.gz |
---|
486 | :debug:checksum Calculated (rmd160) is 223c6ffe22259ca057b6d9634813536e7ccd9dba |
---|
487 | :debug:checksum Correct (rmd160) checksum for sleuthkit-4.1.3.tar.gz |
---|
488 | :debug:checksum Calculated (sha256) is 67f9d2a31a8884d58698d6122fc1a1bfa9bf238582bde2b49228ec9b899f0327 |
---|
489 | :debug:checksum Correct (sha256) checksum for sleuthkit-4.1.3.tar.gz |
---|
490 | :debug:checksum Privilege de-escalation not attempted as not running as root. |
---|
491 | :debug:extract extract phase started at Tue Jul 21 18:07:17 CEST 2015 |
---|
492 | :notice:extract ---> Extracting sleuthkit |
---|
493 | :debug:extract Executing org.macports.extract (sleuthkit) |
---|
494 | :info:extract ---> Extracting sleuthkit-4.1.3.tar.gz |
---|
495 | :debug:extract setting option extract.args to '/opt/local/var/macports/distfiles/sleuthkit/sleuthkit-4.1.3.tar.gz' |
---|
496 | :debug:extract Environment: |
---|
497 | CC_PRINT_OPTIONS='YES' |
---|
498 | CC_PRINT_OPTIONS_FILE='/opt/local/var/macports/build/_opt_local_var_macports_sources_rsync.macports.org_release_tarballs_ports_sysutils_sleuthkit/sleuthkit/work/.CC_PRINT_OPTIONS' |
---|
499 | CPATH='/opt/local/include' |
---|
500 | LIBRARY_PATH='/opt/local/lib' |
---|
501 | MACOSX_DEPLOYMENT_TARGET='10.10' |
---|
502 | :debug:extract Assembled command: 'cd "/opt/local/var/macports/build/_opt_local_var_macports_sources_rsync.macports.org_release_tarballs_ports_sysutils_sleuthkit/sleuthkit/work" && /usr/bin/gzip -dc '/opt/local/var/macports/distfiles/sleuthkit/sleuthkit-4.1.3.tar.gz' | /usr/bin/tar -xf -' |
---|
503 | :debug:extract Executing command line: cd "/opt/local/var/macports/build/_opt_local_var_macports_sources_rsync.macports.org_release_tarballs_ports_sysutils_sleuthkit/sleuthkit/work" && /usr/bin/gzip -dc '/opt/local/var/macports/distfiles/sleuthkit/sleuthkit-4.1.3.tar.gz' | /usr/bin/tar -xf - |
---|
504 | :debug:extract euid/egid changed to: 0/0 |
---|
505 | :debug:extract chowned /opt/local/var/macports/build/_opt_local_var_macports_sources_rsync.macports.org_release_tarballs_ports_sysutils_sleuthkit/sleuthkit/work to macports |
---|
506 | :debug:extract euid/egid changed to: 502/501 |
---|
507 | :debug:extract Privilege de-escalation not attempted as not running as root. |
---|
508 | :debug:patch patch phase started at Tue Jul 21 18:07:18 CEST 2015 |
---|
509 | :debug:patch Executing org.macports.patch (sleuthkit) |
---|
510 | :notice:patch ---> Applying patches to sleuthkit |
---|
511 | :info:patch ---> Applying patch-tsk4.1.3_external_type.diff |
---|
512 | :debug:patch Environment: |
---|
513 | CC_PRINT_OPTIONS='YES' |
---|
514 | CC_PRINT_OPTIONS_FILE='/opt/local/var/macports/build/_opt_local_var_macports_sources_rsync.macports.org_release_tarballs_ports_sysutils_sleuthkit/sleuthkit/work/.CC_PRINT_OPTIONS' |
---|
515 | CPATH='/opt/local/include' |
---|
516 | LIBRARY_PATH='/opt/local/lib' |
---|
517 | MACOSX_DEPLOYMENT_TARGET='10.10' |
---|
518 | :debug:patch Assembled command: 'cd "/opt/local/var/macports/build/_opt_local_var_macports_sources_rsync.macports.org_release_tarballs_ports_sysutils_sleuthkit/sleuthkit/work/sleuthkit-4.1.3" && /usr/bin/patch -p0' |
---|
519 | :debug:patch Executing command line: cd "/opt/local/var/macports/build/_opt_local_var_macports_sources_rsync.macports.org_release_tarballs_ports_sysutils_sleuthkit/sleuthkit/work/sleuthkit-4.1.3" && /usr/bin/patch -p0 < '/opt/local/var/macports/sources/rsync.macports.org/release/tarballs/ports/sysutils/sleuthkit/files/patch-tsk4.1.3_external_type.diff' |
---|
520 | :info:patch patching file tsk/img/tsk_img.h |
---|
521 | :debug:patch Privilege de-escalation not attempted as not running as root. |
---|
522 | :debug:configure configure phase started at Tue Jul 21 18:07:18 CEST 2015 |
---|
523 | :notice:configure ---> Configuring sleuthkit |
---|
524 | :debug:configure Using compiler 'Xcode Clang' |
---|
525 | :debug:configure Executing org.macports.configure (sleuthkit) |
---|
526 | :debug:configure Environment: |
---|
527 | CC='/usr/bin/clang' |
---|
528 | CC_PRINT_OPTIONS='YES' |
---|
529 | CC_PRINT_OPTIONS_FILE='/opt/local/var/macports/build/_opt_local_var_macports_sources_rsync.macports.org_release_tarballs_ports_sysutils_sleuthkit/sleuthkit/work/.CC_PRINT_OPTIONS' |
---|
530 | CFLAGS='-pipe -Os -arch x86_64' |
---|
531 | CPATH='/opt/local/include' |
---|
532 | CPPFLAGS='-I/opt/local/include' |
---|
533 | CXX='/usr/bin/clang++' |
---|
534 | CXXFLAGS='-pipe -Os -arch x86_64 -stdlib=libc++' |
---|
535 | F77FLAGS='-m64' |
---|
536 | F90FLAGS='-pipe -Os -m64' |
---|
537 | FCFLAGS='-pipe -Os -m64' |
---|
538 | FFLAGS='-pipe -Os' |
---|
539 | INSTALL='/usr/bin/install -c' |
---|
540 | LDFLAGS='-L/opt/local/lib -Wl,-headerpad_max_install_names -arch x86_64' |
---|
541 | LIBRARY_PATH='/opt/local/lib' |
---|
542 | MACOSX_DEPLOYMENT_TARGET='10.10' |
---|
543 | OBJC='/usr/bin/clang' |
---|
544 | OBJCFLAGS='-pipe -Os -arch x86_64' |
---|
545 | OBJCXX='/usr/bin/clang++' |
---|
546 | OBJCXXFLAGS='-pipe -Os -arch x86_64 -stdlib=libc++' |
---|
547 | :debug:configure Assembled command: 'cd "/opt/local/var/macports/build/_opt_local_var_macports_sources_rsync.macports.org_release_tarballs_ports_sysutils_sleuthkit/sleuthkit/work/sleuthkit-4.1.3" && ./configure --prefix=/opt/local --mandir=/opt/local/share/man' |
---|
548 | :debug:configure Executing command line: cd "/opt/local/var/macports/build/_opt_local_var_macports_sources_rsync.macports.org_release_tarballs_ports_sysutils_sleuthkit/sleuthkit/work/sleuthkit-4.1.3" && ./configure --prefix=/opt/local --mandir=/opt/local/share/man |
---|
549 | :info:configure checking for a BSD-compatible install... /usr/bin/install -c |
---|
550 | :info:configure checking whether build environment is sane... yes |
---|
551 | :info:configure checking for a thread-safe mkdir -p... /opt/local/bin/gmkdir -p |
---|
552 | :info:configure checking for gawk... gawk |
---|
553 | :info:configure checking whether make sets $(MAKE)... yes |
---|
554 | :info:configure checking for cppunit-config... no |
---|
555 | :info:configure checking for Cppunit - version >= 1.12.1... no |
---|
556 | :info:configure checking build system type... i386-apple-darwin14.4.0 |
---|
557 | :info:configure checking host system type... i386-apple-darwin14.4.0 |
---|
558 | :info:configure checking for style of include used by make... GNU |
---|
559 | :info:configure checking for gcc... /usr/bin/clang |
---|
560 | :info:configure checking for C compiler default output file name... a.out |
---|
561 | :info:configure checking whether the C compiler works... yes |
---|
562 | :info:configure checking whether we are cross compiling... no |
---|
563 | :info:configure checking for suffix of executables... |
---|
564 | :info:configure checking for suffix of object files... o |
---|
565 | :info:configure checking whether we are using the GNU C compiler... yes |
---|
566 | :info:configure checking whether /usr/bin/clang accepts -g... yes |
---|
567 | :info:configure checking for /usr/bin/clang option to accept ISO C89... none needed |
---|
568 | :info:configure checking dependency style of /usr/bin/clang... gcc3 |
---|
569 | :info:configure checking for a sed that does not truncate output... /opt/local/bin/gsed |
---|
570 | :info:configure checking for grep that handles long lines and -e... /opt/local/bin/grep |
---|
571 | :info:configure checking for egrep... /opt/local/bin/grep -E |
---|
572 | :info:configure checking for fgrep... /opt/local/bin/grep -F |
---|
573 | :info:configure checking for ld used by /usr/bin/clang... /Applications/Xcode.app/Contents/Developer/Toolchains/XcodeDefault.xctoolchain/usr/bin/ld |
---|
574 | :info:configure checking if the linker (/Applications/Xcode.app/Contents/Developer/Toolchains/XcodeDefault.xctoolchain/usr/bin/ld) is GNU ld... no |
---|
575 | :info:configure checking for BSD- or MS-compatible name lister (nm)... /opt/local/bin/nm |
---|
576 | :info:configure checking the name lister (/opt/local/bin/nm) interface... BSD nm |
---|
577 | :info:configure checking whether ln -s works... yes |
---|
578 | :info:configure checking the maximum length of command line arguments... 196608 |
---|
579 | :info:configure checking whether the shell understands some XSI constructs... yes |
---|
580 | :info:configure checking whether the shell understands "+="... yes |
---|
581 | :info:configure checking for /Applications/Xcode.app/Contents/Developer/Toolchains/XcodeDefault.xctoolchain/usr/bin/ld option to reload object files... -r |
---|
582 | :info:configure checking how to recognize dependent libraries... pass_all |
---|
583 | :info:configure checking for ar... ar |
---|
584 | :info:configure checking for strip... strip |
---|
585 | :info:configure checking for ranlib... ranlib |
---|
586 | :info:configure checking command to parse /opt/local/bin/nm output from /usr/bin/clang object... ok |
---|
587 | :info:configure checking for dsymutil... dsymutil |
---|
588 | :info:configure checking for nmedit... nmedit |
---|
589 | :info:configure checking for lipo... lipo |
---|
590 | :info:configure checking for otool... otool |
---|
591 | :info:configure checking for otool64... no |
---|
592 | :info:configure checking for -single_module linker flag... yes |
---|
593 | :info:configure checking for -exported_symbols_list linker flag... yes |
---|
594 | :info:configure checking how to run the C preprocessor... /usr/bin/clang -E |
---|
595 | :info:configure checking for ANSI C header files... yes |
---|
596 | :info:configure checking for sys/types.h... yes |
---|
597 | :info:configure checking for sys/stat.h... yes |
---|
598 | :info:configure checking for stdlib.h... yes |
---|
599 | :info:configure checking for string.h... yes |
---|
600 | :info:configure checking for memory.h... yes |
---|
601 | :info:configure checking for strings.h... yes |
---|
602 | :info:configure checking for inttypes.h... yes |
---|
603 | :info:configure checking for stdint.h... yes |
---|
604 | :info:configure checking for unistd.h... yes |
---|
605 | :info:configure checking for dlfcn.h... yes |
---|
606 | :info:configure checking for objdir... .libs |
---|
607 | :info:configure checking if /usr/bin/clang supports -fno-rtti -fno-exceptions... yes |
---|
608 | :info:configure checking for /usr/bin/clang option to produce PIC... -fno-common -DPIC |
---|
609 | :info:configure checking if /usr/bin/clang PIC flag -fno-common -DPIC works... yes |
---|
610 | :info:configure checking if /usr/bin/clang static flag -static works... no |
---|
611 | :info:configure checking if /usr/bin/clang supports -c -o file.o... yes |
---|
612 | :info:configure checking if /usr/bin/clang supports -c -o file.o... (cached) yes |
---|
613 | :info:configure checking whether the /usr/bin/clang linker (/Applications/Xcode.app/Contents/Developer/Toolchains/XcodeDefault.xctoolchain/usr/bin/ld) supports shared libraries... yes |
---|
614 | :info:configure checking dynamic linker characteristics... darwin14.4.0 dyld |
---|
615 | :info:configure checking how to hardcode library paths into programs... immediate |
---|
616 | :info:configure checking whether stripping libraries is possible... yes |
---|
617 | :info:configure checking if libtool supports shared libraries... yes |
---|
618 | :info:configure checking whether to build shared libraries... yes |
---|
619 | :info:configure checking whether to build static libraries... yes |
---|
620 | :info:configure checking whether to enable maintainer-specific portions of Makefiles... no |
---|
621 | :info:configure checking whether we are using the GNU C++ compiler... yes |
---|
622 | :info:configure checking whether /usr/bin/clang++ accepts -g... yes |
---|
623 | :info:configure checking dependency style of /usr/bin/clang++... gcc3 |
---|
624 | :info:configure checking whether we are using the GNU C++ compiler... (cached) yes |
---|
625 | :info:configure checking whether /usr/bin/clang++ accepts -g... (cached) yes |
---|
626 | :info:configure checking dependency style of /usr/bin/clang++... (cached) gcc3 |
---|
627 | :info:configure checking how to run the C++ preprocessor... /usr/bin/clang++ -E |
---|
628 | :info:configure checking for ld used by /usr/bin/clang++... /Applications/Xcode.app/Contents/Developer/Toolchains/XcodeDefault.xctoolchain/usr/bin/ld |
---|
629 | :info:configure checking if the linker (/Applications/Xcode.app/Contents/Developer/Toolchains/XcodeDefault.xctoolchain/usr/bin/ld) is GNU ld... no |
---|
630 | :info:configure checking whether the /usr/bin/clang++ linker (/Applications/Xcode.app/Contents/Developer/Toolchains/XcodeDefault.xctoolchain/usr/bin/ld) supports shared libraries... yes |
---|
631 | :info:configure checking for /usr/bin/clang++ option to produce PIC... -fno-common -DPIC |
---|
632 | :info:configure checking if /usr/bin/clang++ PIC flag -fno-common -DPIC works... yes |
---|
633 | :info:configure checking if /usr/bin/clang++ static flag -static works... no |
---|
634 | :info:configure checking if /usr/bin/clang++ supports -c -o file.o... yes |
---|
635 | :info:configure checking if /usr/bin/clang++ supports -c -o file.o... (cached) yes |
---|
636 | :info:configure checking whether the /usr/bin/clang++ linker (/Applications/Xcode.app/Contents/Developer/Toolchains/XcodeDefault.xctoolchain/usr/bin/ld) supports shared libraries... yes |
---|
637 | :info:configure checking dynamic linker characteristics... darwin14.4.0 dyld |
---|
638 | :info:configure checking how to hardcode library paths into programs... immediate |
---|
639 | :info:configure checking for gcc... (cached) /usr/bin/clang |
---|
640 | :info:configure checking whether we are using the GNU C compiler... (cached) yes |
---|
641 | :info:configure checking whether /usr/bin/clang accepts -g... (cached) yes |
---|
642 | :info:configure checking for /usr/bin/clang option to accept ISO C89... (cached) none needed |
---|
643 | :info:configure checking dependency style of /usr/bin/clang... (cached) gcc3 |
---|
644 | :info:configure checking how to run the C preprocessor... /usr/bin/clang -E |
---|
645 | :info:configure checking for a BSD-compatible install... /usr/bin/install -c |
---|
646 | :info:configure checking whether ln -s works... yes |
---|
647 | :info:configure checking whether make sets $(MAKE)... (cached) yes |
---|
648 | :info:configure checking for perl... /opt/local/bin/perl |
---|
649 | :info:configure checking for ANSI C header files... (cached) yes |
---|
650 | :info:configure checking err.h usability... yes |
---|
651 | :info:configure checking err.h presence... yes |
---|
652 | :info:configure checking for err.h... yes |
---|
653 | :info:configure checking for inttypes.h... (cached) yes |
---|
654 | :info:configure checking for unistd.h... (cached) yes |
---|
655 | :info:configure checking for stdint.h... (cached) yes |
---|
656 | :info:configure checking sys/param.h usability... yes |
---|
657 | :info:configure checking sys/param.h presence... yes |
---|
658 | :info:configure checking for sys/param.h... yes |
---|
659 | :info:configure checking sys/resource.h usability... yes |
---|
660 | :info:configure checking sys/resource.h presence... yes |
---|
661 | :info:configure checking for sys/resource.h... yes |
---|
662 | :info:configure checking for stdbool.h that conforms to C99... yes |
---|
663 | :info:configure checking for _Bool... yes |
---|
664 | :info:configure checking for an ANSI C-conforming const... yes |
---|
665 | :info:configure checking for uid_t in sys/types.h... yes |
---|
666 | :info:configure checking for mode_t... yes |
---|
667 | :info:configure checking for off_t... yes |
---|
668 | :info:configure checking for size_t... yes |
---|
669 | :info:configure checking for special C compiler options needed for large files... no |
---|
670 | :info:configure checking for _FILE_OFFSET_BITS value needed for large files... no |
---|
671 | :info:configure checking for working alloca.h... yes |
---|
672 | :info:configure checking for alloca... yes |
---|
673 | :info:configure checking for error_at_line... no |
---|
674 | :info:configure checking for _LARGEFILE_SOURCE value needed for large files... no |
---|
675 | :info:configure checking whether /usr/bin/clang needs -traditional... no |
---|
676 | :info:configure checking whether lstat dereferences a symlink specified with a trailing slash... no |
---|
677 | :info:configure checking whether lstat accepts an empty string... no |
---|
678 | :info:configure checking whether lstat dereferences a symlink specified with a trailing slash... (cached) no |
---|
679 | :info:configure checking sys/select.h usability... yes |
---|
680 | :info:configure checking sys/select.h presence... yes |
---|
681 | :info:configure checking for sys/select.h... yes |
---|
682 | :info:configure checking sys/socket.h usability... yes |
---|
683 | :info:configure checking sys/socket.h presence... yes |
---|
684 | :info:configure checking for sys/socket.h... yes |
---|
685 | :info:configure checking types of arguments for select... int,fd_set *,struct timeval * |
---|
686 | :info:configure checking utime.h usability... yes |
---|
687 | :info:configure checking utime.h presence... yes |
---|
688 | :info:configure checking for utime.h... yes |
---|
689 | :info:configure checking whether utime accepts a null argument... yes |
---|
690 | :info:configure checking for vprintf... yes |
---|
691 | :info:configure checking for _doprnt... no |
---|
692 | :info:configure checking for ishexnumber... yes |
---|
693 | :info:configure checking for err... yes |
---|
694 | :info:configure checking for errx... yes |
---|
695 | :info:configure checking for warn... yes |
---|
696 | :info:configure checking for warnx... yes |
---|
697 | :info:configure checking for vasprintf... yes |
---|
698 | :info:configure checking for getrusage... yes |
---|
699 | :info:configure checking for strlcpy... yes |
---|
700 | :info:configure checking for strlcat... yes |
---|
701 | :info:configure checking whether pthreads work with -pthread... yes |
---|
702 | :info:configure checking for joinable pthread attribute... PTHREAD_CREATE_JOINABLE |
---|
703 | :info:configure checking if more special flags are required for pthreads... -D_THREAD_SAFE |
---|
704 | :info:configure checking for main in -lstdc++... yes |
---|
705 | :info:configure checking for list... no |
---|
706 | :info:configure checking for map... no |
---|
707 | :info:configure checking for queue... no |
---|
708 | :info:configure checking for set... no |
---|
709 | :info:configure checking for stack... no |
---|
710 | :info:configure checking for streambuf... no |
---|
711 | :info:configure checking for string... no |
---|
712 | :info:configure checking for vector... no |
---|
713 | :info:configure checking for dlopen in -ldl... yes |
---|
714 | :info:configure checking afflib/afflib.h usability... no |
---|
715 | :info:configure checking afflib/afflib.h presence... no |
---|
716 | :info:configure checking for afflib/afflib.h... no |
---|
717 | :info:configure configure: checking for zlib |
---|
718 | :info:configure checking zlib.h usability... yes |
---|
719 | :info:configure checking zlib.h presence... yes |
---|
720 | :info:configure checking for zlib.h... yes |
---|
721 | :info:configure checking for inflate in -lz... yes |
---|
722 | :info:configure checking for dlopen in -ldl... (cached) yes |
---|
723 | :info:configure checking libewf.h usability... yes |
---|
724 | :info:configure checking libewf.h presence... yes |
---|
725 | :info:configure checking for libewf.h... yes |
---|
726 | :info:configure checking for libewf_get_version in -lewf... yes |
---|
727 | :info:configure checking for library containing dlopen... none required |
---|
728 | :info:configure checking for gcj... no |
---|
729 | :info:configure checking for guavac... no |
---|
730 | :info:configure checking for jikes... no |
---|
731 | :info:configure checking for javac... javac |
---|
732 | :info:configure checking if javac works... yes |
---|
733 | :info:configure checking for javac... /usr/bin/javac |
---|
734 | :info:configure checking symlink for /usr/bin/javac... /System/Library/Frameworks/JavaVM.framework/Versions/Current/Commands/javac |
---|
735 | :info:configure checking for kaffe... no |
---|
736 | :info:configure checking for java... java |
---|
737 | :info:configure checking for uudecode... yes |
---|
738 | :info:configure checking if uudecode can decode base 64 file... yes |
---|
739 | :info:configure checking if java works... yes |
---|
740 | :info:configure checking for ant... /opt/local/bin/ant |
---|
741 | :info:configure configure: creating ./config.status |
---|
742 | :info:configure config.status: creating Makefile |
---|
743 | :info:configure config.status: creating tsk/Makefile |
---|
744 | :info:configure config.status: creating tsk/base/Makefile |
---|
745 | :info:configure config.status: creating tsk/img/Makefile |
---|
746 | :info:configure config.status: creating tsk/vs/Makefile |
---|
747 | :info:configure config.status: creating tsk/fs/Makefile |
---|
748 | :info:configure config.status: creating tsk/hashdb/Makefile |
---|
749 | :info:configure config.status: creating tsk/auto/Makefile |
---|
750 | :info:configure config.status: creating tools/Makefile |
---|
751 | :info:configure config.status: creating tools/imgtools/Makefile |
---|
752 | :info:configure config.status: creating tools/vstools/Makefile |
---|
753 | :info:configure config.status: creating tools/fstools/Makefile |
---|
754 | :info:configure config.status: creating tools/hashtools/Makefile |
---|
755 | :info:configure config.status: creating tools/srchtools/Makefile |
---|
756 | :info:configure config.status: creating tools/autotools/Makefile |
---|
757 | :info:configure config.status: creating tools/sorter/Makefile |
---|
758 | :info:configure config.status: creating tools/timeline/Makefile |
---|
759 | :info:configure config.status: creating tools/fiwalk/Makefile |
---|
760 | :info:configure config.status: creating tools/fiwalk/src/Makefile |
---|
761 | :info:configure config.status: creating tools/fiwalk/plugins/Makefile |
---|
762 | :info:configure config.status: creating tests/Makefile |
---|
763 | :info:configure config.status: creating samples/Makefile |
---|
764 | :info:configure config.status: creating man/Makefile |
---|
765 | :info:configure config.status: creating bindings/java/Makefile |
---|
766 | :info:configure config.status: creating bindings/java/jni/Makefile |
---|
767 | :info:configure config.status: creating unit_tests/Makefile |
---|
768 | :info:configure config.status: creating unit_tests/base/Makefile |
---|
769 | :info:configure config.status: creating tsk/tsk_config.h |
---|
770 | :info:configure config.status: executing depfiles commands |
---|
771 | :info:configure config.status: executing libtool commands |
---|
772 | :info:configure config.status: executing tsk/tsk_incs.h commands |
---|
773 | :info:configure configure: |
---|
774 | :info:configure Building: |
---|
775 | :info:configure afflib support: no |
---|
776 | :info:configure libewf support: yes |
---|
777 | :info:configure zlib support: yes |
---|
778 | :info:configure |
---|
779 | :info:configure Features: |
---|
780 | :info:configure Java/JNI support: yes |
---|
781 | :info:configure |
---|
782 | :debug:configure Privilege de-escalation not attempted as not running as root. |
---|
783 | :debug:build build phase started at Tue Jul 21 18:07:30 CEST 2015 |
---|
784 | :notice:build ---> Building sleuthkit |
---|
785 | :debug:build Executing org.macports.build (sleuthkit) |
---|
786 | :debug:build Environment: |
---|
787 | CC_PRINT_OPTIONS='YES' |
---|
788 | CC_PRINT_OPTIONS_FILE='/opt/local/var/macports/build/_opt_local_var_macports_sources_rsync.macports.org_release_tarballs_ports_sysutils_sleuthkit/sleuthkit/work/.CC_PRINT_OPTIONS' |
---|
789 | CPATH='/opt/local/include' |
---|
790 | LIBRARY_PATH='/opt/local/lib' |
---|
791 | MACOSX_DEPLOYMENT_TARGET='10.10' |
---|
792 | :debug:build Assembled command: 'cd "/opt/local/var/macports/build/_opt_local_var_macports_sources_rsync.macports.org_release_tarballs_ports_sysutils_sleuthkit/sleuthkit/work/sleuthkit-4.1.3" && /usr/bin/make -j8 -w all' |
---|
793 | :debug:build Executing command line: cd "/opt/local/var/macports/build/_opt_local_var_macports_sources_rsync.macports.org_release_tarballs_ports_sysutils_sleuthkit/sleuthkit/work/sleuthkit-4.1.3" && /usr/bin/make -j8 -w all |
---|
794 | :info:build make: Entering directory `/opt/local/var/macports/build/_opt_local_var_macports_sources_rsync.macports.org_release_tarballs_ports_sysutils_sleuthkit/sleuthkit/work/sleuthkit-4.1.3' |
---|
795 | :info:build Making all in tsk |
---|
796 | :info:build make[1]: Entering directory `/opt/local/var/macports/build/_opt_local_var_macports_sources_rsync.macports.org_release_tarballs_ports_sysutils_sleuthkit/sleuthkit/work/sleuthkit-4.1.3/tsk' |
---|
797 | :info:build /Applications/Xcode.app/Contents/Developer/usr/bin/make all-recursive |
---|
798 | :info:build make[2]: Entering directory `/opt/local/var/macports/build/_opt_local_var_macports_sources_rsync.macports.org_release_tarballs_ports_sysutils_sleuthkit/sleuthkit/work/sleuthkit-4.1.3/tsk' |
---|
799 | :info:build Making all in base |
---|
800 | :info:build make[3]: Entering directory `/opt/local/var/macports/build/_opt_local_var_macports_sources_rsync.macports.org_release_tarballs_ports_sysutils_sleuthkit/sleuthkit/work/sleuthkit-4.1.3/tsk/base' |
---|
801 | :info:build /bin/sh ../../libtool --tag=CC --mode=compile /usr/bin/clang -DHAVE_CONFIG_H -I. -I../../tsk -I../.. -Wall -I/opt/local/include -D_THREAD_SAFE -pthread -pipe -Os -arch x86_64 -MT md5c.lo -MD -MP -MF .deps/md5c.Tpo -c -o md5c.lo md5c.c |
---|
802 | :info:build /bin/sh ../../libtool --tag=CC --mode=compile /usr/bin/clang -DHAVE_CONFIG_H -I. -I../../tsk -I../.. -Wall -I/opt/local/include -D_THREAD_SAFE -pthread -pipe -Os -arch x86_64 -MT mymalloc.lo -MD -MP -MF .deps/mymalloc.Tpo -c -o mymalloc.lo mymalloc.c |
---|
803 | :info:build /bin/sh ../../libtool --tag=CC --mode=compile /usr/bin/clang -DHAVE_CONFIG_H -I. -I../../tsk -I../.. -Wall -I/opt/local/include -D_THREAD_SAFE -pthread -pipe -Os -arch x86_64 -MT sha1c.lo -MD -MP -MF .deps/sha1c.Tpo -c -o sha1c.lo sha1c.c |
---|
804 | :info:build /bin/sh ../../libtool --tag=CC --mode=compile /usr/bin/clang -DHAVE_CONFIG_H -I. -I../../tsk -I../.. -Wall -I/opt/local/include -D_THREAD_SAFE -pthread -pipe -Os -arch x86_64 -MT crc.lo -MD -MP -MF .deps/crc.Tpo -c -o crc.lo crc.c |
---|
805 | :info:build /bin/sh ../../libtool --tag=CC --mode=compile /usr/bin/clang -DHAVE_CONFIG_H -I. -I../../tsk -I../.. -Wall -I/opt/local/include -D_THREAD_SAFE -pthread -pipe -Os -arch x86_64 -MT tsk_endian.lo -MD -MP -MF .deps/tsk_endian.Tpo -c -o tsk_endian.lo tsk_endian.c |
---|
806 | :info:build /bin/sh ../../libtool --tag=CC --mode=compile /usr/bin/clang -DHAVE_CONFIG_H -I. -I../../tsk -I../.. -Wall -I/opt/local/include -D_THREAD_SAFE -pthread -pipe -Os -arch x86_64 -MT tsk_error.lo -MD -MP -MF .deps/tsk_error.Tpo -c -o tsk_error.lo tsk_error.c |
---|
807 | :info:build /bin/sh ../../libtool --tag=CC --mode=compile /usr/bin/clang -DHAVE_CONFIG_H -I. -I../../tsk -I../.. -Wall -I/opt/local/include -D_THREAD_SAFE -pthread -pipe -Os -arch x86_64 -MT tsk_list.lo -MD -MP -MF .deps/tsk_list.Tpo -c -o tsk_list.lo tsk_list.c |
---|
808 | :info:build /bin/sh ../../libtool --tag=CC --mode=compile /usr/bin/clang -DHAVE_CONFIG_H -I. -I../../tsk -I../.. -Wall -I/opt/local/include -D_THREAD_SAFE -pthread -pipe -Os -arch x86_64 -MT tsk_parse.lo -MD -MP -MF .deps/tsk_parse.Tpo -c -o tsk_parse.lo tsk_parse.c |
---|
809 | :info:build libtool: compile: /usr/bin/clang -DHAVE_CONFIG_H -I. -I../../tsk -I../.. -Wall -I/opt/local/include -D_THREAD_SAFE -pthread -pipe -Os -arch x86_64 -MT md5c.lo -MD -MP -MF .deps/md5c.Tpo -c md5c.c -fno-common -DPIC -o .libs/md5c.o |
---|
810 | :info:build libtool: compile: /usr/bin/clang -DHAVE_CONFIG_H -I. -I../../tsk -I../.. -Wall -I/opt/local/include -D_THREAD_SAFE -pthread -pipe -Os -arch x86_64 -MT tsk_parse.lo -MD -MP -MF .deps/tsk_parse.Tpo -c tsk_parse.c -fno-common -DPIC -o .libs/tsk_parse.o |
---|
811 | :info:build libtool: compile: /usr/bin/clang -DHAVE_CONFIG_H -I. -I../../tsk -I../.. -Wall -I/opt/local/include -D_THREAD_SAFE -pthread -pipe -Os -arch x86_64 -MT mymalloc.lo -MD -MP -MF .deps/mymalloc.Tpo -c mymalloc.c -fno-common -DPIC -o .libs/mymalloc.o |
---|
812 | :info:build libtool: compile: /usr/bin/clang -DHAVE_CONFIG_H -I. -I../../tsk -I../.. -Wall -I/opt/local/include -D_THREAD_SAFE -pthread -pipe -Os -arch x86_64 -MT sha1c.lo -MD -MP -MF .deps/sha1c.Tpo -c sha1c.c -fno-common -DPIC -o .libs/sha1c.o |
---|
813 | :info:build libtool: compile: /usr/bin/clang -DHAVE_CONFIG_H -I. -I../../tsk -I../.. -Wall -I/opt/local/include -D_THREAD_SAFE -pthread -pipe -Os -arch x86_64 -MT tsk_error.lo -MD -MP -MF .deps/tsk_error.Tpo -c tsk_error.c -fno-common -DPIC -o .libs/tsk_error.o |
---|
814 | :info:build libtool: compile: /usr/bin/clang -DHAVE_CONFIG_H -I. -I../../tsk -I../.. -Wall -I/opt/local/include -D_THREAD_SAFE -pthread -pipe -Os -arch x86_64 -MT crc.lo -MD -MP -MF .deps/crc.Tpo -c crc.c -fno-common -DPIC -o .libs/crc.o |
---|
815 | :info:build libtool: compile: /usr/bin/clang -DHAVE_CONFIG_H -I. -I../../tsk -I../.. -Wall -I/opt/local/include -D_THREAD_SAFE -pthread -pipe -Os -arch x86_64 -MT tsk_list.lo -MD -MP -MF .deps/tsk_list.Tpo -c tsk_list.c -fno-common -DPIC -o .libs/tsk_list.o |
---|
816 | :info:build libtool: compile: /usr/bin/clang -DHAVE_CONFIG_H -I. -I../../tsk -I../.. -Wall -I/opt/local/include -D_THREAD_SAFE -pthread -pipe -Os -arch x86_64 -MT tsk_endian.lo -MD -MP -MF .deps/tsk_endian.Tpo -c tsk_endian.c -fno-common -DPIC -o .libs/tsk_endian.o |
---|
817 | :info:build tsk_error.c:184:39: warning: comparison of constant 2 with boolean expression is always true [-Wtautological-constant-out-of-range-compare] |
---|
818 | :info:build if ((TSK_ERR_MASK && t_errno) < TSK_ERR_AUX_MAX) |
---|
819 | :info:build ~~~~~~~~~~~~~~~~~~~~~~~~~ ^ ~~~~~~~~~~~~~~~ |
---|
820 | :info:build libtool: compile: /usr/bin/clang -DHAVE_CONFIG_H -I. -I../../tsk -I../.. -Wall -I/opt/local/include -D_THREAD_SAFE -pthread -pipe -Os -arch x86_64 -MT crc.lo -MD -MP -MF .deps/crc.Tpo -c crc.c -o crc.o >/dev/null 2>&1 |
---|
821 | :info:build libtool: compile: /usr/bin/clang -DHAVE_CONFIG_H -I. -I../../tsk -I../.. -Wall -I/opt/local/include -D_THREAD_SAFE -pthread -pipe -Os -arch x86_64 -MT tsk_parse.lo -MD -MP -MF .deps/tsk_parse.Tpo -c tsk_parse.c -o tsk_parse.o >/dev/null 2>&1 |
---|
822 | :info:build libtool: compile: /usr/bin/clang -DHAVE_CONFIG_H -I. -I../../tsk -I../.. -Wall -I/opt/local/include -D_THREAD_SAFE -pthread -pipe -Os -arch x86_64 -MT mymalloc.lo -MD -MP -MF .deps/mymalloc.Tpo -c mymalloc.c -o mymalloc.o >/dev/null 2>&1 |
---|
823 | :info:build libtool: compile: /usr/bin/clang -DHAVE_CONFIG_H -I. -I../../tsk -I../.. -Wall -I/opt/local/include -D_THREAD_SAFE -pthread -pipe -Os -arch x86_64 -MT tsk_endian.lo -MD -MP -MF .deps/tsk_endian.Tpo -c tsk_endian.c -o tsk_endian.o >/dev/null 2>&1 |
---|
824 | :info:build libtool: compile: /usr/bin/clang -DHAVE_CONFIG_H -I. -I../../tsk -I../.. -Wall -I/opt/local/include -D_THREAD_SAFE -pthread -pipe -Os -arch x86_64 -MT tsk_list.lo -MD -MP -MF .deps/tsk_list.Tpo -c tsk_list.c -o tsk_list.o >/dev/null 2>&1 |
---|
825 | :info:build 1 warning generated. |
---|
826 | :info:build libtool: compile: /usr/bin/clang -DHAVE_CONFIG_H -I. -I../../tsk -I../.. -Wall -I/opt/local/include -D_THREAD_SAFE -pthread -pipe -Os -arch x86_64 -MT tsk_error.lo -MD -MP -MF .deps/tsk_error.Tpo -c tsk_error.c -o tsk_error.o >/dev/null 2>&1 |
---|
827 | :info:build mv -f .deps/crc.Tpo .deps/crc.Plo |
---|
828 | :info:build /bin/sh ../../libtool --tag=CC --mode=compile /usr/bin/clang -DHAVE_CONFIG_H -I. -I../../tsk -I../.. -Wall -I/opt/local/include -D_THREAD_SAFE -pthread -pipe -Os -arch x86_64 -MT tsk_printf.lo -MD -MP -MF .deps/tsk_printf.Tpo -c -o tsk_printf.lo tsk_printf.c |
---|
829 | :info:build mv -f .deps/tsk_endian.Tpo .deps/tsk_endian.Plo |
---|
830 | :info:build mv -f .deps/tsk_parse.Tpo .deps/tsk_parse.Plo |
---|
831 | :info:build mv -f .deps/mymalloc.Tpo .deps/mymalloc.Plo |
---|
832 | :info:build /bin/sh ../../libtool --tag=CC --mode=compile /usr/bin/clang -DHAVE_CONFIG_H -I. -I../../tsk -I../.. -Wall -I/opt/local/include -D_THREAD_SAFE -pthread -pipe -Os -arch x86_64 -MT tsk_unicode.lo -MD -MP -MF .deps/tsk_unicode.Tpo -c -o tsk_unicode.lo tsk_unicode.c |
---|
833 | :info:build mv -f .deps/tsk_list.Tpo .deps/tsk_list.Plo |
---|
834 | :info:build /bin/sh ../../libtool --tag=CC --mode=compile /usr/bin/clang -DHAVE_CONFIG_H -I. -I../../tsk -I../.. -Wall -I/opt/local/include -D_THREAD_SAFE -pthread -pipe -Os -arch x86_64 -MT tsk_version.lo -MD -MP -MF .deps/tsk_version.Tpo -c -o tsk_version.lo tsk_version.c |
---|
835 | :info:build /bin/sh ../../libtool --tag=CC --mode=compile /usr/bin/clang -DHAVE_CONFIG_H -I. -I../../tsk -I../.. -Wall -I/opt/local/include -D_THREAD_SAFE -pthread -pipe -Os -arch x86_64 -MT tsk_stack.lo -MD -MP -MF .deps/tsk_stack.Tpo -c -o tsk_stack.lo tsk_stack.c |
---|
836 | :info:build /bin/sh ../../libtool --tag=CC --mode=compile /usr/bin/clang -DHAVE_CONFIG_H -I. -I../../tsk -I../.. -Wall -I/opt/local/include -D_THREAD_SAFE -pthread -pipe -Os -arch x86_64 -MT XGetopt.lo -MD -MP -MF .deps/XGetopt.Tpo -c -o XGetopt.lo XGetopt.c |
---|
837 | :info:build libtool: compile: /usr/bin/clang -DHAVE_CONFIG_H -I. -I../../tsk -I../.. -Wall -I/opt/local/include -D_THREAD_SAFE -pthread -pipe -Os -arch x86_64 -MT tsk_printf.lo -MD -MP -MF .deps/tsk_printf.Tpo -c tsk_printf.c -fno-common -DPIC -o .libs/tsk_printf.o |
---|
838 | :info:build libtool: compile: /usr/bin/clang -DHAVE_CONFIG_H -I. -I../../tsk -I../.. -Wall -I/opt/local/include -D_THREAD_SAFE -pthread -pipe -Os -arch x86_64 -MT tsk_unicode.lo -MD -MP -MF .deps/tsk_unicode.Tpo -c tsk_unicode.c -fno-common -DPIC -o .libs/tsk_unicode.o |
---|
839 | :info:build libtool: compile: /usr/bin/clang -DHAVE_CONFIG_H -I. -I../../tsk -I../.. -Wall -I/opt/local/include -D_THREAD_SAFE -pthread -pipe -Os -arch x86_64 -MT tsk_version.lo -MD -MP -MF .deps/tsk_version.Tpo -c tsk_version.c -fno-common -DPIC -o .libs/tsk_version.o |
---|
840 | :info:build libtool: compile: /usr/bin/clang -DHAVE_CONFIG_H -I. -I../../tsk -I../.. -Wall -I/opt/local/include -D_THREAD_SAFE -pthread -pipe -Os -arch x86_64 -MT tsk_stack.lo -MD -MP -MF .deps/tsk_stack.Tpo -c tsk_stack.c -fno-common -DPIC -o .libs/tsk_stack.o |
---|
841 | :info:build libtool: compile: /usr/bin/clang -DHAVE_CONFIG_H -I. -I../../tsk -I../.. -Wall -I/opt/local/include -D_THREAD_SAFE -pthread -pipe -Os -arch x86_64 -MT XGetopt.lo -MD -MP -MF .deps/XGetopt.Tpo -c XGetopt.c -fno-common -DPIC -o .libs/XGetopt.o |
---|
842 | :info:build mv -f .deps/tsk_error.Tpo .deps/tsk_error.Plo |
---|
843 | :info:build /bin/sh ../../libtool --tag=CC --mode=compile /usr/bin/clang -DHAVE_CONFIG_H -I. -I../../tsk -I../.. -Wall -I/opt/local/include -D_THREAD_SAFE -pthread -pipe -Os -arch x86_64 -MT tsk_lock.lo -MD -MP -MF .deps/tsk_lock.Tpo -c -o tsk_lock.lo tsk_lock.c |
---|
844 | :info:build libtool: compile: /usr/bin/clang -DHAVE_CONFIG_H -I. -I../../tsk -I../.. -Wall -I/opt/local/include -D_THREAD_SAFE -pthread -pipe -Os -arch x86_64 -MT md5c.lo -MD -MP -MF .deps/md5c.Tpo -c md5c.c -o md5c.o >/dev/null 2>&1 |
---|
845 | :info:build libtool: compile: /usr/bin/clang -DHAVE_CONFIG_H -I. -I../../tsk -I../.. -Wall -I/opt/local/include -D_THREAD_SAFE -pthread -pipe -Os -arch x86_64 -MT tsk_printf.lo -MD -MP -MF .deps/tsk_printf.Tpo -c tsk_printf.c -o tsk_printf.o >/dev/null 2>&1 |
---|
846 | :info:build libtool: compile: /usr/bin/clang -DHAVE_CONFIG_H -I. -I../../tsk -I../.. -Wall -I/opt/local/include -D_THREAD_SAFE -pthread -pipe -Os -arch x86_64 -MT XGetopt.lo -MD -MP -MF .deps/XGetopt.Tpo -c XGetopt.c -o XGetopt.o >/dev/null 2>&1 |
---|
847 | :info:build libtool: compile: /usr/bin/clang -DHAVE_CONFIG_H -I. -I../../tsk -I../.. -Wall -I/opt/local/include -D_THREAD_SAFE -pthread -pipe -Os -arch x86_64 -MT tsk_version.lo -MD -MP -MF .deps/tsk_version.Tpo -c tsk_version.c -o tsk_version.o >/dev/null 2>&1 |
---|
848 | :info:build libtool: compile: /usr/bin/clang -DHAVE_CONFIG_H -I. -I../../tsk -I../.. -Wall -I/opt/local/include -D_THREAD_SAFE -pthread -pipe -Os -arch x86_64 -MT tsk_stack.lo -MD -MP -MF .deps/tsk_stack.Tpo -c tsk_stack.c -o tsk_stack.o >/dev/null 2>&1 |
---|
849 | :info:build libtool: compile: /usr/bin/clang -DHAVE_CONFIG_H -I. -I../../tsk -I../.. -Wall -I/opt/local/include -D_THREAD_SAFE -pthread -pipe -Os -arch x86_64 -MT tsk_lock.lo -MD -MP -MF .deps/tsk_lock.Tpo -c tsk_lock.c -fno-common -DPIC -o .libs/tsk_lock.o |
---|
850 | :info:build mv -f .deps/tsk_printf.Tpo .deps/tsk_printf.Plo |
---|
851 | :info:build /bin/sh ../../libtool --tag=CXX --mode=compile /usr/bin/clang++ -DHAVE_CONFIG_H -I. -I../../tsk -I../.. -Wall -I/opt/local/include -D_THREAD_SAFE -pthread -pipe -Os -arch x86_64 -stdlib=libc++ -MT tsk_error_win32.lo -MD -MP -MF .deps/tsk_error_win32.Tpo -c -o tsk_error_win32.lo tsk_error_win32.cpp |
---|
852 | :info:build mv -f .deps/XGetopt.Tpo .deps/XGetopt.Plo |
---|
853 | :info:build mv -f .deps/tsk_version.Tpo .deps/tsk_version.Plo |
---|
854 | :info:build libtool: compile: /usr/bin/clang -DHAVE_CONFIG_H -I. -I../../tsk -I../.. -Wall -I/opt/local/include -D_THREAD_SAFE -pthread -pipe -Os -arch x86_64 -MT tsk_lock.lo -MD -MP -MF .deps/tsk_lock.Tpo -c tsk_lock.c -o tsk_lock.o >/dev/null 2>&1 |
---|
855 | :info:build mv -f .deps/tsk_stack.Tpo .deps/tsk_stack.Plo |
---|
856 | :info:build libtool: compile: /usr/bin/clang -DHAVE_CONFIG_H -I. -I../../tsk -I../.. -Wall -I/opt/local/include -D_THREAD_SAFE -pthread -pipe -Os -arch x86_64 -MT tsk_unicode.lo -MD -MP -MF .deps/tsk_unicode.Tpo -c tsk_unicode.c -o tsk_unicode.o >/dev/null 2>&1 |
---|
857 | :info:build libtool: compile: /usr/bin/clang -DHAVE_CONFIG_H -I. -I../../tsk -I../.. -Wall -I/opt/local/include -D_THREAD_SAFE -pthread -pipe -Os -arch x86_64 -MT sha1c.lo -MD -MP -MF .deps/sha1c.Tpo -c sha1c.c -o sha1c.o >/dev/null 2>&1 |
---|
858 | :info:build libtool: compile: /usr/bin/clang++ -DHAVE_CONFIG_H -I. -I../../tsk -I../.. -Wall -I/opt/local/include -D_THREAD_SAFE -pthread -pipe -Os -arch x86_64 -stdlib=libc++ -MT tsk_error_win32.lo -MD -MP -MF .deps/tsk_error_win32.Tpo -c tsk_error_win32.cpp -fno-common -DPIC -o .libs/tsk_error_win32.o |
---|
859 | :info:build mv -f .deps/tsk_lock.Tpo .deps/tsk_lock.Plo |
---|
860 | :info:build mv -f .deps/md5c.Tpo .deps/md5c.Plo |
---|
861 | :info:build libtool: compile: /usr/bin/clang++ -DHAVE_CONFIG_H -I. -I../../tsk -I../.. -Wall -I/opt/local/include -D_THREAD_SAFE -pthread -pipe -Os -arch x86_64 -stdlib=libc++ -MT tsk_error_win32.lo -MD -MP -MF .deps/tsk_error_win32.Tpo -c tsk_error_win32.cpp -o tsk_error_win32.o >/dev/null 2>&1 |
---|
862 | :info:build mv -f .deps/tsk_unicode.Tpo .deps/tsk_unicode.Plo |
---|
863 | :info:build mv -f .deps/tsk_error_win32.Tpo .deps/tsk_error_win32.Plo |
---|
864 | :info:build mv -f .deps/sha1c.Tpo .deps/sha1c.Plo |
---|
865 | :info:build /bin/sh ../../libtool --tag=CXX --mode=link /usr/bin/clang++ -pipe -Os -arch x86_64 -stdlib=libc++ -L/opt/local/lib -Wl,-headerpad_max_install_names -arch x86_64 -D_THREAD_SAFE -pthread -o libtskbase.la md5c.lo mymalloc.lo sha1c.lo crc.lo tsk_endian.lo tsk_error.lo tsk_list.lo tsk_parse.lo tsk_printf.lo tsk_unicode.lo tsk_version.lo tsk_stack.lo XGetopt.lo tsk_lock.lo tsk_error_win32.lo -lewf -ldl -lz -ldl -lstdc++ |
---|
866 | :info:build libtool: link: ar cru .libs/libtskbase.a .libs/md5c.o .libs/mymalloc.o .libs/sha1c.o .libs/crc.o .libs/tsk_endian.o .libs/tsk_error.o .libs/tsk_list.o .libs/tsk_parse.o .libs/tsk_printf.o .libs/tsk_unicode.o .libs/tsk_version.o .libs/tsk_stack.o .libs/XGetopt.o .libs/tsk_lock.o .libs/tsk_error_win32.o |
---|
867 | :info:build /opt/local/bin/ranlib: file: .libs/libtskbase.a(XGetopt.o) has no symbols |
---|
868 | :info:build /opt/local/bin/ranlib: file: .libs/libtskbase.a(tsk_error_win32.o) has no symbols |
---|
869 | :info:build libtool: link: ranlib .libs/libtskbase.a |
---|
870 | :info:build ranlib: file: .libs/libtskbase.a(XGetopt.o) has no symbols |
---|
871 | :info:build ranlib: file: .libs/libtskbase.a(tsk_error_win32.o) has no symbols |
---|
872 | :info:build libtool: link: ( cd ".libs" && rm -f "libtskbase.la" && ln -s "../libtskbase.la" "libtskbase.la" ) |
---|
873 | :info:build make[3]: Leaving directory `/opt/local/var/macports/build/_opt_local_var_macports_sources_rsync.macports.org_release_tarballs_ports_sysutils_sleuthkit/sleuthkit/work/sleuthkit-4.1.3/tsk/base' |
---|
874 | :info:build Making all in img |
---|
875 | :info:build make[3]: Entering directory `/opt/local/var/macports/build/_opt_local_var_macports_sources_rsync.macports.org_release_tarballs_ports_sysutils_sleuthkit/sleuthkit/work/sleuthkit-4.1.3/tsk/img' |
---|
876 | :info:build /bin/sh ../../libtool --tag=CC --mode=compile /usr/bin/clang -DHAVE_CONFIG_H -I. -I../../tsk -I../.. -I./../.. -Wall -I/opt/local/include -D_THREAD_SAFE -pthread -pipe -Os -arch x86_64 -MT img_open.lo -MD -MP -MF .deps/img_open.Tpo -c -o img_open.lo img_open.c |
---|
877 | :info:build /bin/sh ../../libtool --tag=CC --mode=compile /usr/bin/clang -DHAVE_CONFIG_H -I. -I../../tsk -I../.. -I./../.. -Wall -I/opt/local/include -D_THREAD_SAFE -pthread -pipe -Os -arch x86_64 -MT img_types.lo -MD -MP -MF .deps/img_types.Tpo -c -o img_types.lo img_types.c |
---|
878 | :info:build /bin/sh ../../libtool --tag=CC --mode=compile /usr/bin/clang -DHAVE_CONFIG_H -I. -I../../tsk -I../.. -I./../.. -Wall -I/opt/local/include -D_THREAD_SAFE -pthread -pipe -Os -arch x86_64 -MT raw.lo -MD -MP -MF .deps/raw.Tpo -c -o raw.lo raw.c |
---|
879 | :info:build /bin/sh ../../libtool --tag=CC --mode=compile /usr/bin/clang -DHAVE_CONFIG_H -I. -I../../tsk -I../.. -I./../.. -Wall -I/opt/local/include -D_THREAD_SAFE -pthread -pipe -Os -arch x86_64 -MT aff.lo -MD -MP -MF .deps/aff.Tpo -c -o aff.lo aff.c |
---|
880 | :info:build /bin/sh ../../libtool --tag=CC --mode=compile /usr/bin/clang -DHAVE_CONFIG_H -I. -I../../tsk -I../.. -I./../.. -Wall -I/opt/local/include -D_THREAD_SAFE -pthread -pipe -Os -arch x86_64 -MT ewf.lo -MD -MP -MF .deps/ewf.Tpo -c -o ewf.lo ewf.c |
---|
881 | :info:build /bin/sh ../../libtool --tag=CC --mode=compile /usr/bin/clang -DHAVE_CONFIG_H -I. -I../../tsk -I../.. -I./../.. -Wall -I/opt/local/include -D_THREAD_SAFE -pthread -pipe -Os -arch x86_64 -MT img_io.lo -MD -MP -MF .deps/img_io.Tpo -c -o img_io.lo img_io.c |
---|
882 | :info:build /bin/sh ../../libtool --tag=CC --mode=compile /usr/bin/clang -DHAVE_CONFIG_H -I. -I../../tsk -I../.. -I./../.. -Wall -I/opt/local/include -D_THREAD_SAFE -pthread -pipe -Os -arch x86_64 -MT mult_files.lo -MD -MP -MF .deps/mult_files.Tpo -c -o mult_files.lo mult_files.c |
---|
883 | :info:build libtool: compile: /usr/bin/clang -DHAVE_CONFIG_H -I. -I../../tsk -I../.. -I./../.. -Wall -I/opt/local/include -D_THREAD_SAFE -pthread -pipe -Os -arch x86_64 -MT img_open.lo -MD -MP -MF .deps/img_open.Tpo -c img_open.c -fno-common -DPIC -o .libs/img_open.o |
---|
884 | :info:build libtool: compile: /usr/bin/clang -DHAVE_CONFIG_H -I. -I../../tsk -I../.. -I./../.. -Wall -I/opt/local/include -D_THREAD_SAFE -pthread -pipe -Os -arch x86_64 -MT raw.lo -MD -MP -MF .deps/raw.Tpo -c raw.c -fno-common -DPIC -o .libs/raw.o |
---|
885 | :info:build libtool: compile: /usr/bin/clang -DHAVE_CONFIG_H -I. -I../../tsk -I../.. -I./../.. -Wall -I/opt/local/include -D_THREAD_SAFE -pthread -pipe -Os -arch x86_64 -MT img_types.lo -MD -MP -MF .deps/img_types.Tpo -c img_types.c -fno-common -DPIC -o .libs/img_types.o |
---|
886 | :info:build libtool: compile: /usr/bin/clang -DHAVE_CONFIG_H -I. -I../../tsk -I../.. -I./../.. -Wall -I/opt/local/include -D_THREAD_SAFE -pthread -pipe -Os -arch x86_64 -MT aff.lo -MD -MP -MF .deps/aff.Tpo -c aff.c -fno-common -DPIC -o .libs/aff.o |
---|
887 | :info:build libtool: compile: /usr/bin/clang -DHAVE_CONFIG_H -I. -I../../tsk -I../.. -I./../.. -Wall -I/opt/local/include -D_THREAD_SAFE -pthread -pipe -Os -arch x86_64 -MT img_io.lo -MD -MP -MF .deps/img_io.Tpo -c img_io.c -fno-common -DPIC -o .libs/img_io.o |
---|
888 | :info:build libtool: compile: /usr/bin/clang -DHAVE_CONFIG_H -I. -I../../tsk -I../.. -I./../.. -Wall -I/opt/local/include -D_THREAD_SAFE -pthread -pipe -Os -arch x86_64 -MT mult_files.lo -MD -MP -MF .deps/mult_files.Tpo -c mult_files.c -fno-common -DPIC -o .libs/mult_files.o |
---|
889 | :info:build libtool: compile: /usr/bin/clang -DHAVE_CONFIG_H -I. -I../../tsk -I../.. -I./../.. -Wall -I/opt/local/include -D_THREAD_SAFE -pthread -pipe -Os -arch x86_64 -MT ewf.lo -MD -MP -MF .deps/ewf.Tpo -c ewf.c -fno-common -DPIC -o .libs/ewf.o |
---|
890 | :info:build img_open.c:455:24: warning: returning 'TSK_TCHAR **' (aka 'char **') from a function with result type 'const TSK_TCHAR **' (aka 'const char **') discards qualifiers in nested pointer types [-Wincompatible-pointer-types-discards-qualifiers] |
---|
891 | :info:build return raw_info->images; |
---|
892 | :info:build ^~~~~~~~~~~~~~~~ |
---|
893 | :info:build img_open.c:462:24: warning: returning 'TSK_TCHAR **' (aka 'char **') from a function with result type 'const TSK_TCHAR **' (aka 'const char **') discards qualifiers in nested pointer types [-Wincompatible-pointer-types-discards-qualifiers] |
---|
894 | :info:build return ewf_info->images; |
---|
895 | :info:build ^~~~~~~~~~~~~~~~ |
---|
896 | :info:build libtool: compile: /usr/bin/clang -DHAVE_CONFIG_H -I. -I../../tsk -I../.. -I./../.. -Wall -I/opt/local/include -D_THREAD_SAFE -pthread -pipe -Os -arch x86_64 -MT aff.lo -MD -MP -MF .deps/aff.Tpo -c aff.c -o aff.o >/dev/null 2>&1 |
---|
897 | :info:build 2 warnings generated. |
---|
898 | :info:build libtool: compile: /usr/bin/clang -DHAVE_CONFIG_H -I. -I../../tsk -I../.. -I./../.. -Wall -I/opt/local/include -D_THREAD_SAFE -pthread -pipe -Os -arch x86_64 -MT img_io.lo -MD -MP -MF .deps/img_io.Tpo -c img_io.c -o img_io.o >/dev/null 2>&1 |
---|
899 | :info:build libtool: compile: /usr/bin/clang -DHAVE_CONFIG_H -I. -I../../tsk -I../.. -I./../.. -Wall -I/opt/local/include -D_THREAD_SAFE -pthread -pipe -Os -arch x86_64 -MT img_types.lo -MD -MP -MF .deps/img_types.Tpo -c img_types.c -o img_types.o >/dev/null 2>&1 |
---|
900 | :info:build libtool: compile: /usr/bin/clang -DHAVE_CONFIG_H -I. -I../../tsk -I../.. -I./../.. -Wall -I/opt/local/include -D_THREAD_SAFE -pthread -pipe -Os -arch x86_64 -MT img_open.lo -MD -MP -MF .deps/img_open.Tpo -c img_open.c -o img_open.o >/dev/null 2>&1 |
---|
901 | :info:build libtool: compile: /usr/bin/clang -DHAVE_CONFIG_H -I. -I../../tsk -I../.. -I./../.. -Wall -I/opt/local/include -D_THREAD_SAFE -pthread -pipe -Os -arch x86_64 -MT mult_files.lo -MD -MP -MF .deps/mult_files.Tpo -c mult_files.c -o mult_files.o >/dev/null 2>&1 |
---|
902 | :info:build libtool: compile: /usr/bin/clang -DHAVE_CONFIG_H -I. -I../../tsk -I../.. -I./../.. -Wall -I/opt/local/include -D_THREAD_SAFE -pthread -pipe -Os -arch x86_64 -MT ewf.lo -MD -MP -MF .deps/ewf.Tpo -c ewf.c -o ewf.o >/dev/null 2>&1 |
---|
903 | :info:build mv -f .deps/aff.Tpo .deps/aff.Plo |
---|
904 | :info:build libtool: compile: /usr/bin/clang -DHAVE_CONFIG_H -I. -I../../tsk -I../.. -I./../.. -Wall -I/opt/local/include -D_THREAD_SAFE -pthread -pipe -Os -arch x86_64 -MT raw.lo -MD -MP -MF .deps/raw.Tpo -c raw.c -o raw.o >/dev/null 2>&1 |
---|
905 | :info:build mv -f .deps/img_io.Tpo .deps/img_io.Plo |
---|
906 | :info:build mv -f .deps/img_types.Tpo .deps/img_types.Plo |
---|
907 | :info:build mv -f .deps/img_open.Tpo .deps/img_open.Plo |
---|
908 | :info:build mv -f .deps/mult_files.Tpo .deps/mult_files.Plo |
---|
909 | :info:build mv -f .deps/ewf.Tpo .deps/ewf.Plo |
---|
910 | :info:build mv -f .deps/raw.Tpo .deps/raw.Plo |
---|
911 | :info:build /bin/sh ../../libtool --tag=CC --mode=link /usr/bin/clang -pipe -Os -arch x86_64 -L/opt/local/lib -Wl,-headerpad_max_install_names -arch x86_64 -D_THREAD_SAFE -pthread -o libtskimg.la img_open.lo img_types.lo raw.lo aff.lo ewf.lo img_io.lo mult_files.lo -lewf -ldl -lz -ldl -lstdc++ |
---|
912 | :info:build libtool: link: ar cru .libs/libtskimg.a .libs/img_open.o .libs/img_types.o .libs/raw.o .libs/aff.o .libs/ewf.o .libs/img_io.o .libs/mult_files.o |
---|
913 | :info:build /opt/local/bin/ranlib: file: .libs/libtskimg.a(aff.o) has no symbols |
---|
914 | :info:build libtool: link: ranlib .libs/libtskimg.a |
---|
915 | :info:build ranlib: file: .libs/libtskimg.a(aff.o) has no symbols |
---|
916 | :info:build libtool: link: ( cd ".libs" && rm -f "libtskimg.la" && ln -s "../libtskimg.la" "libtskimg.la" ) |
---|
917 | :info:build make[3]: Leaving directory `/opt/local/var/macports/build/_opt_local_var_macports_sources_rsync.macports.org_release_tarballs_ports_sysutils_sleuthkit/sleuthkit/work/sleuthkit-4.1.3/tsk/img' |
---|
918 | :info:build Making all in vs |
---|
919 | :info:build make[3]: Entering directory `/opt/local/var/macports/build/_opt_local_var_macports_sources_rsync.macports.org_release_tarballs_ports_sysutils_sleuthkit/sleuthkit/work/sleuthkit-4.1.3/tsk/vs' |
---|
920 | :info:build /bin/sh ../../libtool --tag=CC --mode=compile /usr/bin/clang -DHAVE_CONFIG_H -I. -I../../tsk -I../.. -I./../.. -Wall -I/opt/local/include -D_THREAD_SAFE -pthread -pipe -Os -arch x86_64 -MT mm_open.lo -MD -MP -MF .deps/mm_open.Tpo -c -o mm_open.lo mm_open.c |
---|
921 | :info:build /bin/sh ../../libtool --tag=CC --mode=compile /usr/bin/clang -DHAVE_CONFIG_H -I. -I../../tsk -I../.. -I./../.. -Wall -I/opt/local/include -D_THREAD_SAFE -pthread -pipe -Os -arch x86_64 -MT mm_part.lo -MD -MP -MF .deps/mm_part.Tpo -c -o mm_part.lo mm_part.c |
---|
922 | :info:build /bin/sh ../../libtool --tag=CC --mode=compile /usr/bin/clang -DHAVE_CONFIG_H -I. -I../../tsk -I../.. -I./../.. -Wall -I/opt/local/include -D_THREAD_SAFE -pthread -pipe -Os -arch x86_64 -MT mm_types.lo -MD -MP -MF .deps/mm_types.Tpo -c -o mm_types.lo mm_types.c |
---|
923 | :info:build /bin/sh ../../libtool --tag=CC --mode=compile /usr/bin/clang -DHAVE_CONFIG_H -I. -I../../tsk -I../.. -I./../.. -Wall -I/opt/local/include -D_THREAD_SAFE -pthread -pipe -Os -arch x86_64 -MT mm_io.lo -MD -MP -MF .deps/mm_io.Tpo -c -o mm_io.lo mm_io.c |
---|
924 | :info:build /bin/sh ../../libtool --tag=CC --mode=compile /usr/bin/clang -DHAVE_CONFIG_H -I. -I../../tsk -I../.. -I./../.. -Wall -I/opt/local/include -D_THREAD_SAFE -pthread -pipe -Os -arch x86_64 -MT bsd.lo -MD -MP -MF .deps/bsd.Tpo -c -o bsd.lo bsd.c |
---|
925 | :info:build /bin/sh ../../libtool --tag=CC --mode=compile /usr/bin/clang -DHAVE_CONFIG_H -I. -I../../tsk -I../.. -I./../.. -Wall -I/opt/local/include -D_THREAD_SAFE -pthread -pipe -Os -arch x86_64 -MT dos.lo -MD -MP -MF .deps/dos.Tpo -c -o dos.lo dos.c |
---|
926 | :info:build /bin/sh ../../libtool --tag=CC --mode=compile /usr/bin/clang -DHAVE_CONFIG_H -I. -I../../tsk -I../.. -I./../.. -Wall -I/opt/local/include -D_THREAD_SAFE -pthread -pipe -Os -arch x86_64 -MT gpt.lo -MD -MP -MF .deps/gpt.Tpo -c -o gpt.lo gpt.c |
---|
927 | :info:build /bin/sh ../../libtool --tag=CC --mode=compile /usr/bin/clang -DHAVE_CONFIG_H -I. -I../../tsk -I../.. -I./../.. -Wall -I/opt/local/include -D_THREAD_SAFE -pthread -pipe -Os -arch x86_64 -MT mac.lo -MD -MP -MF .deps/mac.Tpo -c -o mac.lo mac.c |
---|
928 | :info:build libtool: compile: /usr/bin/clang -DHAVE_CONFIG_H -I. -I../../tsk -I../.. -I./../.. -Wall -I/opt/local/include -D_THREAD_SAFE -pthread -pipe -Os -arch x86_64 -MT mm_part.lo -MD -MP -MF .deps/mm_part.Tpo -c mm_part.c -fno-common -DPIC -o .libs/mm_part.o |
---|
929 | :info:build libtool: compile: /usr/bin/clang -DHAVE_CONFIG_H -I. -I../../tsk -I../.. -I./../.. -Wall -I/opt/local/include -D_THREAD_SAFE -pthread -pipe -Os -arch x86_64 -MT mm_types.lo -MD -MP -MF .deps/mm_types.Tpo -c mm_types.c -fno-common -DPIC -o .libs/mm_types.o |
---|
930 | :info:build libtool: compile: /usr/bin/clang -DHAVE_CONFIG_H -I. -I../../tsk -I../.. -I./../.. -Wall -I/opt/local/include -D_THREAD_SAFE -pthread -pipe -Os -arch x86_64 -MT bsd.lo -MD -MP -MF .deps/bsd.Tpo -c bsd.c -fno-common -DPIC -o .libs/bsd.o |
---|
931 | :info:build libtool: compile: /usr/bin/clang -DHAVE_CONFIG_H -I. -I../../tsk -I../.. -I./../.. -Wall -I/opt/local/include -D_THREAD_SAFE -pthread -pipe -Os -arch x86_64 -MT mm_open.lo -MD -MP -MF .deps/mm_open.Tpo -c mm_open.c -fno-common -DPIC -o .libs/mm_open.o |
---|
932 | :info:build libtool: compile: /usr/bin/clang -DHAVE_CONFIG_H -I. -I../../tsk -I../.. -I./../.. -Wall -I/opt/local/include -D_THREAD_SAFE -pthread -pipe -Os -arch x86_64 -MT mm_io.lo -MD -MP -MF .deps/mm_io.Tpo -c mm_io.c -fno-common -DPIC -o .libs/mm_io.o |
---|
933 | :info:build libtool: compile: /usr/bin/clang -DHAVE_CONFIG_H -I. -I../../tsk -I../.. -I./../.. -Wall -I/opt/local/include -D_THREAD_SAFE -pthread -pipe -Os -arch x86_64 -MT dos.lo -MD -MP -MF .deps/dos.Tpo -c dos.c -fno-common -DPIC -o .libs/dos.o |
---|
934 | :info:build libtool: compile: /usr/bin/clang -DHAVE_CONFIG_H -I. -I../../tsk -I../.. -I./../.. -Wall -I/opt/local/include -D_THREAD_SAFE -pthread -pipe -Os -arch x86_64 -MT mac.lo -MD -MP -MF .deps/mac.Tpo -c mac.c -fno-common -DPIC -o .libs/mac.o |
---|
935 | :info:build libtool: compile: /usr/bin/clang -DHAVE_CONFIG_H -I. -I../../tsk -I../.. -I./../.. -Wall -I/opt/local/include -D_THREAD_SAFE -pthread -pipe -Os -arch x86_64 -MT gpt.lo -MD -MP -MF .deps/gpt.Tpo -c gpt.c -fno-common -DPIC -o .libs/gpt.o |
---|
936 | :info:build libtool: compile: /usr/bin/clang -DHAVE_CONFIG_H -I. -I../../tsk -I../.. -I./../.. -Wall -I/opt/local/include -D_THREAD_SAFE -pthread -pipe -Os -arch x86_64 -MT mm_io.lo -MD -MP -MF .deps/mm_io.Tpo -c mm_io.c -o mm_io.o >/dev/null 2>&1 |
---|
937 | :info:build libtool: compile: /usr/bin/clang -DHAVE_CONFIG_H -I. -I../../tsk -I../.. -I./../.. -Wall -I/opt/local/include -D_THREAD_SAFE -pthread -pipe -Os -arch x86_64 -MT mm_types.lo -MD -MP -MF .deps/mm_types.Tpo -c mm_types.c -o mm_types.o >/dev/null 2>&1 |
---|
938 | :info:build libtool: compile: /usr/bin/clang -DHAVE_CONFIG_H -I. -I../../tsk -I../.. -I./../.. -Wall -I/opt/local/include -D_THREAD_SAFE -pthread -pipe -Os -arch x86_64 -MT mm_open.lo -MD -MP -MF .deps/mm_open.Tpo -c mm_open.c -o mm_open.o >/dev/null 2>&1 |
---|
939 | :info:build libtool: compile: /usr/bin/clang -DHAVE_CONFIG_H -I. -I../../tsk -I../.. -I./../.. -Wall -I/opt/local/include -D_THREAD_SAFE -pthread -pipe -Os -arch x86_64 -MT mm_part.lo -MD -MP -MF .deps/mm_part.Tpo -c mm_part.c -o mm_part.o >/dev/null 2>&1 |
---|
940 | :info:build libtool: compile: /usr/bin/clang -DHAVE_CONFIG_H -I. -I../../tsk -I../.. -I./../.. -Wall -I/opt/local/include -D_THREAD_SAFE -pthread -pipe -Os -arch x86_64 -MT mac.lo -MD -MP -MF .deps/mac.Tpo -c mac.c -o mac.o >/dev/null 2>&1 |
---|
941 | :info:build libtool: compile: /usr/bin/clang -DHAVE_CONFIG_H -I. -I../../tsk -I../.. -I./../.. -Wall -I/opt/local/include -D_THREAD_SAFE -pthread -pipe -Os -arch x86_64 -MT bsd.lo -MD -MP -MF .deps/bsd.Tpo -c bsd.c -o bsd.o >/dev/null 2>&1 |
---|
942 | :info:build mv -f .deps/mm_io.Tpo .deps/mm_io.Plo |
---|
943 | :info:build /bin/sh ../../libtool --tag=CC --mode=compile /usr/bin/clang -DHAVE_CONFIG_H -I. -I../../tsk -I../.. -I./../.. -Wall -I/opt/local/include -D_THREAD_SAFE -pthread -pipe -Os -arch x86_64 -MT sun.lo -MD -MP -MF .deps/sun.Tpo -c -o sun.lo sun.c |
---|
944 | :info:build mv -f .deps/mm_open.Tpo .deps/mm_open.Plo |
---|
945 | :info:build mv -f .deps/mm_types.Tpo .deps/mm_types.Plo |
---|
946 | :info:build libtool: compile: /usr/bin/clang -DHAVE_CONFIG_H -I. -I../../tsk -I../.. -I./../.. -Wall -I/opt/local/include -D_THREAD_SAFE -pthread -pipe -Os -arch x86_64 -MT gpt.lo -MD -MP -MF .deps/gpt.Tpo -c gpt.c -o gpt.o >/dev/null 2>&1 |
---|
947 | :info:build mv -f .deps/mm_part.Tpo .deps/mm_part.Plo |
---|
948 | :info:build libtool: compile: /usr/bin/clang -DHAVE_CONFIG_H -I. -I../../tsk -I../.. -I./../.. -Wall -I/opt/local/include -D_THREAD_SAFE -pthread -pipe -Os -arch x86_64 -MT dos.lo -MD -MP -MF .deps/dos.Tpo -c dos.c -o dos.o >/dev/null 2>&1 |
---|
949 | :info:build mv -f .deps/mac.Tpo .deps/mac.Plo |
---|
950 | :info:build libtool: compile: /usr/bin/clang -DHAVE_CONFIG_H -I. -I../../tsk -I../.. -I./../.. -Wall -I/opt/local/include -D_THREAD_SAFE -pthread -pipe -Os -arch x86_64 -MT sun.lo -MD -MP -MF .deps/sun.Tpo -c sun.c -fno-common -DPIC -o .libs/sun.o |
---|
951 | :info:build mv -f .deps/bsd.Tpo .deps/bsd.Plo |
---|
952 | :info:build mv -f .deps/gpt.Tpo .deps/gpt.Plo |
---|
953 | :info:build libtool: compile: /usr/bin/clang -DHAVE_CONFIG_H -I. -I../../tsk -I../.. -I./../.. -Wall -I/opt/local/include -D_THREAD_SAFE -pthread -pipe -Os -arch x86_64 -MT sun.lo -MD -MP -MF .deps/sun.Tpo -c sun.c -o sun.o >/dev/null 2>&1 |
---|
954 | :info:build mv -f .deps/dos.Tpo .deps/dos.Plo |
---|
955 | :info:build mv -f .deps/sun.Tpo .deps/sun.Plo |
---|
956 | :info:build /bin/sh ../../libtool --tag=CC --mode=link /usr/bin/clang -pipe -Os -arch x86_64 -L/opt/local/lib -Wl,-headerpad_max_install_names -arch x86_64 -D_THREAD_SAFE -pthread -o libtskvs.la mm_open.lo mm_part.lo mm_types.lo mm_io.lo bsd.lo dos.lo gpt.lo mac.lo sun.lo -lewf -ldl -lz -ldl -lstdc++ |
---|
957 | :info:build libtool: link: ar cru .libs/libtskvs.a .libs/mm_open.o .libs/mm_part.o .libs/mm_types.o .libs/mm_io.o .libs/bsd.o .libs/dos.o .libs/gpt.o .libs/mac.o .libs/sun.o |
---|
958 | :info:build libtool: link: ranlib .libs/libtskvs.a |
---|
959 | :info:build libtool: link: ( cd ".libs" && rm -f "libtskvs.la" && ln -s "../libtskvs.la" "libtskvs.la" ) |
---|
960 | :info:build make[3]: Leaving directory `/opt/local/var/macports/build/_opt_local_var_macports_sources_rsync.macports.org_release_tarballs_ports_sysutils_sleuthkit/sleuthkit/work/sleuthkit-4.1.3/tsk/vs' |
---|
961 | :info:build Making all in fs |
---|
962 | :info:build make[3]: Entering directory `/opt/local/var/macports/build/_opt_local_var_macports_sources_rsync.macports.org_release_tarballs_ports_sysutils_sleuthkit/sleuthkit/work/sleuthkit-4.1.3/tsk/fs' |
---|
963 | :info:build /bin/sh ../../libtool --tag=CC --mode=compile /usr/bin/clang -DHAVE_CONFIG_H -I. -I../../tsk -I../.. -I./../.. -Wall -I/opt/local/include -D_THREAD_SAFE -pthread -pipe -Os -arch x86_64 -MT fs_inode.lo -MD -MP -MF .deps/fs_inode.Tpo -c -o fs_inode.lo fs_inode.c |
---|
964 | :info:build /bin/sh ../../libtool --tag=CC --mode=compile /usr/bin/clang -DHAVE_CONFIG_H -I. -I../../tsk -I../.. -I./../.. -Wall -I/opt/local/include -D_THREAD_SAFE -pthread -pipe -Os -arch x86_64 -MT fs_io.lo -MD -MP -MF .deps/fs_io.Tpo -c -o fs_io.lo fs_io.c |
---|
965 | :info:build /bin/sh ../../libtool --tag=CC --mode=compile /usr/bin/clang -DHAVE_CONFIG_H -I. -I../../tsk -I../.. -I./../.. -Wall -I/opt/local/include -D_THREAD_SAFE -pthread -pipe -Os -arch x86_64 -MT fs_block.lo -MD -MP -MF .deps/fs_block.Tpo -c -o fs_block.lo fs_block.c |
---|
966 | :info:build /bin/sh ../../libtool --tag=CC --mode=compile /usr/bin/clang -DHAVE_CONFIG_H -I. -I../../tsk -I../.. -I./../.. -Wall -I/opt/local/include -D_THREAD_SAFE -pthread -pipe -Os -arch x86_64 -MT fs_open.lo -MD -MP -MF .deps/fs_open.Tpo -c -o fs_open.lo fs_open.c |
---|
967 | :info:build /bin/sh ../../libtool --tag=CC --mode=compile /usr/bin/clang -DHAVE_CONFIG_H -I. -I../../tsk -I../.. -I./../.. -Wall -I/opt/local/include -D_THREAD_SAFE -pthread -pipe -Os -arch x86_64 -MT fs_name.lo -MD -MP -MF .deps/fs_name.Tpo -c -o fs_name.lo fs_name.c |
---|
968 | :info:build /bin/sh ../../libtool --tag=CC --mode=compile /usr/bin/clang -DHAVE_CONFIG_H -I. -I../../tsk -I../.. -I./../.. -Wall -I/opt/local/include -D_THREAD_SAFE -pthread -pipe -Os -arch x86_64 -MT fs_dir.lo -MD -MP -MF .deps/fs_dir.Tpo -c -o fs_dir.lo fs_dir.c |
---|
969 | :info:build /bin/sh ../../libtool --tag=CC --mode=compile /usr/bin/clang -DHAVE_CONFIG_H -I. -I../../tsk -I../.. -I./../.. -Wall -I/opt/local/include -D_THREAD_SAFE -pthread -pipe -Os -arch x86_64 -MT fs_types.lo -MD -MP -MF .deps/fs_types.Tpo -c -o fs_types.lo fs_types.c |
---|
970 | :info:build /bin/sh ../../libtool --tag=CC --mode=compile /usr/bin/clang -DHAVE_CONFIG_H -I. -I../../tsk -I../.. -I./../.. -Wall -I/opt/local/include -D_THREAD_SAFE -pthread -pipe -Os -arch x86_64 -MT fs_attr.lo -MD -MP -MF .deps/fs_attr.Tpo -c -o fs_attr.lo fs_attr.c |
---|
971 | :info:build libtool: compile: /usr/bin/clang -DHAVE_CONFIG_H -I. -I../../tsk -I../.. -I./../.. -Wall -I/opt/local/include -D_THREAD_SAFE -pthread -pipe -Os -arch x86_64 -MT fs_attr.lo -MD -MP -MF .deps/fs_attr.Tpo -c fs_attr.c -fno-common -DPIC -o .libs/fs_attr.o |
---|
972 | :info:build libtool: compile: /usr/bin/clang -DHAVE_CONFIG_H -I. -I../../tsk -I../.. -I./../.. -Wall -I/opt/local/include -D_THREAD_SAFE -pthread -pipe -Os -arch x86_64 -MT fs_inode.lo -MD -MP -MF .deps/fs_inode.Tpo -c fs_inode.c -fno-common -DPIC -o .libs/fs_inode.o |
---|
973 | :info:build libtool: compile: /usr/bin/clang -DHAVE_CONFIG_H -I. -I../../tsk -I../.. -I./../.. -Wall -I/opt/local/include -D_THREAD_SAFE -pthread -pipe -Os -arch x86_64 -MT fs_io.lo -MD -MP -MF .deps/fs_io.Tpo -c fs_io.c -fno-common -DPIC -o .libs/fs_io.o |
---|
974 | :info:build libtool: compile: /usr/bin/clang -DHAVE_CONFIG_H -I. -I../../tsk -I../.. -I./../.. -Wall -I/opt/local/include -D_THREAD_SAFE -pthread -pipe -Os -arch x86_64 -MT fs_block.lo -MD -MP -MF .deps/fs_block.Tpo -c fs_block.c -fno-common -DPIC -o .libs/fs_block.o |
---|
975 | :info:build libtool: compile: /usr/bin/clang -DHAVE_CONFIG_H -I. -I../../tsk -I../.. -I./../.. -Wall -I/opt/local/include -D_THREAD_SAFE -pthread -pipe -Os -arch x86_64 -MT fs_open.lo -MD -MP -MF .deps/fs_open.Tpo -c fs_open.c -fno-common -DPIC -o .libs/fs_open.o |
---|
976 | :info:build libtool: compile: /usr/bin/clang -DHAVE_CONFIG_H -I. -I../../tsk -I../.. -I./../.. -Wall -I/opt/local/include -D_THREAD_SAFE -pthread -pipe -Os -arch x86_64 -MT fs_dir.lo -MD -MP -MF .deps/fs_dir.Tpo -c fs_dir.c -fno-common -DPIC -o .libs/fs_dir.o |
---|
977 | :info:build libtool: compile: /usr/bin/clang -DHAVE_CONFIG_H -I. -I../../tsk -I../.. -I./../.. -Wall -I/opt/local/include -D_THREAD_SAFE -pthread -pipe -Os -arch x86_64 -MT fs_types.lo -MD -MP -MF .deps/fs_types.Tpo -c fs_types.c -fno-common -DPIC -o .libs/fs_types.o |
---|
978 | :info:build libtool: compile: /usr/bin/clang -DHAVE_CONFIG_H -I. -I../../tsk -I../.. -I./../.. -Wall -I/opt/local/include -D_THREAD_SAFE -pthread -pipe -Os -arch x86_64 -MT fs_name.lo -MD -MP -MF .deps/fs_name.Tpo -c fs_name.c -fno-common -DPIC -o .libs/fs_name.o |
---|
979 | :info:build libtool: compile: /usr/bin/clang -DHAVE_CONFIG_H -I. -I../../tsk -I../.. -I./../.. -Wall -I/opt/local/include -D_THREAD_SAFE -pthread -pipe -Os -arch x86_64 -MT fs_io.lo -MD -MP -MF .deps/fs_io.Tpo -c fs_io.c -o fs_io.o >/dev/null 2>&1 |
---|
980 | :info:build libtool: compile: /usr/bin/clang -DHAVE_CONFIG_H -I. -I../../tsk -I../.. -I./../.. -Wall -I/opt/local/include -D_THREAD_SAFE -pthread -pipe -Os -arch x86_64 -MT fs_inode.lo -MD -MP -MF .deps/fs_inode.Tpo -c fs_inode.c -o fs_inode.o >/dev/null 2>&1 |
---|
981 | :info:build libtool: compile: /usr/bin/clang -DHAVE_CONFIG_H -I. -I../../tsk -I../.. -I./../.. -Wall -I/opt/local/include -D_THREAD_SAFE -pthread -pipe -Os -arch x86_64 -MT fs_block.lo -MD -MP -MF .deps/fs_block.Tpo -c fs_block.c -o fs_block.o >/dev/null 2>&1 |
---|
982 | :info:build libtool: compile: /usr/bin/clang -DHAVE_CONFIG_H -I. -I../../tsk -I../.. -I./../.. -Wall -I/opt/local/include -D_THREAD_SAFE -pthread -pipe -Os -arch x86_64 -MT fs_types.lo -MD -MP -MF .deps/fs_types.Tpo -c fs_types.c -o fs_types.o >/dev/null 2>&1 |
---|
983 | :info:build libtool: compile: /usr/bin/clang -DHAVE_CONFIG_H -I. -I../../tsk -I../.. -I./../.. -Wall -I/opt/local/include -D_THREAD_SAFE -pthread -pipe -Os -arch x86_64 -MT fs_open.lo -MD -MP -MF .deps/fs_open.Tpo -c fs_open.c -o fs_open.o >/dev/null 2>&1 |
---|
984 | :info:build libtool: compile: /usr/bin/clang -DHAVE_CONFIG_H -I. -I../../tsk -I../.. -I./../.. -Wall -I/opt/local/include -D_THREAD_SAFE -pthread -pipe -Os -arch x86_64 -MT fs_name.lo -MD -MP -MF .deps/fs_name.Tpo -c fs_name.c -o fs_name.o >/dev/null 2>&1 |
---|
985 | :info:build mv -f .deps/fs_io.Tpo .deps/fs_io.Plo |
---|
986 | :info:build mv -f .deps/fs_inode.Tpo .deps/fs_inode.Plo |
---|
987 | :info:build mv -f .deps/fs_block.Tpo .deps/fs_block.Plo |
---|
988 | :info:build /bin/sh ../../libtool --tag=CC --mode=compile /usr/bin/clang -DHAVE_CONFIG_H -I. -I../../tsk -I../.. -I./../.. -Wall -I/opt/local/include -D_THREAD_SAFE -pthread -pipe -Os -arch x86_64 -MT fs_attrlist.lo -MD -MP -MF .deps/fs_attrlist.Tpo -c -o fs_attrlist.lo fs_attrlist.c |
---|
989 | :info:build /bin/sh ../../libtool --tag=CC --mode=compile /usr/bin/clang -DHAVE_CONFIG_H -I. -I../../tsk -I../.. -I./../.. -Wall -I/opt/local/include -D_THREAD_SAFE -pthread -pipe -Os -arch x86_64 -MT fs_load.lo -MD -MP -MF .deps/fs_load.Tpo -c -o fs_load.lo fs_load.c |
---|
990 | :info:build /bin/sh ../../libtool --tag=CC --mode=compile /usr/bin/clang -DHAVE_CONFIG_H -I. -I../../tsk -I../.. -I./../.. -Wall -I/opt/local/include -D_THREAD_SAFE -pthread -pipe -Os -arch x86_64 -MT fs_parse.lo -MD -MP -MF .deps/fs_parse.Tpo -c -o fs_parse.lo fs_parse.c |
---|
991 | :info:build mv -f .deps/fs_types.Tpo .deps/fs_types.Plo |
---|
992 | :info:build libtool: compile: /usr/bin/clang -DHAVE_CONFIG_H -I. -I../../tsk -I../.. -I./../.. -Wall -I/opt/local/include -D_THREAD_SAFE -pthread -pipe -Os -arch x86_64 -MT fs_dir.lo -MD -MP -MF .deps/fs_dir.Tpo -c fs_dir.c -o fs_dir.o >/dev/null 2>&1 |
---|
993 | :info:build /bin/sh ../../libtool --tag=CC --mode=compile /usr/bin/clang -DHAVE_CONFIG_H -I. -I../../tsk -I../.. -I./../.. -Wall -I/opt/local/include -D_THREAD_SAFE -pthread -pipe -Os -arch x86_64 -MT fs_file.lo -MD -MP -MF .deps/fs_file.Tpo -c -o fs_file.lo fs_file.c |
---|
994 | :info:build libtool: compile: /usr/bin/clang -DHAVE_CONFIG_H -I. -I../../tsk -I../.. -I./../.. -Wall -I/opt/local/include -D_THREAD_SAFE -pthread -pipe -Os -arch x86_64 -MT fs_attr.lo -MD -MP -MF .deps/fs_attr.Tpo -c fs_attr.c -o fs_attr.o >/dev/null 2>&1 |
---|
995 | :info:build mv -f .deps/fs_open.Tpo .deps/fs_open.Plo |
---|
996 | :info:build /bin/sh ../../libtool --tag=CC --mode=compile /usr/bin/clang -DHAVE_CONFIG_H -I. -I../../tsk -I../.. -I./../.. -Wall -I/opt/local/include -D_THREAD_SAFE -pthread -pipe -Os -arch x86_64 -MT unix_misc.lo -MD -MP -MF .deps/unix_misc.Tpo -c -o unix_misc.lo unix_misc.c |
---|
997 | :info:build libtool: compile: /usr/bin/clang -DHAVE_CONFIG_H -I. -I../../tsk -I../.. -I./../.. -Wall -I/opt/local/include -D_THREAD_SAFE -pthread -pipe -Os -arch x86_64 -MT fs_attrlist.lo -MD -MP -MF .deps/fs_attrlist.Tpo -c fs_attrlist.c -fno-common -DPIC -o .libs/fs_attrlist.o |
---|
998 | :info:build libtool: compile: /usr/bin/clang -DHAVE_CONFIG_H -I. -I../../tsk -I../.. -I./../.. -Wall -I/opt/local/include -D_THREAD_SAFE -pthread -pipe -Os -arch x86_64 -MT fs_parse.lo -MD -MP -MF .deps/fs_parse.Tpo -c fs_parse.c -fno-common -DPIC -o .libs/fs_parse.o |
---|
999 | :info:build libtool: compile: /usr/bin/clang -DHAVE_CONFIG_H -I. -I../../tsk -I../.. -I./../.. -Wall -I/opt/local/include -D_THREAD_SAFE -pthread -pipe -Os -arch x86_64 -MT fs_load.lo -MD -MP -MF .deps/fs_load.Tpo -c fs_load.c -fno-common -DPIC -o .libs/fs_load.o |
---|
1000 | :info:build libtool: compile: /usr/bin/clang -DHAVE_CONFIG_H -I. -I../../tsk -I../.. -I./../.. -Wall -I/opt/local/include -D_THREAD_SAFE -pthread -pipe -Os -arch x86_64 -MT fs_file.lo -MD -MP -MF .deps/fs_file.Tpo -c fs_file.c -fno-common -DPIC -o .libs/fs_file.o |
---|
1001 | :info:build libtool: compile: /usr/bin/clang -DHAVE_CONFIG_H -I. -I../../tsk -I../.. -I./../.. -Wall -I/opt/local/include -D_THREAD_SAFE -pthread -pipe -Os -arch x86_64 -MT unix_misc.lo -MD -MP -MF .deps/unix_misc.Tpo -c unix_misc.c -fno-common -DPIC -o .libs/unix_misc.o |
---|
1002 | :info:build libtool: compile: /usr/bin/clang -DHAVE_CONFIG_H -I. -I../../tsk -I../.. -I./../.. -Wall -I/opt/local/include -D_THREAD_SAFE -pthread -pipe -Os -arch x86_64 -MT fs_load.lo -MD -MP -MF .deps/fs_load.Tpo -c fs_load.c -o fs_load.o >/dev/null 2>&1 |
---|
1003 | :info:build libtool: compile: /usr/bin/clang -DHAVE_CONFIG_H -I. -I../../tsk -I../.. -I./../.. -Wall -I/opt/local/include -D_THREAD_SAFE -pthread -pipe -Os -arch x86_64 -MT fs_parse.lo -MD -MP -MF .deps/fs_parse.Tpo -c fs_parse.c -o fs_parse.o >/dev/null 2>&1 |
---|
1004 | :info:build libtool: compile: /usr/bin/clang -DHAVE_CONFIG_H -I. -I../../tsk -I../.. -I./../.. -Wall -I/opt/local/include -D_THREAD_SAFE -pthread -pipe -Os -arch x86_64 -MT fs_attrlist.lo -MD -MP -MF .deps/fs_attrlist.Tpo -c fs_attrlist.c -o fs_attrlist.o >/dev/null 2>&1 |
---|
1005 | :info:build mv -f .deps/fs_name.Tpo .deps/fs_name.Plo |
---|
1006 | :info:build /bin/sh ../../libtool --tag=CC --mode=compile /usr/bin/clang -DHAVE_CONFIG_H -I. -I../../tsk -I../.. -I./../.. -Wall -I/opt/local/include -D_THREAD_SAFE -pthread -pipe -Os -arch x86_64 -MT nofs_misc.lo -MD -MP -MF .deps/nofs_misc.Tpo -c -o nofs_misc.lo nofs_misc.c |
---|
1007 | :info:build libtool: compile: /usr/bin/clang -DHAVE_CONFIG_H -I. -I../../tsk -I../.. -I./../.. -Wall -I/opt/local/include -D_THREAD_SAFE -pthread -pipe -Os -arch x86_64 -MT fs_file.lo -MD -MP -MF .deps/fs_file.Tpo -c fs_file.c -o fs_file.o >/dev/null 2>&1 |
---|
1008 | :info:build mv -f .deps/fs_load.Tpo .deps/fs_load.Plo |
---|
1009 | :info:build /bin/sh ../../libtool --tag=CC --mode=compile /usr/bin/clang -DHAVE_CONFIG_H -I. -I../../tsk -I../.. -I./../.. -Wall -I/opt/local/include -D_THREAD_SAFE -pthread -pipe -Os -arch x86_64 -MT ffs.lo -MD -MP -MF .deps/ffs.Tpo -c -o ffs.lo ffs.c |
---|
1010 | :info:build mv -f .deps/fs_dir.Tpo .deps/fs_dir.Plo |
---|
1011 | :info:build libtool: compile: /usr/bin/clang -DHAVE_CONFIG_H -I. -I../../tsk -I../.. -I./../.. -Wall -I/opt/local/include -D_THREAD_SAFE -pthread -pipe -Os -arch x86_64 -MT unix_misc.lo -MD -MP -MF .deps/unix_misc.Tpo -c unix_misc.c -o unix_misc.o >/dev/null 2>&1 |
---|
1012 | :info:build mv -f .deps/fs_attr.Tpo .deps/fs_attr.Plo |
---|
1013 | :info:build mv -f .deps/fs_parse.Tpo .deps/fs_parse.Plo |
---|
1014 | :info:build /bin/sh ../../libtool --tag=CC --mode=compile /usr/bin/clang -DHAVE_CONFIG_H -I. -I../../tsk -I../.. -I./../.. -Wall -I/opt/local/include -D_THREAD_SAFE -pthread -pipe -Os -arch x86_64 -MT ffs_dent.lo -MD -MP -MF .deps/ffs_dent.Tpo -c -o ffs_dent.lo ffs_dent.c |
---|
1015 | :info:build /bin/sh ../../libtool --tag=CC --mode=compile /usr/bin/clang -DHAVE_CONFIG_H -I. -I../../tsk -I../.. -I./../.. -Wall -I/opt/local/include -D_THREAD_SAFE -pthread -pipe -Os -arch x86_64 -MT ext2fs.lo -MD -MP -MF .deps/ext2fs.Tpo -c -o ext2fs.lo ext2fs.c |
---|
1016 | :info:build /bin/sh ../../libtool --tag=CC --mode=compile /usr/bin/clang -DHAVE_CONFIG_H -I. -I../../tsk -I../.. -I./../.. -Wall -I/opt/local/include -D_THREAD_SAFE -pthread -pipe -Os -arch x86_64 -MT ext2fs_dent.lo -MD -MP -MF .deps/ext2fs_dent.Tpo -c -o ext2fs_dent.lo ext2fs_dent.c |
---|
1017 | :info:build libtool: compile: /usr/bin/clang -DHAVE_CONFIG_H -I. -I../../tsk -I../.. -I./../.. -Wall -I/opt/local/include -D_THREAD_SAFE -pthread -pipe -Os -arch x86_64 -MT nofs_misc.lo -MD -MP -MF .deps/nofs_misc.Tpo -c nofs_misc.c -fno-common -DPIC -o .libs/nofs_misc.o |
---|
1018 | :info:build libtool: compile: /usr/bin/clang -DHAVE_CONFIG_H -I. -I../../tsk -I../.. -I./../.. -Wall -I/opt/local/include -D_THREAD_SAFE -pthread -pipe -Os -arch x86_64 -MT ffs.lo -MD -MP -MF .deps/ffs.Tpo -c ffs.c -fno-common -DPIC -o .libs/ffs.o |
---|
1019 | :info:build libtool: compile: /usr/bin/clang -DHAVE_CONFIG_H -I. -I../../tsk -I../.. -I./../.. -Wall -I/opt/local/include -D_THREAD_SAFE -pthread -pipe -Os -arch x86_64 -MT ffs_dent.lo -MD -MP -MF .deps/ffs_dent.Tpo -c ffs_dent.c -fno-common -DPIC -o .libs/ffs_dent.o |
---|
1020 | :info:build libtool: compile: /usr/bin/clang -DHAVE_CONFIG_H -I. -I../../tsk -I../.. -I./../.. -Wall -I/opt/local/include -D_THREAD_SAFE -pthread -pipe -Os -arch x86_64 -MT ext2fs.lo -MD -MP -MF .deps/ext2fs.Tpo -c ext2fs.c -fno-common -DPIC -o .libs/ext2fs.o |
---|
1021 | :info:build libtool: compile: /usr/bin/clang -DHAVE_CONFIG_H -I. -I../../tsk -I../.. -I./../.. -Wall -I/opt/local/include -D_THREAD_SAFE -pthread -pipe -Os -arch x86_64 -MT ext2fs_dent.lo -MD -MP -MF .deps/ext2fs_dent.Tpo -c ext2fs_dent.c -fno-common -DPIC -o .libs/ext2fs_dent.o |
---|
1022 | :info:build mv -f .deps/fs_attrlist.Tpo .deps/fs_attrlist.Plo |
---|
1023 | :info:build /bin/sh ../../libtool --tag=CC --mode=compile /usr/bin/clang -DHAVE_CONFIG_H -I. -I../../tsk -I../.. -I./../.. -Wall -I/opt/local/include -D_THREAD_SAFE -pthread -pipe -Os -arch x86_64 -MT ext2fs_journal.lo -MD -MP -MF .deps/ext2fs_journal.Tpo -c -o ext2fs_journal.lo ext2fs_journal.c |
---|
1024 | :info:build ffs.c:50:17: warning: comparison of unsigned expression < 0 is always false [-Wtautological-compare] |
---|
1025 | :info:build if (grp_num < 0 || grp_num >= ffs->groups_count) { |
---|
1026 | :info:build ~~~~~~~ ^ ~ |
---|
1027 | :info:build libtool: compile: /usr/bin/clang -DHAVE_CONFIG_H -I. -I../../tsk -I../.. -I./../.. -Wall -I/opt/local/include -D_THREAD_SAFE -pthread -pipe -Os -arch x86_64 -MT nofs_misc.lo -MD -MP -MF .deps/nofs_misc.Tpo -c nofs_misc.c -o nofs_misc.o >/dev/null 2>&1 |
---|
1028 | :info:build mv -f .deps/fs_file.Tpo .deps/fs_file.Plo |
---|
1029 | :info:build /bin/sh ../../libtool --tag=CC --mode=compile /usr/bin/clang -DHAVE_CONFIG_H -I. -I../../tsk -I../.. -I./../.. -Wall -I/opt/local/include -D_THREAD_SAFE -pthread -pipe -Os -arch x86_64 -MT fatfs.lo -MD -MP -MF .deps/fatfs.Tpo -c -o fatfs.lo fatfs.c |
---|
1030 | :info:build ext2fs.c:132:17: warning: comparison of unsigned expression < 0 is always false [-Wtautological-compare] |
---|
1031 | :info:build if (grp_num < 0 || grp_num >= ext2fs->groups_count) { |
---|
1032 | :info:build ~~~~~~~ ^ ~ |
---|
1033 | :info:build libtool: compile: /usr/bin/clang -DHAVE_CONFIG_H -I. -I../../tsk -I../.. -I./../.. -Wall -I/opt/local/include -D_THREAD_SAFE -pthread -pipe -Os -arch x86_64 -MT ext2fs_journal.lo -MD -MP -MF .deps/ext2fs_journal.Tpo -c ext2fs_journal.c -fno-common -DPIC -o .libs/ext2fs_journal.o |
---|
1034 | :info:build mv -f .deps/unix_misc.Tpo .deps/unix_misc.Plo |
---|
1035 | :info:build /bin/sh ../../libtool --tag=CC --mode=compile /usr/bin/clang -DHAVE_CONFIG_H -I. -I../../tsk -I../.. -I./../.. -Wall -I/opt/local/include -D_THREAD_SAFE -pthread -pipe -Os -arch x86_64 -MT fatfs_meta.lo -MD -MP -MF .deps/fatfs_meta.Tpo -c -o fatfs_meta.lo fatfs_meta.c |
---|
1036 | :info:build ext2fs.c:1948:13: warning: comparison of array 'sb->s_last_mounted' not equal to a null pointer is always true [-Wtautological-pointer-compare] |
---|
1037 | :info:build if (sb->s_last_mounted != '\0') |
---|
1038 | :info:build ~~~~^~~~~~~~~~~~~~ ~~~~ |
---|
1039 | :info:build libtool: compile: /usr/bin/clang -DHAVE_CONFIG_H -I. -I../../tsk -I../.. -I./../.. -Wall -I/opt/local/include -D_THREAD_SAFE -pthread -pipe -Os -arch x86_64 -MT fatfs.lo -MD -MP -MF .deps/fatfs.Tpo -c fatfs.c -fno-common -DPIC -o .libs/fatfs.o |
---|
1040 | :info:build ext2fs_journal.c:330:22: warning: incompatible pointer types assigning to 'ext2fs_journ_sb *' from 'ext2fs_journ_head *' [-Wincompatible-pointer-types] |
---|
1041 | :info:build journ_sb = head; |
---|
1042 | :info:build ^ ~~~~ |
---|
1043 | :info:build ext2fs_journal.c:371:25: warning: incompatible pointer types assigning to 'ext4fs_journ_commit_head *' from 'ext2fs_journ_head *' [-Wincompatible-pointer-types] |
---|
1044 | :info:build commit_head = head; |
---|
1045 | :info:build ^ ~~~~ |
---|
1046 | :info:build ext2fs_journal.c:568:29: warning: comparison of unsigned expression >= 0 is always true [-Wtautological-compare] |
---|
1047 | :info:build for (i = end - 1; i >= 0; i--) { |
---|
1048 | :info:build ~ ^ ~ |
---|
1049 | :info:build mv -f .deps/nofs_misc.Tpo .deps/nofs_misc.Plo |
---|
1050 | :info:build libtool: compile: /usr/bin/clang -DHAVE_CONFIG_H -I. -I../../tsk -I../.. -I./../.. -Wall -I/opt/local/include -D_THREAD_SAFE -pthread -pipe -Os -arch x86_64 -MT ffs_dent.lo -MD -MP -MF .deps/ffs_dent.Tpo -c ffs_dent.c -o ffs_dent.o >/dev/null 2>&1 |
---|
1051 | :info:build libtool: compile: /usr/bin/clang -DHAVE_CONFIG_H -I. -I../../tsk -I../.. -I./../.. -Wall -I/opt/local/include -D_THREAD_SAFE -pthread -pipe -Os -arch x86_64 -MT ext2fs_dent.lo -MD -MP -MF .deps/ext2fs_dent.Tpo -c ext2fs_dent.c -o ext2fs_dent.o >/dev/null 2>&1 |
---|
1052 | :info:build libtool: compile: /usr/bin/clang -DHAVE_CONFIG_H -I. -I../../tsk -I../.. -I./../.. -Wall -I/opt/local/include -D_THREAD_SAFE -pthread -pipe -Os -arch x86_64 -MT fatfs_meta.lo -MD -MP -MF .deps/fatfs_meta.Tpo -c fatfs_meta.c -fno-common -DPIC -o .libs/fatfs_meta.o |
---|
1053 | :info:build /bin/sh ../../libtool --tag=CXX --mode=compile /usr/bin/clang++ -DHAVE_CONFIG_H -I. -I../../tsk -I../.. -I./../.. -Wall -I/opt/local/include -D_THREAD_SAFE -pthread -pipe -Os -arch x86_64 -stdlib=libc++ -MT fatfs_dent.lo -MD -MP -MF .deps/fatfs_dent.Tpo -c -o fatfs_dent.lo fatfs_dent.cpp |
---|
1054 | :info:build 3 warnings generated. |
---|
1055 | :info:build libtool: compile: /usr/bin/clang -DHAVE_CONFIG_H -I. -I../../tsk -I../.. -I./../.. -Wall -I/opt/local/include -D_THREAD_SAFE -pthread -pipe -Os -arch x86_64 -MT ext2fs_journal.lo -MD -MP -MF .deps/ext2fs_journal.Tpo -c ext2fs_journal.c -o ext2fs_journal.o >/dev/null 2>&1 |
---|
1056 | :info:build libtool: compile: /usr/bin/clang++ -DHAVE_CONFIG_H -I. -I../../tsk -I../.. -I./../.. -Wall -I/opt/local/include -D_THREAD_SAFE -pthread -pipe -Os -arch x86_64 -stdlib=libc++ -MT fatfs_dent.lo -MD -MP -MF .deps/fatfs_dent.Tpo -c fatfs_dent.cpp -fno-common -DPIC -o .libs/fatfs_dent.o |
---|
1057 | :info:build mv -f .deps/ffs_dent.Tpo .deps/ffs_dent.Plo |
---|
1058 | :info:build mv -f .deps/ext2fs_dent.Tpo .deps/ext2fs_dent.Plo |
---|
1059 | :info:build /bin/sh ../../libtool --tag=CC --mode=compile /usr/bin/clang -DHAVE_CONFIG_H -I. -I../../tsk -I../.. -I./../.. -Wall -I/opt/local/include -D_THREAD_SAFE -pthread -pipe -Os -arch x86_64 -MT ntfs.lo -MD -MP -MF .deps/ntfs.Tpo -c -o ntfs.lo ntfs.c |
---|
1060 | :info:build /bin/sh ../../libtool --tag=CXX --mode=compile /usr/bin/clang++ -DHAVE_CONFIG_H -I. -I../../tsk -I../.. -I./../.. -Wall -I/opt/local/include -D_THREAD_SAFE -pthread -pipe -Os -arch x86_64 -stdlib=libc++ -MT ntfs_dent.lo -MD -MP -MF .deps/ntfs_dent.Tpo -c -o ntfs_dent.lo ntfs_dent.cpp |
---|
1061 | :info:build libtool: compile: /usr/bin/clang -DHAVE_CONFIG_H -I. -I../../tsk -I../.. -I./../.. -Wall -I/opt/local/include -D_THREAD_SAFE -pthread -pipe -Os -arch x86_64 -MT ntfs.lo -MD -MP -MF .deps/ntfs.Tpo -c ntfs.c -fno-common -DPIC -o .libs/ntfs.o |
---|
1062 | :info:build libtool: compile: /usr/bin/clang++ -DHAVE_CONFIG_H -I. -I../../tsk -I../.. -I./../.. -Wall -I/opt/local/include -D_THREAD_SAFE -pthread -pipe -Os -arch x86_64 -stdlib=libc++ -MT ntfs_dent.lo -MD -MP -MF .deps/ntfs_dent.Tpo -c ntfs_dent.cpp -fno-common -DPIC -o .libs/ntfs_dent.o |
---|
1063 | :info:build mv -f .deps/ext2fs_journal.Tpo .deps/ext2fs_journal.Plo |
---|
1064 | :info:build /bin/sh ../../libtool --tag=CC --mode=compile /usr/bin/clang -DHAVE_CONFIG_H -I. -I../../tsk -I../.. -I./../.. -Wall -I/opt/local/include -D_THREAD_SAFE -pthread -pipe -Os -arch x86_64 -MT swapfs.lo -MD -MP -MF .deps/swapfs.Tpo -c -o swapfs.lo swapfs.c |
---|
1065 | :info:build libtool: compile: /usr/bin/clang -DHAVE_CONFIG_H -I. -I../../tsk -I../.. -I./../.. -Wall -I/opt/local/include -D_THREAD_SAFE -pthread -pipe -Os -arch x86_64 -MT fatfs.lo -MD -MP -MF .deps/fatfs.Tpo -c fatfs.c -o fatfs.o >/dev/null 2>&1 |
---|
1066 | :info:build libtool: compile: /usr/bin/clang -DHAVE_CONFIG_H -I. -I../../tsk -I../.. -I./../.. -Wall -I/opt/local/include -D_THREAD_SAFE -pthread -pipe -Os -arch x86_64 -MT swapfs.lo -MD -MP -MF .deps/swapfs.Tpo -c swapfs.c -fno-common -DPIC -o .libs/swapfs.o |
---|
1067 | :info:build libtool: compile: /usr/bin/clang -DHAVE_CONFIG_H -I. -I../../tsk -I../.. -I./../.. -Wall -I/opt/local/include -D_THREAD_SAFE -pthread -pipe -Os -arch x86_64 -MT swapfs.lo -MD -MP -MF .deps/swapfs.Tpo -c swapfs.c -o swapfs.o >/dev/null 2>&1 |
---|
1068 | :info:build libtool: compile: /usr/bin/clang -DHAVE_CONFIG_H -I. -I../../tsk -I../.. -I./../.. -Wall -I/opt/local/include -D_THREAD_SAFE -pthread -pipe -Os -arch x86_64 -MT fatfs_meta.lo -MD -MP -MF .deps/fatfs_meta.Tpo -c fatfs_meta.c -o fatfs_meta.o >/dev/null 2>&1 |
---|
1069 | :info:build mv -f .deps/swapfs.Tpo .deps/swapfs.Plo |
---|
1070 | :info:build /bin/sh ../../libtool --tag=CC --mode=compile /usr/bin/clang -DHAVE_CONFIG_H -I. -I../../tsk -I../.. -I./../.. -Wall -I/opt/local/include -D_THREAD_SAFE -pthread -pipe -Os -arch x86_64 -MT rawfs.lo -MD -MP -MF .deps/rawfs.Tpo -c -o rawfs.lo rawfs.c |
---|
1071 | :info:build libtool: compile: /usr/bin/clang -DHAVE_CONFIG_H -I. -I../../tsk -I../.. -I./../.. -Wall -I/opt/local/include -D_THREAD_SAFE -pthread -pipe -Os -arch x86_64 -MT rawfs.lo -MD -MP -MF .deps/rawfs.Tpo -c rawfs.c -fno-common -DPIC -o .libs/rawfs.o |
---|
1072 | :info:build mv -f .deps/fatfs.Tpo .deps/fatfs.Plo |
---|
1073 | :info:build /bin/sh ../../libtool --tag=CC --mode=compile /usr/bin/clang -DHAVE_CONFIG_H -I. -I../../tsk -I../.. -I./../.. -Wall -I/opt/local/include -D_THREAD_SAFE -pthread -pipe -Os -arch x86_64 -MT iso9660.lo -MD -MP -MF .deps/iso9660.Tpo -c -o iso9660.lo iso9660.c |
---|
1074 | :info:build libtool: compile: /usr/bin/clang -DHAVE_CONFIG_H -I. -I../../tsk -I../.. -I./../.. -Wall -I/opt/local/include -D_THREAD_SAFE -pthread -pipe -Os -arch x86_64 -MT rawfs.lo -MD -MP -MF .deps/rawfs.Tpo -c rawfs.c -o rawfs.o >/dev/null 2>&1 |
---|
1075 | :info:build libtool: compile: /usr/bin/clang++ -DHAVE_CONFIG_H -I. -I../../tsk -I../.. -I./../.. -Wall -I/opt/local/include -D_THREAD_SAFE -pthread -pipe -Os -arch x86_64 -stdlib=libc++ -MT fatfs_dent.lo -MD -MP -MF .deps/fatfs_dent.Tpo -c fatfs_dent.cpp -o fatfs_dent.o >/dev/null 2>&1 |
---|
1076 | :info:build libtool: compile: /usr/bin/clang -DHAVE_CONFIG_H -I. -I../../tsk -I../.. -I./../.. -Wall -I/opt/local/include -D_THREAD_SAFE -pthread -pipe -Os -arch x86_64 -MT iso9660.lo -MD -MP -MF .deps/iso9660.Tpo -c iso9660.c -fno-common -DPIC -o .libs/iso9660.o |
---|
1077 | :info:build mv -f .deps/rawfs.Tpo .deps/rawfs.Plo |
---|
1078 | :info:build /bin/sh ../../libtool --tag=CC --mode=compile /usr/bin/clang -DHAVE_CONFIG_H -I. -I../../tsk -I../.. -I./../.. -Wall -I/opt/local/include -D_THREAD_SAFE -pthread -pipe -Os -arch x86_64 -MT iso9660_dent.lo -MD -MP -MF .deps/iso9660_dent.Tpo -c -o iso9660_dent.lo iso9660_dent.c |
---|
1079 | :info:build libtool: compile: /usr/bin/clang -DHAVE_CONFIG_H -I. -I../../tsk -I../.. -I./../.. -Wall -I/opt/local/include -D_THREAD_SAFE -pthread -pipe -Os -arch x86_64 -MT iso9660_dent.lo -MD -MP -MF .deps/iso9660_dent.Tpo -c iso9660_dent.c -fno-common -DPIC -o .libs/iso9660_dent.o |
---|
1080 | :info:build libtool: compile: /usr/bin/clang -DHAVE_CONFIG_H -I. -I../../tsk -I../.. -I./../.. -Wall -I/opt/local/include -D_THREAD_SAFE -pthread -pipe -Os -arch x86_64 -MT iso9660_dent.lo -MD -MP -MF .deps/iso9660_dent.Tpo -c iso9660_dent.c -o iso9660_dent.o >/dev/null 2>&1 |
---|
1081 | :info:build mv -f .deps/fatfs_meta.Tpo .deps/fatfs_meta.Plo |
---|
1082 | :info:build /bin/sh ../../libtool --tag=CC --mode=compile /usr/bin/clang -DHAVE_CONFIG_H -I. -I../../tsk -I../.. -I./../.. -Wall -I/opt/local/include -D_THREAD_SAFE -pthread -pipe -Os -arch x86_64 -MT hfs.lo -MD -MP -MF .deps/hfs.Tpo -c -o hfs.lo hfs.c |
---|
1083 | :info:build libtool: compile: /usr/bin/clang -DHAVE_CONFIG_H -I. -I../../tsk -I../.. -I./../.. -Wall -I/opt/local/include -D_THREAD_SAFE -pthread -pipe -Os -arch x86_64 -MT hfs.lo -MD -MP -MF .deps/hfs.Tpo -c hfs.c -fno-common -DPIC -o .libs/hfs.o |
---|
1084 | :info:build mv -f .deps/iso9660_dent.Tpo .deps/iso9660_dent.Plo |
---|
1085 | :info:build /bin/sh ../../libtool --tag=CC --mode=compile /usr/bin/clang -DHAVE_CONFIG_H -I. -I../../tsk -I../.. -I./../.. -Wall -I/opt/local/include -D_THREAD_SAFE -pthread -pipe -Os -arch x86_64 -MT hfs_dent.lo -MD -MP -MF .deps/hfs_dent.Tpo -c -o hfs_dent.lo hfs_dent.c |
---|
1086 | :info:build hfs.c:1151:17: warning: comparison of unsigned expression >= 0 is always true [-Wtautological-compare] |
---|
1087 | :info:build if (cnt >= 0) { |
---|
1088 | :info:build ~~~ ^ ~ |
---|
1089 | :info:build hfs.c:1184:17: warning: comparison of unsigned expression >= 0 is always true [-Wtautological-compare] |
---|
1090 | :info:build if (cnt >= 0) { |
---|
1091 | :info:build ~~~ ^ ~ |
---|
1092 | :info:build hfs.c:1217:17: warning: comparison of unsigned expression >= 0 is always true [-Wtautological-compare] |
---|
1093 | :info:build if (cnt >= 0) { |
---|
1094 | :info:build ~~~ ^ ~ |
---|
1095 | :info:build hfs.c:1232:21: warning: comparison of unsigned expression >= 0 is always true [-Wtautological-compare] |
---|
1096 | :info:build if (cnt >= 0) { |
---|
1097 | :info:build ~~~ ^ ~ |
---|
1098 | :info:build hfs.c:1247:21: warning: comparison of unsigned expression >= 0 is always true [-Wtautological-compare] |
---|
1099 | :info:build if (cnt >= 0) { |
---|
1100 | :info:build ~~~ ^ ~ |
---|
1101 | :info:build hfs.c:2950:31: warning: comparison of unsigned expression < 0 is always false [-Wtautological-compare] |
---|
1102 | :info:build if (a_offset < 0 || a_len < 0) { |
---|
1103 | :info:build ~~~~~ ^ ~ |
---|
1104 | :info:build libtool: compile: /usr/bin/clang -DHAVE_CONFIG_H -I. -I../../tsk -I../.. -I./../.. -Wall -I/opt/local/include -D_THREAD_SAFE -pthread -pipe -Os -arch x86_64 -MT hfs_dent.lo -MD -MP -MF .deps/hfs_dent.Tpo -c hfs_dent.c -fno-common -DPIC -o .libs/hfs_dent.o |
---|
1105 | :info:build 1 warning generated. |
---|
1106 | :info:build libtool: compile: /usr/bin/clang -DHAVE_CONFIG_H -I. -I../../tsk -I../.. -I./../.. -Wall -I/opt/local/include -D_THREAD_SAFE -pthread -pipe -Os -arch x86_64 -MT ffs.lo -MD -MP -MF .deps/ffs.Tpo -c ffs.c -o ffs.o >/dev/null 2>&1 |
---|
1107 | :info:build mv -f .deps/fatfs_dent.Tpo .deps/fatfs_dent.Plo |
---|
1108 | :info:build /bin/sh ../../libtool --tag=CC --mode=compile /usr/bin/clang -DHAVE_CONFIG_H -I. -I../../tsk -I../.. -I./../.. -Wall -I/opt/local/include -D_THREAD_SAFE -pthread -pipe -Os -arch x86_64 -MT hfs_journal.lo -MD -MP -MF .deps/hfs_journal.Tpo -c -o hfs_journal.lo hfs_journal.c |
---|
1109 | :info:build libtool: compile: /usr/bin/clang++ -DHAVE_CONFIG_H -I. -I../../tsk -I../.. -I./../.. -Wall -I/opt/local/include -D_THREAD_SAFE -pthread -pipe -Os -arch x86_64 -stdlib=libc++ -MT ntfs_dent.lo -MD -MP -MF .deps/ntfs_dent.Tpo -c ntfs_dent.cpp -o ntfs_dent.o >/dev/null 2>&1 |
---|
1110 | :info:build libtool: compile: /usr/bin/clang -DHAVE_CONFIG_H -I. -I../../tsk -I../.. -I./../.. -Wall -I/opt/local/include -D_THREAD_SAFE -pthread -pipe -Os -arch x86_64 -MT hfs_dent.lo -MD -MP -MF .deps/hfs_dent.Tpo -c hfs_dent.c -o hfs_dent.o >/dev/null 2>&1 |
---|
1111 | :info:build libtool: compile: /usr/bin/clang -DHAVE_CONFIG_H -I. -I../../tsk -I../.. -I./../.. -Wall -I/opt/local/include -D_THREAD_SAFE -pthread -pipe -Os -arch x86_64 -MT hfs_journal.lo -MD -MP -MF .deps/hfs_journal.Tpo -c hfs_journal.c -fno-common -DPIC -o .libs/hfs_journal.o |
---|
1112 | :info:build libtool: compile: /usr/bin/clang -DHAVE_CONFIG_H -I. -I../../tsk -I../.. -I./../.. -Wall -I/opt/local/include -D_THREAD_SAFE -pthread -pipe -Os -arch x86_64 -MT iso9660.lo -MD -MP -MF .deps/iso9660.Tpo -c iso9660.c -o iso9660.o >/dev/null 2>&1 |
---|
1113 | :info:build 2 warnings generated. |
---|
1114 | :info:build libtool: compile: /usr/bin/clang -DHAVE_CONFIG_H -I. -I../../tsk -I../.. -I./../.. -Wall -I/opt/local/include -D_THREAD_SAFE -pthread -pipe -Os -arch x86_64 -MT ext2fs.lo -MD -MP -MF .deps/ext2fs.Tpo -c ext2fs.c -o ext2fs.o >/dev/null 2>&1 |
---|
1115 | :info:build libtool: compile: /usr/bin/clang -DHAVE_CONFIG_H -I. -I../../tsk -I../.. -I./../.. -Wall -I/opt/local/include -D_THREAD_SAFE -pthread -pipe -Os -arch x86_64 -MT hfs_journal.lo -MD -MP -MF .deps/hfs_journal.Tpo -c hfs_journal.c -o hfs_journal.o >/dev/null 2>&1 |
---|
1116 | :info:build mv -f .deps/hfs_journal.Tpo .deps/hfs_journal.Plo |
---|
1117 | :info:build /bin/sh ../../libtool --tag=CC --mode=compile /usr/bin/clang -DHAVE_CONFIG_H -I. -I../../tsk -I../.. -I./../.. -Wall -I/opt/local/include -D_THREAD_SAFE -pthread -pipe -Os -arch x86_64 -MT hfs_unicompare.lo -MD -MP -MF .deps/hfs_unicompare.Tpo -c -o hfs_unicompare.lo hfs_unicompare.c |
---|
1118 | :info:build mv -f .deps/hfs_dent.Tpo .deps/hfs_dent.Plo |
---|
1119 | :info:build /bin/sh ../../libtool --tag=CC --mode=compile /usr/bin/clang -DHAVE_CONFIG_H -I. -I../../tsk -I../.. -I./../.. -Wall -I/opt/local/include -D_THREAD_SAFE -pthread -pipe -Os -arch x86_64 -MT dcalc_lib.lo -MD -MP -MF .deps/dcalc_lib.Tpo -c -o dcalc_lib.lo dcalc_lib.c |
---|
1120 | :info:build libtool: compile: /usr/bin/clang -DHAVE_CONFIG_H -I. -I../../tsk -I../.. -I./../.. -Wall -I/opt/local/include -D_THREAD_SAFE -pthread -pipe -Os -arch x86_64 -MT hfs_unicompare.lo -MD -MP -MF .deps/hfs_unicompare.Tpo -c hfs_unicompare.c -fno-common -DPIC -o .libs/hfs_unicompare.o |
---|
1121 | :info:build libtool: compile: /usr/bin/clang -DHAVE_CONFIG_H -I. -I../../tsk -I../.. -I./../.. -Wall -I/opt/local/include -D_THREAD_SAFE -pthread -pipe -Os -arch x86_64 -MT dcalc_lib.lo -MD -MP -MF .deps/dcalc_lib.Tpo -c dcalc_lib.c -fno-common -DPIC -o .libs/dcalc_lib.o |
---|
1122 | :info:build libtool: compile: /usr/bin/clang -DHAVE_CONFIG_H -I. -I../../tsk -I../.. -I./../.. -Wall -I/opt/local/include -D_THREAD_SAFE -pthread -pipe -Os -arch x86_64 -MT dcalc_lib.lo -MD -MP -MF .deps/dcalc_lib.Tpo -c dcalc_lib.c -o dcalc_lib.o >/dev/null 2>&1 |
---|
1123 | :info:build libtool: compile: /usr/bin/clang -DHAVE_CONFIG_H -I. -I../../tsk -I../.. -I./../.. -Wall -I/opt/local/include -D_THREAD_SAFE -pthread -pipe -Os -arch x86_64 -MT hfs_unicompare.lo -MD -MP -MF .deps/hfs_unicompare.Tpo -c hfs_unicompare.c -o hfs_unicompare.o >/dev/null 2>&1 |
---|
1124 | :info:build libtool: compile: /usr/bin/clang -DHAVE_CONFIG_H -I. -I../../tsk -I../.. -I./../.. -Wall -I/opt/local/include -D_THREAD_SAFE -pthread -pipe -Os -arch x86_64 -MT ntfs.lo -MD -MP -MF .deps/ntfs.Tpo -c ntfs.c -o ntfs.o >/dev/null 2>&1 |
---|
1125 | :info:build mv -f .deps/dcalc_lib.Tpo .deps/dcalc_lib.Plo |
---|
1126 | :info:build /bin/sh ../../libtool --tag=CC --mode=compile /usr/bin/clang -DHAVE_CONFIG_H -I. -I../../tsk -I../.. -I./../.. -Wall -I/opt/local/include -D_THREAD_SAFE -pthread -pipe -Os -arch x86_64 -MT dcat_lib.lo -MD -MP -MF .deps/dcat_lib.Tpo -c -o dcat_lib.lo dcat_lib.c |
---|
1127 | :info:build mv -f .deps/hfs_unicompare.Tpo .deps/hfs_unicompare.Plo |
---|
1128 | :info:build /bin/sh ../../libtool --tag=CC --mode=compile /usr/bin/clang -DHAVE_CONFIG_H -I. -I../../tsk -I../.. -I./../.. -Wall -I/opt/local/include -D_THREAD_SAFE -pthread -pipe -Os -arch x86_64 -MT dls_lib.lo -MD -MP -MF .deps/dls_lib.Tpo -c -o dls_lib.lo dls_lib.c |
---|
1129 | :info:build libtool: compile: /usr/bin/clang -DHAVE_CONFIG_H -I. -I../../tsk -I../.. -I./../.. -Wall -I/opt/local/include -D_THREAD_SAFE -pthread -pipe -Os -arch x86_64 -MT dcat_lib.lo -MD -MP -MF .deps/dcat_lib.Tpo -c dcat_lib.c -fno-common -DPIC -o .libs/dcat_lib.o |
---|
1130 | :info:build libtool: compile: /usr/bin/clang -DHAVE_CONFIG_H -I. -I../../tsk -I../.. -I./../.. -Wall -I/opt/local/include -D_THREAD_SAFE -pthread -pipe -Os -arch x86_64 -MT dls_lib.lo -MD -MP -MF .deps/dls_lib.Tpo -c dls_lib.c -fno-common -DPIC -o .libs/dls_lib.o |
---|
1131 | :info:build libtool: compile: /usr/bin/clang -DHAVE_CONFIG_H -I. -I../../tsk -I../.. -I./../.. -Wall -I/opt/local/include -D_THREAD_SAFE -pthread -pipe -Os -arch x86_64 -MT dcat_lib.lo -MD -MP -MF .deps/dcat_lib.Tpo -c dcat_lib.c -o dcat_lib.o >/dev/null 2>&1 |
---|
1132 | :info:build libtool: compile: /usr/bin/clang -DHAVE_CONFIG_H -I. -I../../tsk -I../.. -I./../.. -Wall -I/opt/local/include -D_THREAD_SAFE -pthread -pipe -Os -arch x86_64 -MT dls_lib.lo -MD -MP -MF .deps/dls_lib.Tpo -c dls_lib.c -o dls_lib.o >/dev/null 2>&1 |
---|
1133 | :info:build mv -f .deps/iso9660.Tpo .deps/iso9660.Plo |
---|
1134 | :info:build /bin/sh ../../libtool --tag=CC --mode=compile /usr/bin/clang -DHAVE_CONFIG_H -I. -I../../tsk -I../.. -I./../.. -Wall -I/opt/local/include -D_THREAD_SAFE -pthread -pipe -Os -arch x86_64 -MT dstat_lib.lo -MD -MP -MF .deps/dstat_lib.Tpo -c -o dstat_lib.lo dstat_lib.c |
---|
1135 | :info:build mv -f .deps/dls_lib.Tpo .deps/dls_lib.Plo |
---|
1136 | :info:build /bin/sh ../../libtool --tag=CC --mode=compile /usr/bin/clang -DHAVE_CONFIG_H -I. -I../../tsk -I../.. -I./../.. -Wall -I/opt/local/include -D_THREAD_SAFE -pthread -pipe -Os -arch x86_64 -MT ffind_lib.lo -MD -MP -MF .deps/ffind_lib.Tpo -c -o ffind_lib.lo ffind_lib.c |
---|
1137 | :info:build mv -f .deps/dcat_lib.Tpo .deps/dcat_lib.Plo |
---|
1138 | :info:build /bin/sh ../../libtool --tag=CC --mode=compile /usr/bin/clang -DHAVE_CONFIG_H -I. -I../../tsk -I../.. -I./../.. -Wall -I/opt/local/include -D_THREAD_SAFE -pthread -pipe -Os -arch x86_64 -MT fls_lib.lo -MD -MP -MF .deps/fls_lib.Tpo -c -o fls_lib.lo fls_lib.c |
---|
1139 | :info:build libtool: compile: /usr/bin/clang -DHAVE_CONFIG_H -I. -I../../tsk -I../.. -I./../.. -Wall -I/opt/local/include -D_THREAD_SAFE -pthread -pipe -Os -arch x86_64 -MT dstat_lib.lo -MD -MP -MF .deps/dstat_lib.Tpo -c dstat_lib.c -fno-common -DPIC -o .libs/dstat_lib.o |
---|
1140 | :info:build libtool: compile: /usr/bin/clang -DHAVE_CONFIG_H -I. -I../../tsk -I../.. -I./../.. -Wall -I/opt/local/include -D_THREAD_SAFE -pthread -pipe -Os -arch x86_64 -MT ffind_lib.lo -MD -MP -MF .deps/ffind_lib.Tpo -c ffind_lib.c -fno-common -DPIC -o .libs/ffind_lib.o |
---|
1141 | :info:build libtool: compile: /usr/bin/clang -DHAVE_CONFIG_H -I. -I../../tsk -I../.. -I./../.. -Wall -I/opt/local/include -D_THREAD_SAFE -pthread -pipe -Os -arch x86_64 -MT fls_lib.lo -MD -MP -MF .deps/fls_lib.Tpo -c fls_lib.c -fno-common -DPIC -o .libs/fls_lib.o |
---|
1142 | :info:build libtool: compile: /usr/bin/clang -DHAVE_CONFIG_H -I. -I../../tsk -I../.. -I./../.. -Wall -I/opt/local/include -D_THREAD_SAFE -pthread -pipe -Os -arch x86_64 -MT dstat_lib.lo -MD -MP -MF .deps/dstat_lib.Tpo -c dstat_lib.c -o dstat_lib.o >/dev/null 2>&1 |
---|
1143 | :info:build libtool: compile: /usr/bin/clang -DHAVE_CONFIG_H -I. -I../../tsk -I../.. -I./../.. -Wall -I/opt/local/include -D_THREAD_SAFE -pthread -pipe -Os -arch x86_64 -MT ffind_lib.lo -MD -MP -MF .deps/ffind_lib.Tpo -c ffind_lib.c -o ffind_lib.o >/dev/null 2>&1 |
---|
1144 | :info:build libtool: compile: /usr/bin/clang -DHAVE_CONFIG_H -I. -I../../tsk -I../.. -I./../.. -Wall -I/opt/local/include -D_THREAD_SAFE -pthread -pipe -Os -arch x86_64 -MT fls_lib.lo -MD -MP -MF .deps/fls_lib.Tpo -c fls_lib.c -o fls_lib.o >/dev/null 2>&1 |
---|
1145 | :info:build mv -f .deps/dstat_lib.Tpo .deps/dstat_lib.Plo |
---|
1146 | :info:build /bin/sh ../../libtool --tag=CC --mode=compile /usr/bin/clang -DHAVE_CONFIG_H -I. -I../../tsk -I../.. -I./../.. -Wall -I/opt/local/include -D_THREAD_SAFE -pthread -pipe -Os -arch x86_64 -MT icat_lib.lo -MD -MP -MF .deps/icat_lib.Tpo -c -o icat_lib.lo icat_lib.c |
---|
1147 | :info:build mv -f .deps/ntfs_dent.Tpo .deps/ntfs_dent.Plo |
---|
1148 | :info:build /bin/sh ../../libtool --tag=CC --mode=compile /usr/bin/clang -DHAVE_CONFIG_H -I. -I../../tsk -I../.. -I./../.. -Wall -I/opt/local/include -D_THREAD_SAFE -pthread -pipe -Os -arch x86_64 -MT ifind_lib.lo -MD -MP -MF .deps/ifind_lib.Tpo -c -o ifind_lib.lo ifind_lib.c |
---|
1149 | :info:build mv -f .deps/ffind_lib.Tpo .deps/ffind_lib.Plo |
---|
1150 | :info:build /bin/sh ../../libtool --tag=CC --mode=compile /usr/bin/clang -DHAVE_CONFIG_H -I. -I../../tsk -I../.. -I./../.. -Wall -I/opt/local/include -D_THREAD_SAFE -pthread -pipe -Os -arch x86_64 -MT ils_lib.lo -MD -MP -MF .deps/ils_lib.Tpo -c -o ils_lib.lo ils_lib.c |
---|
1151 | :info:build libtool: compile: /usr/bin/clang -DHAVE_CONFIG_H -I. -I../../tsk -I../.. -I./../.. -Wall -I/opt/local/include -D_THREAD_SAFE -pthread -pipe -Os -arch x86_64 -MT icat_lib.lo -MD -MP -MF .deps/icat_lib.Tpo -c icat_lib.c -fno-common -DPIC -o .libs/icat_lib.o |
---|
1152 | :info:build libtool: compile: /usr/bin/clang -DHAVE_CONFIG_H -I. -I../../tsk -I../.. -I./../.. -Wall -I/opt/local/include -D_THREAD_SAFE -pthread -pipe -Os -arch x86_64 -MT ifind_lib.lo -MD -MP -MF .deps/ifind_lib.Tpo -c ifind_lib.c -fno-common -DPIC -o .libs/ifind_lib.o |
---|
1153 | :info:build mv -f .deps/fls_lib.Tpo .deps/fls_lib.Plo |
---|
1154 | :info:build /bin/sh ../../libtool --tag=CXX --mode=compile /usr/bin/clang++ -DHAVE_CONFIG_H -I. -I../../tsk -I../.. -I./../.. -Wall -I/opt/local/include -D_THREAD_SAFE -pthread -pipe -Os -arch x86_64 -stdlib=libc++ -MT walk_cpp.lo -MD -MP -MF .deps/walk_cpp.Tpo -c -o walk_cpp.lo walk_cpp.cpp |
---|
1155 | :info:build libtool: compile: /usr/bin/clang -DHAVE_CONFIG_H -I. -I../../tsk -I../.. -I./../.. -Wall -I/opt/local/include -D_THREAD_SAFE -pthread -pipe -Os -arch x86_64 -MT ils_lib.lo -MD -MP -MF .deps/ils_lib.Tpo -c ils_lib.c -fno-common -DPIC -o .libs/ils_lib.o |
---|
1156 | :info:build mv -f .deps/ffs.Tpo .deps/ffs.Plo |
---|
1157 | :info:build /bin/sh ../../libtool --tag=CXX --mode=compile /usr/bin/clang++ -DHAVE_CONFIG_H -I. -I../../tsk -I../.. -I./../.. -Wall -I/opt/local/include -D_THREAD_SAFE -pthread -pipe -Os -arch x86_64 -stdlib=libc++ -MT yaffs.lo -MD -MP -MF .deps/yaffs.Tpo -c -o yaffs.lo yaffs.cpp |
---|
1158 | :info:build libtool: compile: /usr/bin/clang -DHAVE_CONFIG_H -I. -I../../tsk -I../.. -I./../.. -Wall -I/opt/local/include -D_THREAD_SAFE -pthread -pipe -Os -arch x86_64 -MT icat_lib.lo -MD -MP -MF .deps/icat_lib.Tpo -c icat_lib.c -o icat_lib.o >/dev/null 2>&1 |
---|
1159 | :info:build libtool: compile: /usr/bin/clang++ -DHAVE_CONFIG_H -I. -I../../tsk -I../.. -I./../.. -Wall -I/opt/local/include -D_THREAD_SAFE -pthread -pipe -Os -arch x86_64 -stdlib=libc++ -MT walk_cpp.lo -MD -MP -MF .deps/walk_cpp.Tpo -c walk_cpp.cpp -fno-common -DPIC -o .libs/walk_cpp.o |
---|
1160 | :info:build libtool: compile: /usr/bin/clang -DHAVE_CONFIG_H -I. -I../../tsk -I../.. -I./../.. -Wall -I/opt/local/include -D_THREAD_SAFE -pthread -pipe -Os -arch x86_64 -MT ifind_lib.lo -MD -MP -MF .deps/ifind_lib.Tpo -c ifind_lib.c -o ifind_lib.o >/dev/null 2>&1 |
---|
1161 | :info:build mv -f .deps/icat_lib.Tpo .deps/icat_lib.Plo |
---|
1162 | :info:build libtool: compile: /usr/bin/clang -DHAVE_CONFIG_H -I. -I../../tsk -I../.. -I./../.. -Wall -I/opt/local/include -D_THREAD_SAFE -pthread -pipe -Os -arch x86_64 -MT ils_lib.lo -MD -MP -MF .deps/ils_lib.Tpo -c ils_lib.c -o ils_lib.o >/dev/null 2>&1 |
---|
1163 | :info:build libtool: compile: /usr/bin/clang++ -DHAVE_CONFIG_H -I. -I../../tsk -I../.. -I./../.. -Wall -I/opt/local/include -D_THREAD_SAFE -pthread -pipe -Os -arch x86_64 -stdlib=libc++ -MT yaffs.lo -MD -MP -MF .deps/yaffs.Tpo -c yaffs.cpp -fno-common -DPIC -o .libs/yaffs.o |
---|
1164 | :info:build 6 warnings generated. |
---|
1165 | :info:build libtool: compile: /usr/bin/clang -DHAVE_CONFIG_H -I. -I../../tsk -I../.. -I./../.. -Wall -I/opt/local/include -D_THREAD_SAFE -pthread -pipe -Os -arch x86_64 -MT hfs.lo -MD -MP -MF .deps/hfs.Tpo -c hfs.c -o hfs.o >/dev/null 2>&1 |
---|
1166 | :info:build libtool: compile: /usr/bin/clang++ -DHAVE_CONFIG_H -I. -I../../tsk -I../.. -I./../.. -Wall -I/opt/local/include -D_THREAD_SAFE -pthread -pipe -Os -arch x86_64 -stdlib=libc++ -MT walk_cpp.lo -MD -MP -MF .deps/walk_cpp.Tpo -c walk_cpp.cpp -o walk_cpp.o >/dev/null 2>&1 |
---|
1167 | :info:build mv -f .deps/ils_lib.Tpo .deps/ils_lib.Plo |
---|
1168 | :info:build mv -f .deps/ifind_lib.Tpo .deps/ifind_lib.Plo |
---|
1169 | :info:build mv -f .deps/walk_cpp.Tpo .deps/walk_cpp.Plo |
---|
1170 | :info:build mv -f .deps/ext2fs.Tpo .deps/ext2fs.Plo |
---|
1171 | :info:build mv -f .deps/ntfs.Tpo .deps/ntfs.Plo |
---|
1172 | :info:build libtool: compile: /usr/bin/clang++ -DHAVE_CONFIG_H -I. -I../../tsk -I../.. -I./../.. -Wall -I/opt/local/include -D_THREAD_SAFE -pthread -pipe -Os -arch x86_64 -stdlib=libc++ -MT yaffs.lo -MD -MP -MF .deps/yaffs.Tpo -c yaffs.cpp -o yaffs.o >/dev/null 2>&1 |
---|
1173 | :info:build mv -f .deps/hfs.Tpo .deps/hfs.Plo |
---|
1174 | :info:build mv -f .deps/yaffs.Tpo .deps/yaffs.Plo |
---|
1175 | :info:build /bin/sh ../../libtool --tag=CXX --mode=link /usr/bin/clang++ -pipe -Os -arch x86_64 -stdlib=libc++ -L/opt/local/lib -Wl,-headerpad_max_install_names -arch x86_64 -D_THREAD_SAFE -pthread -o libtskfs.la fs_inode.lo fs_io.lo fs_block.lo fs_open.lo fs_name.lo fs_dir.lo fs_types.lo fs_attr.lo fs_attrlist.lo fs_load.lo fs_parse.lo fs_file.lo unix_misc.lo nofs_misc.lo ffs.lo ffs_dent.lo ext2fs.lo ext2fs_dent.lo ext2fs_journal.lo fatfs.lo fatfs_meta.lo fatfs_dent.lo ntfs.lo ntfs_dent.lo swapfs.lo rawfs.lo iso9660.lo iso9660_dent.lo hfs.lo hfs_dent.lo hfs_journal.lo hfs_unicompare.lo dcalc_lib.lo dcat_lib.lo dls_lib.lo dstat_lib.lo ffind_lib.lo fls_lib.lo icat_lib.lo ifind_lib.lo ils_lib.lo walk_cpp.lo yaffs.lo -lewf -ldl -lz -ldl -lstdc++ |
---|
1176 | :info:build libtool: link: ar cru .libs/libtskfs.a .libs/fs_inode.o .libs/fs_io.o .libs/fs_block.o .libs/fs_open.o .libs/fs_name.o .libs/fs_dir.o .libs/fs_types.o .libs/fs_attr.o .libs/fs_attrlist.o .libs/fs_load.o .libs/fs_parse.o .libs/fs_file.o .libs/unix_misc.o .libs/nofs_misc.o .libs/ffs.o .libs/ffs_dent.o .libs/ext2fs.o .libs/ext2fs_dent.o .libs/ext2fs_journal.o .libs/fatfs.o .libs/fatfs_meta.o .libs/fatfs_dent.o .libs/ntfs.o .libs/ntfs_dent.o .libs/swapfs.o .libs/rawfs.o .libs/iso9660.o .libs/iso9660_dent.o .libs/hfs.o .libs/hfs_dent.o .libs/hfs_journal.o .libs/hfs_unicompare.o .libs/dcalc_lib.o .libs/dcat_lib.o .libs/dls_lib.o .libs/dstat_lib.o .libs/ffind_lib.o .libs/fls_lib.o .libs/icat_lib.o .libs/ifind_lib.o .libs/ils_lib.o .libs/walk_cpp.o .libs/yaffs.o |
---|
1177 | :info:build libtool: link: ranlib .libs/libtskfs.a |
---|
1178 | :info:build libtool: link: ( cd ".libs" && rm -f "libtskfs.la" && ln -s "../libtskfs.la" "libtskfs.la" ) |
---|
1179 | :info:build make[3]: Leaving directory `/opt/local/var/macports/build/_opt_local_var_macports_sources_rsync.macports.org_release_tarballs_ports_sysutils_sleuthkit/sleuthkit/work/sleuthkit-4.1.3/tsk/fs' |
---|
1180 | :info:build Making all in hashdb |
---|
1181 | :info:build make[3]: Entering directory `/opt/local/var/macports/build/_opt_local_var_macports_sources_rsync.macports.org_release_tarballs_ports_sysutils_sleuthkit/sleuthkit/work/sleuthkit-4.1.3/tsk/hashdb' |
---|
1182 | :info:build /bin/sh ../../libtool --tag=CC --mode=compile /usr/bin/clang -DHAVE_CONFIG_H -I. -I../../tsk -I../.. -I./../.. -Wall -I/opt/local/include -D_THREAD_SAFE -pthread -pipe -Os -arch x86_64 -MT tm_lookup.lo -MD -MP -MF .deps/tm_lookup.Tpo -c -o tm_lookup.lo tm_lookup.c |
---|
1183 | :info:build /bin/sh ../../libtool --tag=CC --mode=compile /usr/bin/clang -DHAVE_CONFIG_H -I. -I../../tsk -I../.. -I./../.. -Wall -I/opt/local/include -D_THREAD_SAFE -pthread -pipe -Os -arch x86_64 -MT md5sum_index.lo -MD -MP -MF .deps/md5sum_index.Tpo -c -o md5sum_index.lo md5sum_index.c |
---|
1184 | :info:build /bin/sh ../../libtool --tag=CC --mode=compile /usr/bin/clang -DHAVE_CONFIG_H -I. -I../../tsk -I../.. -I./../.. -Wall -I/opt/local/include -D_THREAD_SAFE -pthread -pipe -Os -arch x86_64 -MT nsrl_index.lo -MD -MP -MF .deps/nsrl_index.Tpo -c -o nsrl_index.lo nsrl_index.c |
---|
1185 | :info:build /bin/sh ../../libtool --tag=CC --mode=compile /usr/bin/clang -DHAVE_CONFIG_H -I. -I../../tsk -I../.. -I./../.. -Wall -I/opt/local/include -D_THREAD_SAFE -pthread -pipe -Os -arch x86_64 -MT hk_index.lo -MD -MP -MF .deps/hk_index.Tpo -c -o hk_index.lo hk_index.c |
---|
1186 | :info:build /bin/sh ../../libtool --tag=CC --mode=compile /usr/bin/clang -DHAVE_CONFIG_H -I. -I../../tsk -I../.. -I./../.. -Wall -I/opt/local/include -D_THREAD_SAFE -pthread -pipe -Os -arch x86_64 -MT idxonly_index.lo -MD -MP -MF .deps/idxonly_index.Tpo -c -o idxonly_index.lo idxonly_index.c |
---|
1187 | :info:build /bin/sh ../../libtool --tag=CC --mode=compile /usr/bin/clang -DHAVE_CONFIG_H -I. -I../../tsk -I../.. -I./../.. -Wall -I/opt/local/include -D_THREAD_SAFE -pthread -pipe -Os -arch x86_64 -MT encase_index.lo -MD -MP -MF .deps/encase_index.Tpo -c -o encase_index.lo encase_index.c |
---|
1188 | :info:build libtool: compile: /usr/bin/clang -DHAVE_CONFIG_H -I. -I../../tsk -I../.. -I./../.. -Wall -I/opt/local/include -D_THREAD_SAFE -pthread -pipe -Os -arch x86_64 -MT hk_index.lo -MD -MP -MF .deps/hk_index.Tpo -c hk_index.c -fno-common -DPIC -o .libs/hk_index.o |
---|
1189 | :info:build libtool: compile: /usr/bin/clang -DHAVE_CONFIG_H -I. -I../../tsk -I../.. -I./../.. -Wall -I/opt/local/include -D_THREAD_SAFE -pthread -pipe -Os -arch x86_64 -MT nsrl_index.lo -MD -MP -MF .deps/nsrl_index.Tpo -c nsrl_index.c -fno-common -DPIC -o .libs/nsrl_index.o |
---|
1190 | :info:build libtool: compile: /usr/bin/clang -DHAVE_CONFIG_H -I. -I../../tsk -I../.. -I./../.. -Wall -I/opt/local/include -D_THREAD_SAFE -pthread -pipe -Os -arch x86_64 -MT tm_lookup.lo -MD -MP -MF .deps/tm_lookup.Tpo -c tm_lookup.c -fno-common -DPIC -o .libs/tm_lookup.o |
---|
1191 | :info:build libtool: compile: /usr/bin/clang -DHAVE_CONFIG_H -I. -I../../tsk -I../.. -I./../.. -Wall -I/opt/local/include -D_THREAD_SAFE -pthread -pipe -Os -arch x86_64 -MT idxonly_index.lo -MD -MP -MF .deps/idxonly_index.Tpo -c idxonly_index.c -fno-common -DPIC -o .libs/idxonly_index.o |
---|
1192 | :info:build libtool: compile: /usr/bin/clang -DHAVE_CONFIG_H -I. -I../../tsk -I../.. -I./../.. -Wall -I/opt/local/include -D_THREAD_SAFE -pthread -pipe -Os -arch x86_64 -MT md5sum_index.lo -MD -MP -MF .deps/md5sum_index.Tpo -c md5sum_index.c -fno-common -DPIC -o .libs/md5sum_index.o |
---|
1193 | :info:build libtool: compile: /usr/bin/clang -DHAVE_CONFIG_H -I. -I../../tsk -I../.. -I./../.. -Wall -I/opt/local/include -D_THREAD_SAFE -pthread -pipe -Os -arch x86_64 -MT encase_index.lo -MD -MP -MF .deps/encase_index.Tpo -c encase_index.c -fno-common -DPIC -o .libs/encase_index.o |
---|
1194 | :info:build tm_lookup.c:741:83: warning: invalid conversion specifier 'Z' [-Wformat-invalid-specifier] |
---|
1195 | :info:build "hdb_lookup: Hash passed is different size than expected (%d vs %Zd)", |
---|
1196 | :info:build ~^ |
---|
1197 | :info:build libtool: compile: /usr/bin/clang -DHAVE_CONFIG_H -I. -I../../tsk -I../.. -I./../.. -Wall -I/opt/local/include -D_THREAD_SAFE -pthread -pipe -Os -arch x86_64 -MT idxonly_index.lo -MD -MP -MF .deps/idxonly_index.Tpo -c idxonly_index.c -o idxonly_index.o >/dev/null 2>&1 |
---|
1198 | :info:build libtool: compile: /usr/bin/clang -DHAVE_CONFIG_H -I. -I../../tsk -I../.. -I./../.. -Wall -I/opt/local/include -D_THREAD_SAFE -pthread -pipe -Os -arch x86_64 -MT encase_index.lo -MD -MP -MF .deps/encase_index.Tpo -c encase_index.c -o encase_index.o >/dev/null 2>&1 |
---|
1199 | :info:build libtool: compile: /usr/bin/clang -DHAVE_CONFIG_H -I. -I../../tsk -I../.. -I./../.. -Wall -I/opt/local/include -D_THREAD_SAFE -pthread -pipe -Os -arch x86_64 -MT hk_index.lo -MD -MP -MF .deps/hk_index.Tpo -c hk_index.c -o hk_index.o >/dev/null 2>&1 |
---|
1200 | :info:build libtool: compile: /usr/bin/clang -DHAVE_CONFIG_H -I. -I../../tsk -I../.. -I./../.. -Wall -I/opt/local/include -D_THREAD_SAFE -pthread -pipe -Os -arch x86_64 -MT md5sum_index.lo -MD -MP -MF .deps/md5sum_index.Tpo -c md5sum_index.c -o md5sum_index.o >/dev/null 2>&1 |
---|
1201 | :info:build libtool: compile: /usr/bin/clang -DHAVE_CONFIG_H -I. -I../../tsk -I../.. -I./../.. -Wall -I/opt/local/include -D_THREAD_SAFE -pthread -pipe -Os -arch x86_64 -MT nsrl_index.lo -MD -MP -MF .deps/nsrl_index.Tpo -c nsrl_index.c -o nsrl_index.o >/dev/null 2>&1 |
---|
1202 | :info:build mv -f .deps/idxonly_index.Tpo .deps/idxonly_index.Plo |
---|
1203 | :info:build 1 warning generated. |
---|
1204 | :info:build mv -f .deps/encase_index.Tpo .deps/encase_index.Plo |
---|
1205 | :info:build libtool: compile: /usr/bin/clang -DHAVE_CONFIG_H -I. -I../../tsk -I../.. -I./../.. -Wall -I/opt/local/include -D_THREAD_SAFE -pthread -pipe -Os -arch x86_64 -MT tm_lookup.lo -MD -MP -MF .deps/tm_lookup.Tpo -c tm_lookup.c -o tm_lookup.o >/dev/null 2>&1 |
---|
1206 | :info:build mv -f .deps/hk_index.Tpo .deps/hk_index.Plo |
---|
1207 | :info:build mv -f .deps/md5sum_index.Tpo .deps/md5sum_index.Plo |
---|
1208 | :info:build mv -f .deps/nsrl_index.Tpo .deps/nsrl_index.Plo |
---|
1209 | :info:build mv -f .deps/tm_lookup.Tpo .deps/tm_lookup.Plo |
---|
1210 | :info:build /bin/sh ../../libtool --tag=CC --mode=link /usr/bin/clang -pipe -Os -arch x86_64 -L/opt/local/lib -Wl,-headerpad_max_install_names -arch x86_64 -D_THREAD_SAFE -pthread -o libtskhashdb.la tm_lookup.lo md5sum_index.lo nsrl_index.lo hk_index.lo idxonly_index.lo encase_index.lo -lewf -ldl -lz -ldl -lstdc++ |
---|
1211 | :info:build libtool: link: ar cru .libs/libtskhashdb.a .libs/tm_lookup.o .libs/md5sum_index.o .libs/nsrl_index.o .libs/hk_index.o .libs/idxonly_index.o .libs/encase_index.o |
---|
1212 | :info:build libtool: link: ranlib .libs/libtskhashdb.a |
---|
1213 | :info:build libtool: link: ( cd ".libs" && rm -f "libtskhashdb.la" && ln -s "../libtskhashdb.la" "libtskhashdb.la" ) |
---|
1214 | :info:build make[3]: Leaving directory `/opt/local/var/macports/build/_opt_local_var_macports_sources_rsync.macports.org_release_tarballs_ports_sysutils_sleuthkit/sleuthkit/work/sleuthkit-4.1.3/tsk/hashdb' |
---|
1215 | :info:build Making all in auto |
---|
1216 | :info:build make[3]: Entering directory `/opt/local/var/macports/build/_opt_local_var_macports_sources_rsync.macports.org_release_tarballs_ports_sysutils_sleuthkit/sleuthkit/work/sleuthkit-4.1.3/tsk/auto' |
---|
1217 | :info:build /bin/sh ../../libtool --tag=CXX --mode=compile /usr/bin/clang++ -DHAVE_CONFIG_H -I. -I../../tsk -I../.. -I./../.. -Wall -Wmultichar -Wstrict-null-sentinel -Woverloaded-virtual -Wsign-promo -I/opt/local/include -D_THREAD_SAFE -pthread -pipe -Os -arch x86_64 -stdlib=libc++ -MT auto.lo -MD -MP -MF .deps/auto.Tpo -c -o auto.lo auto.cpp |
---|
1218 | :info:build /bin/sh ../../libtool --tag=CXX --mode=compile /usr/bin/clang++ -DHAVE_CONFIG_H -I. -I../../tsk -I../.. -I./../.. -Wall -Wmultichar -Wstrict-null-sentinel -Woverloaded-virtual -Wsign-promo -I/opt/local/include -D_THREAD_SAFE -pthread -pipe -Os -arch x86_64 -stdlib=libc++ -MT auto_db.lo -MD -MP -MF .deps/auto_db.Tpo -c -o auto_db.lo auto_db.cpp |
---|
1219 | :info:build /bin/sh ../../libtool --tag=CC --mode=compile /usr/bin/clang -DHAVE_CONFIG_H -I. -I../../tsk -I../.. -I./../.. -Wall -Wmultichar -Wstrict-null-sentinel -Woverloaded-virtual -Wsign-promo -I/opt/local/include -D_THREAD_SAFE -pthread -pipe -Os -arch x86_64 -MT sqlite3.lo -MD -MP -MF .deps/sqlite3.Tpo -c -o sqlite3.lo sqlite3.c |
---|
1220 | :info:build /bin/sh ../../libtool --tag=CXX --mode=compile /usr/bin/clang++ -DHAVE_CONFIG_H -I. -I../../tsk -I../.. -I./../.. -Wall -Wmultichar -Wstrict-null-sentinel -Woverloaded-virtual -Wsign-promo -I/opt/local/include -D_THREAD_SAFE -pthread -pipe -Os -arch x86_64 -stdlib=libc++ -MT db_sqlite.lo -MD -MP -MF .deps/db_sqlite.Tpo -c -o db_sqlite.lo db_sqlite.cpp |
---|
1221 | :info:build /bin/sh ../../libtool --tag=CXX --mode=compile /usr/bin/clang++ -DHAVE_CONFIG_H -I. -I../../tsk -I../.. -I./../.. -Wall -Wmultichar -Wstrict-null-sentinel -Woverloaded-virtual -Wsign-promo -I/opt/local/include -D_THREAD_SAFE -pthread -pipe -Os -arch x86_64 -stdlib=libc++ -MT case_db.lo -MD -MP -MF .deps/case_db.Tpo -c -o case_db.lo case_db.cpp |
---|
1222 | :info:build libtool: compile: /usr/bin/clang -DHAVE_CONFIG_H -I. -I../../tsk -I../.. -I./../.. -Wall -Wmultichar -Wstrict-null-sentinel -Woverloaded-virtual -Wsign-promo -I/opt/local/include -D_THREAD_SAFE -pthread -pipe -Os -arch x86_64 -MT sqlite3.lo -MD -MP -MF .deps/sqlite3.Tpo -c sqlite3.c -fno-common -DPIC -o .libs/sqlite3.o |
---|
1223 | :info:build warning: unknown warning option '-Wstrict-null-sentinel' [-Wunknown-warning-option] |
---|
1224 | :info:build libtool: compile: /usr/bin/clang++ -DHAVE_CONFIG_H -I. -I../../tsk -I../.. -I./../.. -Wall -Wmultichar -Wstrict-null-sentinel -Woverloaded-virtual -Wsign-promo -I/opt/local/include -D_THREAD_SAFE -pthread -pipe -Os -arch x86_64 -stdlib=libc++ -MT auto.lo -MD -MP -MF .deps/auto.Tpo -c auto.cpp -fno-common -DPIC -o .libs/auto.o |
---|
1225 | :info:build libtool: compile: /usr/bin/clang++ -DHAVE_CONFIG_H -I. -I../../tsk -I../.. -I./../.. -Wall -Wmultichar -Wstrict-null-sentinel -Woverloaded-virtual -Wsign-promo -I/opt/local/include -D_THREAD_SAFE -pthread -pipe -Os -arch x86_64 -stdlib=libc++ -MT auto_db.lo -MD -MP -MF .deps/auto_db.Tpo -c auto_db.cpp -fno-common -DPIC -o .libs/auto_db.o |
---|
1226 | :info:build libtool: compile: /usr/bin/clang++ -DHAVE_CONFIG_H -I. -I../../tsk -I../.. -I./../.. -Wall -Wmultichar -Wstrict-null-sentinel -Woverloaded-virtual -Wsign-promo -I/opt/local/include -D_THREAD_SAFE -pthread -pipe -Os -arch x86_64 -stdlib=libc++ -MT db_sqlite.lo -MD -MP -MF .deps/db_sqlite.Tpo -c db_sqlite.cpp -fno-common -DPIC -o .libs/db_sqlite.o |
---|
1227 | :info:build libtool: compile: /usr/bin/clang++ -DHAVE_CONFIG_H -I. -I../../tsk -I../.. -I./../.. -Wall -Wmultichar -Wstrict-null-sentinel -Woverloaded-virtual -Wsign-promo -I/opt/local/include -D_THREAD_SAFE -pthread -pipe -Os -arch x86_64 -stdlib=libc++ -MT case_db.lo -MD -MP -MF .deps/case_db.Tpo -c case_db.cpp -fno-common -DPIC -o .libs/case_db.o |
---|
1228 | :info:build warning: unknown warning option '-Wstrict-null-sentinel' [-Wunknown-warning-option] |
---|
1229 | :info:build warning: unknown warning option '-Wstrict-null-sentinel' [-Wunknown-warning-option]warning: unknown warning option '-Wstrict-null-sentinel' [-Wunknown-warning-option] |
---|
1230 | :info:build |
---|
1231 | :info:build warning: unknown warning option '-Wstrict-null-sentinel' [-Wunknown-warning-option] |
---|
1232 | :info:build 1 warning generated. |
---|
1233 | :info:build libtool: compile: /usr/bin/clang++ -DHAVE_CONFIG_H -I. -I../../tsk -I../.. -I./../.. -Wall -Wmultichar -Wstrict-null-sentinel -Woverloaded-virtual -Wsign-promo -I/opt/local/include -D_THREAD_SAFE -pthread -pipe -Os -arch x86_64 -stdlib=libc++ -MT auto.lo -MD -MP -MF .deps/auto.Tpo -c auto.cpp -o auto.o >/dev/null 2>&1 |
---|
1234 | :info:build 1 warning generated. |
---|
1235 | :info:build libtool: compile: /usr/bin/clang++ -DHAVE_CONFIG_H -I. -I../../tsk -I../.. -I./../.. -Wall -Wmultichar -Wstrict-null-sentinel -Woverloaded-virtual -Wsign-promo -I/opt/local/include -D_THREAD_SAFE -pthread -pipe -Os -arch x86_64 -stdlib=libc++ -MT case_db.lo -MD -MP -MF .deps/case_db.Tpo -c case_db.cpp -o case_db.o >/dev/null 2>&1 |
---|
1236 | :info:build auto_db.cpp:769:39: warning: '&&' within '||' [-Wlogical-op-parentheses] |
---|
1237 | :info:build unallocBlockWlkTrack->chunkSize > 0 && |
---|
1238 | :info:build ~~~~~~~~~~~~~~~~~~~~~~~~~~~~~~~~~~~~^~ |
---|
1239 | :info:build auto_db.cpp:769:39: note: place parentheses around the '&&' expression to silence this warning |
---|
1240 | :info:build unallocBlockWlkTrack->chunkSize > 0 && |
---|
1241 | :info:build ^ |
---|
1242 | :info:build sqlite3.c:7763:26: warning: unused variable 'sqlite3one' [-Wunused-const-variable] |
---|
1243 | :info:build SQLITE_PRIVATE const int sqlite3one = 1; |
---|
1244 | :info:build ^ |
---|
1245 | :info:build 2 warnings generated. |
---|
1246 | :info:build libtool: compile: /usr/bin/clang++ -DHAVE_CONFIG_H -I. -I../../tsk -I../.. -I./../.. -Wall -Wmultichar -Wstrict-null-sentinel -Woverloaded-virtual -Wsign-promo -I/opt/local/include -D_THREAD_SAFE -pthread -pipe -Os -arch x86_64 -stdlib=libc++ -MT auto_db.lo -MD -MP -MF .deps/auto_db.Tpo -c auto_db.cpp -o auto_db.o >/dev/null 2>&1 |
---|
1247 | :info:build mv -f .deps/auto.Tpo .deps/auto.Plo |
---|
1248 | :info:build mv -f .deps/case_db.Tpo .deps/case_db.Plo |
---|
1249 | :info:build 1 warning generated. |
---|
1250 | :info:build libtool: compile: /usr/bin/clang++ -DHAVE_CONFIG_H -I. -I../../tsk -I../.. -I./../.. -Wall -Wmultichar -Wstrict-null-sentinel -Woverloaded-virtual -Wsign-promo -I/opt/local/include -D_THREAD_SAFE -pthread -pipe -Os -arch x86_64 -stdlib=libc++ -MT db_sqlite.lo -MD -MP -MF .deps/db_sqlite.Tpo -c db_sqlite.cpp -o db_sqlite.o >/dev/null 2>&1 |
---|
1251 | :info:build mv -f .deps/auto_db.Tpo .deps/auto_db.Plo |
---|
1252 | :info:build mv -f .deps/db_sqlite.Tpo .deps/db_sqlite.Plo |
---|
1253 | :info:build 2 warnings generated. |
---|
1254 | :info:build libtool: compile: /usr/bin/clang -DHAVE_CONFIG_H -I. -I../../tsk -I../.. -I./../.. -Wall -Wmultichar -Wstrict-null-sentinel -Woverloaded-virtual -Wsign-promo -I/opt/local/include -D_THREAD_SAFE -pthread -pipe -Os -arch x86_64 -MT sqlite3.lo -MD -MP -MF .deps/sqlite3.Tpo -c sqlite3.c -o sqlite3.o >/dev/null 2>&1 |
---|
1255 | :info:build mv -f .deps/sqlite3.Tpo .deps/sqlite3.Plo |
---|
1256 | :info:build /bin/sh ../../libtool --tag=CXX --mode=link /usr/bin/clang++ -pipe -Os -arch x86_64 -stdlib=libc++ -L/opt/local/lib -Wl,-headerpad_max_install_names -arch x86_64 -D_THREAD_SAFE -pthread -o libtskauto.la auto.lo auto_db.lo sqlite3.lo db_sqlite.lo case_db.lo -lewf -ldl -lz -ldl -lstdc++ |
---|
1257 | :info:build libtool: link: ar cru .libs/libtskauto.a .libs/auto.o .libs/auto_db.o .libs/sqlite3.o .libs/db_sqlite.o .libs/case_db.o |
---|
1258 | :info:build libtool: link: ranlib .libs/libtskauto.a |
---|
1259 | :info:build libtool: link: ( cd ".libs" && rm -f "libtskauto.la" && ln -s "../libtskauto.la" "libtskauto.la" ) |
---|
1260 | :info:build make[3]: Leaving directory `/opt/local/var/macports/build/_opt_local_var_macports_sources_rsync.macports.org_release_tarballs_ports_sysutils_sleuthkit/sleuthkit/work/sleuthkit-4.1.3/tsk/auto' |
---|
1261 | :info:build make[3]: Entering directory `/opt/local/var/macports/build/_opt_local_var_macports_sources_rsync.macports.org_release_tarballs_ports_sysutils_sleuthkit/sleuthkit/work/sleuthkit-4.1.3/tsk' |
---|
1262 | :info:build /bin/sh ../libtool --tag=CC --mode=link /usr/bin/clang -pipe -Os -arch x86_64 -version-info 12:0:2 -L/opt/local/lib -Wl,-headerpad_max_install_names -arch x86_64 -D_THREAD_SAFE -pthread -o libtsk.la -rpath /opt/local/lib base/libtskbase.la img/libtskimg.la vs/libtskvs.la fs/libtskfs.la hashdb/libtskhashdb.la auto/libtskauto.la -lewf -ldl -lz -ldl -lstdc++ |
---|
1263 | :info:build libtool: link: (cd .libs/libtsk.lax/libtskbase.a && ar x "/opt/local/var/macports/build/_opt_local_var_macports_sources_rsync.macports.org_release_tarballs_ports_sysutils_sleuthkit/sleuthkit/work/sleuthkit-4.1.3/tsk/base/.libs/libtskbase.a") |
---|
1264 | :info:build libtool: link: (cd .libs/libtsk.lax/libtskimg.a && ar x "/opt/local/var/macports/build/_opt_local_var_macports_sources_rsync.macports.org_release_tarballs_ports_sysutils_sleuthkit/sleuthkit/work/sleuthkit-4.1.3/tsk/img/.libs/libtskimg.a") |
---|
1265 | :info:build libtool: link: (cd .libs/libtsk.lax/libtskvs.a && ar x "/opt/local/var/macports/build/_opt_local_var_macports_sources_rsync.macports.org_release_tarballs_ports_sysutils_sleuthkit/sleuthkit/work/sleuthkit-4.1.3/tsk/vs/.libs/libtskvs.a") |
---|
1266 | :info:build libtool: link: (cd .libs/libtsk.lax/libtskfs.a && ar x "/opt/local/var/macports/build/_opt_local_var_macports_sources_rsync.macports.org_release_tarballs_ports_sysutils_sleuthkit/sleuthkit/work/sleuthkit-4.1.3/tsk/fs/.libs/libtskfs.a") |
---|
1267 | :info:build libtool: link: (cd .libs/libtsk.lax/libtskhashdb.a && ar x "/opt/local/var/macports/build/_opt_local_var_macports_sources_rsync.macports.org_release_tarballs_ports_sysutils_sleuthkit/sleuthkit/work/sleuthkit-4.1.3/tsk/hashdb/.libs/libtskhashdb.a") |
---|
1268 | :info:build libtool: link: (cd .libs/libtsk.lax/libtskauto.a && ar x "/opt/local/var/macports/build/_opt_local_var_macports_sources_rsync.macports.org_release_tarballs_ports_sysutils_sleuthkit/sleuthkit/work/sleuthkit-4.1.3/tsk/auto/.libs/libtskauto.a") |
---|
1269 | :info:build libtool: link: /usr/bin/clang -dynamiclib -Wl,-flat_namespace -Wl,-undefined -Wl,suppress -o .libs/libtsk.10.dylib .libs/libtsk.lax/libtskbase.a/crc.o .libs/libtsk.lax/libtskbase.a/md5c.o .libs/libtsk.lax/libtskbase.a/mymalloc.o .libs/libtsk.lax/libtskbase.a/sha1c.o .libs/libtsk.lax/libtskbase.a/tsk_endian.o .libs/libtsk.lax/libtskbase.a/tsk_error.o .libs/libtsk.lax/libtskbase.a/tsk_error_win32.o .libs/libtsk.lax/libtskbase.a/tsk_list.o .libs/libtsk.lax/libtskbase.a/tsk_lock.o .libs/libtsk.lax/libtskbase.a/tsk_parse.o .libs/libtsk.lax/libtskbase.a/tsk_printf.o .libs/libtsk.lax/libtskbase.a/tsk_stack.o .libs/libtsk.lax/libtskbase.a/tsk_unicode.o .libs/libtsk.lax/libtskbase.a/tsk_version.o .libs/libtsk.lax/libtskbase.a/XGetopt.o .libs/libtsk.lax/libtskimg.a/aff.o .libs/libtsk.lax/libtskimg.a/ewf.o .libs/libtsk.lax/libtskimg.a/img_io.o .libs/libtsk.lax/libtskimg.a/img_open.o .libs/libtsk.lax/libtskimg.a/img_types.o .libs/libtsk.lax/libtskimg.a/mult_files.o .libs/libtsk.lax/libtskimg.a/raw.o .libs/libtsk.lax/libtskvs.a/bsd.o .libs/libtsk.lax/libtskvs.a/dos.o .libs/libtsk.lax/libtskvs.a/gpt.o .libs/libtsk.lax/libtskvs.a/mac.o .libs/libtsk.lax/libtskvs.a/mm_io.o .libs/libtsk.lax/libtskvs.a/mm_open.o .libs/libtsk.lax/libtskvs.a/mm_part.o .libs/libtsk.lax/libtskvs.a/mm_types.o .libs/libtsk.lax/libtskvs.a/sun.o .libs/libtsk.lax/libtskfs.a/dcalc_lib.o .libs/libtsk.lax/libtskfs.a/dcat_lib.o .libs/libtsk.lax/libtskfs.a/dls_lib.o .libs/libtsk.lax/libtskfs.a/dstat_lib.o .libs/libtsk.lax/libtskfs.a/ext2fs.o .libs/libtsk.lax/libtskfs.a/ext2fs_dent.o .libs/libtsk.lax/libtskfs.a/ext2fs_journal.o .libs/libtsk.lax/libtskfs.a/fatfs.o .libs/libtsk.lax/libtskfs.a/fatfs_dent.o .libs/libtsk.lax/libtskfs.a/fatfs_meta.o .libs/libtsk.lax/libtskfs.a/ffind_lib.o .libs/libtsk.lax/libtskfs.a/ffs.o .libs/libtsk.lax/libtskfs.a/ffs_dent.o .libs/libtsk.lax/libtskfs.a/fls_lib.o .libs/libtsk.lax/libtskfs.a/fs_attr.o .libs/libtsk.lax/libtskfs.a/fs_attrlist.o .libs/libtsk.lax/libtskfs.a/fs_block.o .libs/libtsk.lax/libtskfs.a/fs_dir.o .libs/libtsk.lax/libtskfs.a/fs_file.o .libs/libtsk.lax/libtskfs.a/fs_inode.o .libs/libtsk.lax/libtskfs.a/fs_io.o .libs/libtsk.lax/libtskfs.a/fs_load.o .libs/libtsk.lax/libtskfs.a/fs_name.o .libs/libtsk.lax/libtskfs.a/fs_open.o .libs/libtsk.lax/libtskfs.a/fs_parse.o .libs/libtsk.lax/libtskfs.a/fs_types.o .libs/libtsk.lax/libtskfs.a/hfs.o .libs/libtsk.lax/libtskfs.a/hfs_dent.o .libs/libtsk.lax/libtskfs.a/hfs_journal.o .libs/libtsk.lax/libtskfs.a/hfs_unicompare.o .libs/libtsk.lax/libtskfs.a/icat_lib.o .libs/libtsk.lax/libtskfs.a/ifind_lib.o .libs/libtsk.lax/libtskfs.a/ils_lib.o .libs/libtsk.lax/libtskfs.a/iso9660.o .libs/libtsk.lax/libtskfs.a/iso9660_dent.o .libs/libtsk.lax/libtskfs.a/nofs_misc.o .libs/libtsk.lax/libtskfs.a/ntfs.o .libs/libtsk.lax/libtskfs.a/ntfs_dent.o .libs/libtsk.lax/libtskfs.a/rawfs.o .libs/libtsk.lax/libtskfs.a/swapfs.o .libs/libtsk.lax/libtskfs.a/unix_misc.o .libs/libtsk.lax/libtskfs.a/walk_cpp.o .libs/libtsk.lax/libtskfs.a/yaffs.o .libs/libtsk.lax/libtskhashdb.a/encase_index.o .libs/libtsk.lax/libtskhashdb.a/hk_index.o .libs/libtsk.lax/libtskhashdb.a/idxonly_index.o .libs/libtsk.lax/libtskhashdb.a/md5sum_index.o .libs/libtsk.lax/libtskhashdb.a/nsrl_index.o .libs/libtsk.lax/libtskhashdb.a/tm_lookup.o .libs/libtsk.lax/libtskauto.a/auto.o .libs/libtsk.lax/libtskauto.a/auto_db.o .libs/libtsk.lax/libtskauto.a/case_db.o .libs/libtsk.lax/libtskauto.a/db_sqlite.o .libs/libtsk.lax/libtskauto.a/sqlite3.o -L/opt/local/lib -lewf -lz -ldl -lstdc++ -arch x86_64 -Wl,-headerpad_max_install_names -arch x86_64 -pthread -pthread -install_name /opt/local/lib/libtsk.10.dylib -compatibility_version 13 -current_version 13.0 -Wl,-single_module |
---|
1270 | :info:build clang: warning: argument unused during compilation: '-pthread' |
---|
1271 | :info:build clang: warning: argument unused during compilation: '-pthread' |
---|
1272 | :info:build libtool: link: dsymutil .libs/libtsk.10.dylib || : |
---|
1273 | :info:build warning: no debug symbols in executable (-arch x86_64) |
---|
1274 | :info:build libtool: link: (cd ".libs" && rm -f "libtsk.dylib" && ln -s "libtsk.10.dylib" "libtsk.dylib") |
---|
1275 | :info:build libtool: link: (cd ".libs" && rm -f "libtsk.10.2.0.dylib" && ln -s "libtsk.10.dylib" "libtsk.10.2.0.dylib") |
---|
1276 | :info:build libtool: link: (cd .libs/libtsk.lax/lt1-libtskbase.a && ar x "/opt/local/var/macports/build/_opt_local_var_macports_sources_rsync.macports.org_release_tarballs_ports_sysutils_sleuthkit/sleuthkit/work/sleuthkit-4.1.3/tsk/base/.libs/libtskbase.a") |
---|
1277 | :info:build libtool: link: (cd .libs/libtsk.lax/lt2-libtskimg.a && ar x "/opt/local/var/macports/build/_opt_local_var_macports_sources_rsync.macports.org_release_tarballs_ports_sysutils_sleuthkit/sleuthkit/work/sleuthkit-4.1.3/tsk/img/.libs/libtskimg.a") |
---|
1278 | :info:build libtool: link: (cd .libs/libtsk.lax/lt3-libtskvs.a && ar x "/opt/local/var/macports/build/_opt_local_var_macports_sources_rsync.macports.org_release_tarballs_ports_sysutils_sleuthkit/sleuthkit/work/sleuthkit-4.1.3/tsk/vs/.libs/libtskvs.a") |
---|
1279 | :info:build libtool: link: (cd .libs/libtsk.lax/lt4-libtskfs.a && ar x "/opt/local/var/macports/build/_opt_local_var_macports_sources_rsync.macports.org_release_tarballs_ports_sysutils_sleuthkit/sleuthkit/work/sleuthkit-4.1.3/tsk/fs/.libs/libtskfs.a") |
---|
1280 | :info:build libtool: link: (cd .libs/libtsk.lax/lt5-libtskhashdb.a && ar x "/opt/local/var/macports/build/_opt_local_var_macports_sources_rsync.macports.org_release_tarballs_ports_sysutils_sleuthkit/sleuthkit/work/sleuthkit-4.1.3/tsk/hashdb/.libs/libtskhashdb.a") |
---|
1281 | :info:build libtool: link: (cd .libs/libtsk.lax/lt6-libtskauto.a && ar x "/opt/local/var/macports/build/_opt_local_var_macports_sources_rsync.macports.org_release_tarballs_ports_sysutils_sleuthkit/sleuthkit/work/sleuthkit-4.1.3/tsk/auto/.libs/libtskauto.a") |
---|
1282 | :info:build libtool: link: ar cru .libs/libtsk.a .libs/libtsk.lax/lt1-libtskbase.a/crc.o .libs/libtsk.lax/lt1-libtskbase.a/md5c.o .libs/libtsk.lax/lt1-libtskbase.a/mymalloc.o .libs/libtsk.lax/lt1-libtskbase.a/sha1c.o .libs/libtsk.lax/lt1-libtskbase.a/tsk_endian.o .libs/libtsk.lax/lt1-libtskbase.a/tsk_error.o .libs/libtsk.lax/lt1-libtskbase.a/tsk_error_win32.o .libs/libtsk.lax/lt1-libtskbase.a/tsk_list.o .libs/libtsk.lax/lt1-libtskbase.a/tsk_lock.o .libs/libtsk.lax/lt1-libtskbase.a/tsk_parse.o .libs/libtsk.lax/lt1-libtskbase.a/tsk_printf.o .libs/libtsk.lax/lt1-libtskbase.a/tsk_stack.o .libs/libtsk.lax/lt1-libtskbase.a/tsk_unicode.o .libs/libtsk.lax/lt1-libtskbase.a/tsk_version.o .libs/libtsk.lax/lt1-libtskbase.a/XGetopt.o .libs/libtsk.lax/lt2-libtskimg.a/aff.o .libs/libtsk.lax/lt2-libtskimg.a/ewf.o .libs/libtsk.lax/lt2-libtskimg.a/img_io.o .libs/libtsk.lax/lt2-libtskimg.a/img_open.o .libs/libtsk.lax/lt2-libtskimg.a/img_types.o .libs/libtsk.lax/lt2-libtskimg.a/mult_files.o .libs/libtsk.lax/lt2-libtskimg.a/raw.o .libs/libtsk.lax/lt3-libtskvs.a/bsd.o .libs/libtsk.lax/lt3-libtskvs.a/dos.o .libs/libtsk.lax/lt3-libtskvs.a/gpt.o .libs/libtsk.lax/lt3-libtskvs.a/mac.o .libs/libtsk.lax/lt3-libtskvs.a/mm_io.o .libs/libtsk.lax/lt3-libtskvs.a/mm_open.o .libs/libtsk.lax/lt3-libtskvs.a/mm_part.o .libs/libtsk.lax/lt3-libtskvs.a/mm_types.o .libs/libtsk.lax/lt3-libtskvs.a/sun.o .libs/libtsk.lax/lt4-libtskfs.a/dcalc_lib.o .libs/libtsk.lax/lt4-libtskfs.a/dcat_lib.o .libs/libtsk.lax/lt4-libtskfs.a/dls_lib.o .libs/libtsk.lax/lt4-libtskfs.a/dstat_lib.o .libs/libtsk.lax/lt4-libtskfs.a/ext2fs.o .libs/libtsk.lax/lt4-libtskfs.a/ext2fs_dent.o .libs/libtsk.lax/lt4-libtskfs.a/ext2fs_journal.o .libs/libtsk.lax/lt4-libtskfs.a/fatfs.o .libs/libtsk.lax/lt4-libtskfs.a/fatfs_dent.o .libs/libtsk.lax/lt4-libtskfs.a/fatfs_meta.o .libs/libtsk.lax/lt4-libtskfs.a/ffind_lib.o .libs/libtsk.lax/lt4-libtskfs.a/ffs.o .libs/libtsk.lax/lt4-libtskfs.a/ffs_dent.o .libs/libtsk.lax/lt4-libtskfs.a/fls_lib.o .libs/libtsk.lax/lt4-libtskfs.a/fs_attr.o .libs/libtsk.lax/lt4-libtskfs.a/fs_attrlist.o .libs/libtsk.lax/lt4-libtskfs.a/fs_block.o .libs/libtsk.lax/lt4-libtskfs.a/fs_dir.o .libs/libtsk.lax/lt4-libtskfs.a/fs_file.o .libs/libtsk.lax/lt4-libtskfs.a/fs_inode.o .libs/libtsk.lax/lt4-libtskfs.a/fs_io.o .libs/libtsk.lax/lt4-libtskfs.a/fs_load.o .libs/libtsk.lax/lt4-libtskfs.a/fs_name.o .libs/libtsk.lax/lt4-libtskfs.a/fs_open.o .libs/libtsk.lax/lt4-libtskfs.a/fs_parse.o .libs/libtsk.lax/lt4-libtskfs.a/fs_types.o .libs/libtsk.lax/lt4-libtskfs.a/hfs.o .libs/libtsk.lax/lt4-libtskfs.a/hfs_dent.o .libs/libtsk.lax/lt4-libtskfs.a/hfs_journal.o .libs/libtsk.lax/lt4-libtskfs.a/hfs_unicompare.o .libs/libtsk.lax/lt4-libtskfs.a/icat_lib.o .libs/libtsk.lax/lt4-libtskfs.a/ifind_lib.o .libs/libtsk.lax/lt4-libtskfs.a/ils_lib.o .libs/libtsk.lax/lt4-libtskfs.a/iso9660.o .libs/libtsk.lax/lt4-libtskfs.a/iso9660_dent.o .libs/libtsk.lax/lt4-libtskfs.a/nofs_misc.o .libs/libtsk.lax/lt4-libtskfs.a/ntfs.o .libs/libtsk.lax/lt4-libtskfs.a/ntfs_dent.o .libs/libtsk.lax/lt4-libtskfs.a/rawfs.o .libs/libtsk.lax/lt4-libtskfs.a/swapfs.o .libs/libtsk.lax/lt4-libtskfs.a/unix_misc.o .libs/libtsk.lax/lt4-libtskfs.a/walk_cpp.o .libs/libtsk.lax/lt4-libtskfs.a/yaffs.o .libs/libtsk.lax/lt5-libtskhashdb.a/encase_index.o .libs/libtsk.lax/lt5-libtskhashdb.a/hk_index.o .libs/libtsk.lax/lt5-libtskhashdb.a/idxonly_index.o .libs/libtsk.lax/lt5-libtskhashdb.a/md5sum_index.o .libs/libtsk.lax/lt5-libtskhashdb.a/nsrl_index.o .libs/libtsk.lax/lt5-libtskhashdb.a/tm_lookup.o .libs/libtsk.lax/lt6-libtskauto.a/auto.o .libs/libtsk.lax/lt6-libtskauto.a/auto_db.o .libs/libtsk.lax/lt6-libtskauto.a/case_db.o .libs/libtsk.lax/lt6-libtskauto.a/db_sqlite.o .libs/libtsk.lax/lt6-libtskauto.a/sqlite3.o |
---|
1283 | :info:build /opt/local/bin/ranlib: file: .libs/libtsk.a(tsk_error_win32.o) has no symbols |
---|
1284 | :info:build /opt/local/bin/ranlib: file: .libs/libtsk.a(XGetopt.o) has no symbols |
---|
1285 | :info:build /opt/local/bin/ranlib: file: .libs/libtsk.a(aff.o) has no symbols |
---|
1286 | :info:build libtool: link: ranlib .libs/libtsk.a |
---|
1287 | :info:build ranlib: file: .libs/libtsk.a(tsk_error_win32.o) has no symbols |
---|
1288 | :info:build ranlib: file: .libs/libtsk.a(XGetopt.o) has no symbols |
---|
1289 | :info:build ranlib: file: .libs/libtsk.a(aff.o) has no symbols |
---|
1290 | :info:build libtool: link: rm -fr .libs/libtsk.lax .libs/libtsk.lax |
---|
1291 | :info:build libtool: link: ( cd ".libs" && rm -f "libtsk.la" && ln -s "../libtsk.la" "libtsk.la" ) |
---|
1292 | :info:build make[3]: Leaving directory `/opt/local/var/macports/build/_opt_local_var_macports_sources_rsync.macports.org_release_tarballs_ports_sysutils_sleuthkit/sleuthkit/work/sleuthkit-4.1.3/tsk' |
---|
1293 | :info:build make[2]: Leaving directory `/opt/local/var/macports/build/_opt_local_var_macports_sources_rsync.macports.org_release_tarballs_ports_sysutils_sleuthkit/sleuthkit/work/sleuthkit-4.1.3/tsk' |
---|
1294 | :info:build make[1]: Leaving directory `/opt/local/var/macports/build/_opt_local_var_macports_sources_rsync.macports.org_release_tarballs_ports_sysutils_sleuthkit/sleuthkit/work/sleuthkit-4.1.3/tsk' |
---|
1295 | :info:build Making all in tools |
---|
1296 | :info:build make[1]: Entering directory `/opt/local/var/macports/build/_opt_local_var_macports_sources_rsync.macports.org_release_tarballs_ports_sysutils_sleuthkit/sleuthkit/work/sleuthkit-4.1.3/tools' |
---|
1297 | :info:build Making all in imgtools |
---|
1298 | :info:build make[2]: Entering directory `/opt/local/var/macports/build/_opt_local_var_macports_sources_rsync.macports.org_release_tarballs_ports_sysutils_sleuthkit/sleuthkit/work/sleuthkit-4.1.3/tools/imgtools' |
---|
1299 | :info:build /usr/bin/clang++ -DHAVE_CONFIG_H -I. -I../../tsk -I../.. -I./../.. -Wall -I/opt/local/include -D_THREAD_SAFE -pthread -pipe -Os -arch x86_64 -stdlib=libc++ -MT img_cat.o -MD -MP -MF .deps/img_cat.Tpo -c -o img_cat.o img_cat.cpp |
---|
1300 | :info:build /usr/bin/clang++ -DHAVE_CONFIG_H -I. -I../../tsk -I../.. -I./../.. -Wall -I/opt/local/include -D_THREAD_SAFE -pthread -pipe -Os -arch x86_64 -stdlib=libc++ -MT img_stat.o -MD -MP -MF .deps/img_stat.Tpo -c -o img_stat.o img_stat.cpp |
---|
1301 | :info:build mv -f .deps/img_stat.Tpo .deps/img_stat.Po |
---|
1302 | :info:build /bin/sh ../../libtool --tag=CXX --mode=link /usr/bin/clang++ -pipe -Os -arch x86_64 -stdlib=libc++ -L/opt/local/lib -Wl,-headerpad_max_install_names -arch x86_64 -D_THREAD_SAFE -pthread -static -o img_stat img_stat.o ../../tsk/libtsk.la -lewf -ldl -lz -ldl -lstdc++ |
---|
1303 | :info:build mv -f .deps/img_cat.Tpo .deps/img_cat.Po |
---|
1304 | :info:build /bin/sh ../../libtool --tag=CXX --mode=link /usr/bin/clang++ -pipe -Os -arch x86_64 -stdlib=libc++ -L/opt/local/lib -Wl,-headerpad_max_install_names -arch x86_64 -D_THREAD_SAFE -pthread -static -o img_cat img_cat.o ../../tsk/libtsk.la -lewf -ldl -lz -ldl -lstdc++ |
---|
1305 | :info:build libtool: link: /usr/bin/clang++ -pipe -Os -arch x86_64 -stdlib=libc++ -Wl,-headerpad_max_install_names -arch x86_64 -D_THREAD_SAFE -pthread -o img_stat img_stat.o -L/opt/local/lib ../../tsk/.libs/libtsk.a -lewf -lz -ldl -lstdc++ -pthread |
---|
1306 | :info:build libtool: link: /usr/bin/clang++ -pipe -Os -arch x86_64 -stdlib=libc++ -Wl,-headerpad_max_install_names -arch x86_64 -D_THREAD_SAFE -pthread -o img_cat img_cat.o -L/opt/local/lib ../../tsk/.libs/libtsk.a -lewf -lz -ldl -lstdc++ -pthread |
---|
1307 | :info:build clang: warning: argument unused during compilation: '-pthread' |
---|
1308 | :info:build clang: warning: argument unused during compilation: '-pthread' |
---|
1309 | :info:build clang: warning: argument unused during compilation: '-pthread' |
---|
1310 | :info:build clang: warning: argument unused during compilation: '-pthread' |
---|
1311 | :info:build make[2]: Leaving directory `/opt/local/var/macports/build/_opt_local_var_macports_sources_rsync.macports.org_release_tarballs_ports_sysutils_sleuthkit/sleuthkit/work/sleuthkit-4.1.3/tools/imgtools' |
---|
1312 | :info:build Making all in vstools |
---|
1313 | :info:build make[2]: Entering directory `/opt/local/var/macports/build/_opt_local_var_macports_sources_rsync.macports.org_release_tarballs_ports_sysutils_sleuthkit/sleuthkit/work/sleuthkit-4.1.3/tools/vstools' |
---|
1314 | :info:build /usr/bin/clang++ -DHAVE_CONFIG_H -I. -I../../tsk -I../.. -I./../.. -Wall -I/opt/local/include -D_THREAD_SAFE -pthread -pipe -Os -arch x86_64 -stdlib=libc++ -MT mmls.o -MD -MP -MF .deps/mmls.Tpo -c -o mmls.o mmls.cpp |
---|
1315 | :info:build /usr/bin/clang++ -DHAVE_CONFIG_H -I. -I../../tsk -I../.. -I./../.. -Wall -I/opt/local/include -D_THREAD_SAFE -pthread -pipe -Os -arch x86_64 -stdlib=libc++ -MT mmstat.o -MD -MP -MF .deps/mmstat.Tpo -c -o mmstat.o mmstat.cpp |
---|
1316 | :info:build /usr/bin/clang++ -DHAVE_CONFIG_H -I. -I../../tsk -I../.. -I./../.. -Wall -I/opt/local/include -D_THREAD_SAFE -pthread -pipe -Os -arch x86_64 -stdlib=libc++ -MT mmcat.o -MD -MP -MF .deps/mmcat.Tpo -c -o mmcat.o mmcat.cpp |
---|
1317 | :info:build mv -f .deps/mmstat.Tpo .deps/mmstat.Po |
---|
1318 | :info:build mv -f .deps/mmcat.Tpo .deps/mmcat.Po |
---|
1319 | :info:build /bin/sh ../../libtool --tag=CXX --mode=link /usr/bin/clang++ -pipe -Os -arch x86_64 -stdlib=libc++ -L/opt/local/lib -Wl,-headerpad_max_install_names -arch x86_64 -D_THREAD_SAFE -pthread -static -o mmstat mmstat.o ../../tsk/libtsk.la -lewf -ldl -lz -ldl -lstdc++ |
---|
1320 | :info:build /bin/sh ../../libtool --tag=CXX --mode=link /usr/bin/clang++ -pipe -Os -arch x86_64 -stdlib=libc++ -L/opt/local/lib -Wl,-headerpad_max_install_names -arch x86_64 -D_THREAD_SAFE -pthread -static -o mmcat mmcat.o ../../tsk/libtsk.la -lewf -ldl -lz -ldl -lstdc++ |
---|
1321 | :info:build mv -f .deps/mmls.Tpo .deps/mmls.Po |
---|
1322 | :info:build /bin/sh ../../libtool --tag=CXX --mode=link /usr/bin/clang++ -pipe -Os -arch x86_64 -stdlib=libc++ -L/opt/local/lib -Wl,-headerpad_max_install_names -arch x86_64 -D_THREAD_SAFE -pthread -static -o mmls mmls.o ../../tsk/libtsk.la -lewf -ldl -lz -ldl -lstdc++ |
---|
1323 | :info:build libtool: link: /usr/bin/clang++ -pipe -Os -arch x86_64 -stdlib=libc++ -Wl,-headerpad_max_install_names -arch x86_64 -D_THREAD_SAFE -pthread -o mmcat mmcat.o -L/opt/local/lib ../../tsk/.libs/libtsk.a -lewf -lz -ldl -lstdc++ -pthread |
---|
1324 | :info:build libtool: link: /usr/bin/clang++ -pipe -Os -arch x86_64 -stdlib=libc++ -Wl,-headerpad_max_install_names -arch x86_64 -D_THREAD_SAFE -pthread -o mmstat mmstat.o -L/opt/local/lib ../../tsk/.libs/libtsk.a -lewf -lz -ldl -lstdc++ -pthread |
---|
1325 | :info:build clang: warning: argument unused during compilation: '-pthread'clang: |
---|
1326 | :info:build warning: argument unused during compilation: '-pthread'clang: warning: |
---|
1327 | :info:build argument unused during compilation: '-pthread' |
---|
1328 | :info:build clang: warning: argument unused during compilation: '-pthread' |
---|
1329 | :info:build libtool: link: /usr/bin/clang++ -pipe -Os -arch x86_64 -stdlib=libc++ -Wl,-headerpad_max_install_names -arch x86_64 -D_THREAD_SAFE -pthread -o mmls mmls.o -L/opt/local/lib ../../tsk/.libs/libtsk.a -lewf -lz -ldl -lstdc++ -pthread |
---|
1330 | :info:build clang: warning: argument unused during compilation: '-pthread' |
---|
1331 | :info:build clang: warning: argument unused during compilation: '-pthread' |
---|
1332 | :info:build make[2]: Leaving directory `/opt/local/var/macports/build/_opt_local_var_macports_sources_rsync.macports.org_release_tarballs_ports_sysutils_sleuthkit/sleuthkit/work/sleuthkit-4.1.3/tools/vstools' |
---|
1333 | :info:build Making all in fstools |
---|
1334 | :info:build make[2]: Entering directory `/opt/local/var/macports/build/_opt_local_var_macports_sources_rsync.macports.org_release_tarballs_ports_sysutils_sleuthkit/sleuthkit/work/sleuthkit-4.1.3/tools/fstools' |
---|
1335 | :info:build /usr/bin/clang++ -DHAVE_CONFIG_H -I. -I../../tsk -I../.. -I./../.. -Wall -I/opt/local/include -D_THREAD_SAFE -pthread -pipe -Os -arch x86_64 -stdlib=libc++ -MT blkcalc.o -MD -MP -MF .deps/blkcalc.Tpo -c -o blkcalc.o blkcalc.cpp |
---|
1336 | :info:build /usr/bin/clang++ -DHAVE_CONFIG_H -I. -I../../tsk -I../.. -I./../.. -Wall -I/opt/local/include -D_THREAD_SAFE -pthread -pipe -Os -arch x86_64 -stdlib=libc++ -MT blkcat.o -MD -MP -MF .deps/blkcat.Tpo -c -o blkcat.o blkcat.cpp |
---|
1337 | :info:build /usr/bin/clang++ -DHAVE_CONFIG_H -I. -I../../tsk -I../.. -I./../.. -Wall -I/opt/local/include -D_THREAD_SAFE -pthread -pipe -Os -arch x86_64 -stdlib=libc++ -MT blkls.o -MD -MP -MF .deps/blkls.Tpo -c -o blkls.o blkls.cpp |
---|
1338 | :info:build /usr/bin/clang++ -DHAVE_CONFIG_H -I. -I../../tsk -I../.. -I./../.. -Wall -I/opt/local/include -D_THREAD_SAFE -pthread -pipe -Os -arch x86_64 -stdlib=libc++ -MT blkstat.o -MD -MP -MF .deps/blkstat.Tpo -c -o blkstat.o blkstat.cpp |
---|
1339 | :info:build /usr/bin/clang++ -DHAVE_CONFIG_H -I. -I../../tsk -I../.. -I./../.. -Wall -I/opt/local/include -D_THREAD_SAFE -pthread -pipe -Os -arch x86_64 -stdlib=libc++ -MT ffind.o -MD -MP -MF .deps/ffind.Tpo -c -o ffind.o ffind.cpp |
---|
1340 | :info:build /usr/bin/clang++ -DHAVE_CONFIG_H -I. -I../../tsk -I../.. -I./../.. -Wall -I/opt/local/include -D_THREAD_SAFE -pthread -pipe -Os -arch x86_64 -stdlib=libc++ -MT fls.o -MD -MP -MF .deps/fls.Tpo -c -o fls.o fls.cpp |
---|
1341 | :info:build /usr/bin/clang++ -DHAVE_CONFIG_H -I. -I../../tsk -I../.. -I./../.. -Wall -I/opt/local/include -D_THREAD_SAFE -pthread -pipe -Os -arch x86_64 -stdlib=libc++ -MT fcat.o -MD -MP -MF .deps/fcat.Tpo -c -o fcat.o fcat.cpp |
---|
1342 | :info:build /usr/bin/clang++ -DHAVE_CONFIG_H -I. -I../../tsk -I../.. -I./../.. -Wall -I/opt/local/include -D_THREAD_SAFE -pthread -pipe -Os -arch x86_64 -stdlib=libc++ -MT fsstat.o -MD -MP -MF .deps/fsstat.Tpo -c -o fsstat.o fsstat.cpp |
---|
1343 | :info:build mv -f .deps/blkstat.Tpo .deps/blkstat.Po |
---|
1344 | :info:build /usr/bin/clang++ -DHAVE_CONFIG_H -I. -I../../tsk -I../.. -I./../.. -Wall -I/opt/local/include -D_THREAD_SAFE -pthread -pipe -Os -arch x86_64 -stdlib=libc++ -MT icat.o -MD -MP -MF .deps/icat.Tpo -c -o icat.o icat.cpp |
---|
1345 | :info:build mv -f .deps/fsstat.Tpo .deps/fsstat.Po |
---|
1346 | :info:build /usr/bin/clang++ -DHAVE_CONFIG_H -I. -I../../tsk -I../.. -I./../.. -Wall -I/opt/local/include -D_THREAD_SAFE -pthread -pipe -Os -arch x86_64 -stdlib=libc++ -MT ifind.o -MD -MP -MF .deps/ifind.Tpo -c -o ifind.o ifind.cpp |
---|
1347 | :info:build mv -f .deps/blkcalc.Tpo .deps/blkcalc.Po |
---|
1348 | :info:build /usr/bin/clang++ -DHAVE_CONFIG_H -I. -I../../tsk -I../.. -I./../.. -Wall -I/opt/local/include -D_THREAD_SAFE -pthread -pipe -Os -arch x86_64 -stdlib=libc++ -MT ils.o -MD -MP -MF .deps/ils.Tpo -c -o ils.o ils.cpp |
---|
1349 | :info:build mv -f .deps/ffind.Tpo .deps/ffind.Po |
---|
1350 | :info:build /usr/bin/clang++ -DHAVE_CONFIG_H -I. -I../../tsk -I../.. -I./../.. -Wall -I/opt/local/include -D_THREAD_SAFE -pthread -pipe -Os -arch x86_64 -stdlib=libc++ -MT istat.o -MD -MP -MF .deps/istat.Tpo -c -o istat.o istat.cpp |
---|
1351 | :info:build mv -f .deps/blkls.Tpo .deps/blkls.Po |
---|
1352 | :info:build /usr/bin/clang++ -DHAVE_CONFIG_H -I. -I../../tsk -I../.. -I./../.. -Wall -I/opt/local/include -D_THREAD_SAFE -pthread -pipe -Os -arch x86_64 -stdlib=libc++ -MT jcat.o -MD -MP -MF .deps/jcat.Tpo -c -o jcat.o jcat.cpp |
---|
1353 | :info:build mv -f .deps/blkcat.Tpo .deps/blkcat.Po |
---|
1354 | :info:build /usr/bin/clang++ -DHAVE_CONFIG_H -I. -I../../tsk -I../.. -I./../.. -Wall -I/opt/local/include -D_THREAD_SAFE -pthread -pipe -Os -arch x86_64 -stdlib=libc++ -MT jls.o -MD -MP -MF .deps/jls.Tpo -c -o jls.o jls.cpp |
---|
1355 | :info:build mv -f .deps/fcat.Tpo .deps/fcat.Po |
---|
1356 | :info:build /bin/sh ../../libtool --tag=CXX --mode=link /usr/bin/clang++ -pipe -Os -arch x86_64 -stdlib=libc++ -L/opt/local/lib -Wl,-headerpad_max_install_names -arch x86_64 -D_THREAD_SAFE -pthread -static -o blkcalc blkcalc.o ../../tsk/libtsk.la -lewf -ldl -lz -ldl -lstdc++ |
---|
1357 | :info:build mv -f .deps/fls.Tpo .deps/fls.Po |
---|
1358 | :info:build /bin/sh ../../libtool --tag=CXX --mode=link /usr/bin/clang++ -pipe -Os -arch x86_64 -stdlib=libc++ -L/opt/local/lib -Wl,-headerpad_max_install_names -arch x86_64 -D_THREAD_SAFE -pthread -static -o blkcat blkcat.o ../../tsk/libtsk.la -lewf -ldl -lz -ldl -lstdc++ |
---|
1359 | :info:build mv -f .deps/icat.Tpo .deps/icat.Po |
---|
1360 | :info:build /bin/sh ../../libtool --tag=CXX --mode=link /usr/bin/clang++ -pipe -Os -arch x86_64 -stdlib=libc++ -L/opt/local/lib -Wl,-headerpad_max_install_names -arch x86_64 -D_THREAD_SAFE -pthread -static -o blkls blkls.o ../../tsk/libtsk.la -lewf -ldl -lz -ldl -lstdc++ |
---|
1361 | :info:build mv -f .deps/istat.Tpo .deps/istat.Po |
---|
1362 | :info:build /bin/sh ../../libtool --tag=CXX --mode=link /usr/bin/clang++ -pipe -Os -arch x86_64 -stdlib=libc++ -L/opt/local/lib -Wl,-headerpad_max_install_names -arch x86_64 -D_THREAD_SAFE -pthread -static -o blkstat blkstat.o ../../tsk/libtsk.la -lewf -ldl -lz -ldl -lstdc++ |
---|
1363 | :info:build mv -f .deps/ils.Tpo .deps/ils.Po |
---|
1364 | :info:build mv -f .deps/ifind.Tpo .deps/ifind.Po |
---|
1365 | :info:build /bin/sh ../../libtool --tag=CXX --mode=link /usr/bin/clang++ -pipe -Os -arch x86_64 -stdlib=libc++ -L/opt/local/lib -Wl,-headerpad_max_install_names -arch x86_64 -D_THREAD_SAFE -pthread -static -o ffind ffind.o ../../tsk/libtsk.la -lewf -ldl -lz -ldl -lstdc++ |
---|
1366 | :info:build /bin/sh ../../libtool --tag=CXX --mode=link /usr/bin/clang++ -pipe -Os -arch x86_64 -stdlib=libc++ -L/opt/local/lib -Wl,-headerpad_max_install_names -arch x86_64 -D_THREAD_SAFE -pthread -static -o fls fls.o ../../tsk/libtsk.la -lewf -ldl -lz -ldl -lstdc++ |
---|
1367 | :info:build libtool: link: /usr/bin/clang++ -pipe -Os -arch x86_64 -stdlib=libc++ -Wl,-headerpad_max_install_names -arch x86_64 -D_THREAD_SAFE -pthread -o blkcalc blkcalc.o -L/opt/local/lib ../../tsk/.libs/libtsk.a -lewf -lz -ldl -lstdc++ -pthread |
---|
1368 | :info:build libtool: link: /usr/bin/clang++ -pipe -Os -arch x86_64 -stdlib=libc++ -Wl,-headerpad_max_install_names -arch x86_64 -D_THREAD_SAFE -pthread -o blkcat blkcat.o -L/opt/local/lib ../../tsk/.libs/libtsk.a -lewf -lz -ldl -lstdc++ -pthread |
---|
1369 | :info:build clang: warning: argument unused during compilation: '-pthread' |
---|
1370 | :info:build clang: warning: argument unused during compilation: '-pthread' |
---|
1371 | :info:build mv -f .deps/jcat.Tpo .deps/jcat.Po |
---|
1372 | :info:build mv -f .deps/jls.Tpo .deps/jls.Po |
---|
1373 | :info:build clang: warning: argument unused during compilation: '-pthread' |
---|
1374 | :info:build clang: warning: argument unused during compilation: '-pthread' |
---|
1375 | :info:build /bin/sh ../../libtool --tag=CXX --mode=link /usr/bin/clang++ -pipe -Os -arch x86_64 -stdlib=libc++ -L/opt/local/lib -Wl,-headerpad_max_install_names -arch x86_64 -D_THREAD_SAFE -pthread -static -o fcat fcat.o ../../tsk/libtsk.la -lewf -ldl -lz -ldl -lstdc++ |
---|
1376 | :info:build /bin/sh ../../libtool --tag=CXX --mode=link /usr/bin/clang++ -pipe -Os -arch x86_64 -stdlib=libc++ -L/opt/local/lib -Wl,-headerpad_max_install_names -arch x86_64 -D_THREAD_SAFE -pthread -static -o fsstat fsstat.o ../../tsk/libtsk.la -lewf -ldl -lz -ldl -lstdc++ |
---|
1377 | :info:build /bin/sh ../../libtool --tag=CXX --mode=link /usr/bin/clang++ -pipe -Os -arch x86_64 -stdlib=libc++ -L/opt/local/lib -Wl,-headerpad_max_install_names -arch x86_64 -D_THREAD_SAFE -pthread -static -o icat icat.o ../../tsk/libtsk.la -lewf -ldl -lz -ldl -lstdc++ |
---|
1378 | :info:build /bin/sh ../../libtool --tag=CXX --mode=link /usr/bin/clang++ -pipe -Os -arch x86_64 -stdlib=libc++ -L/opt/local/lib -Wl,-headerpad_max_install_names -arch x86_64 -D_THREAD_SAFE -pthread -static -o ifind ifind.o ../../tsk/libtsk.la -lewf -ldl -lz -ldl -lstdc++ |
---|
1379 | :info:build libtool: link: /usr/bin/clang++ -pipe -Os -arch x86_64 -stdlib=libc++ -Wl,-headerpad_max_install_names -arch x86_64 -D_THREAD_SAFE -pthread -o blkls blkls.o -L/opt/local/lib ../../tsk/.libs/libtsk.a -lewf -lz -ldl -lstdc++ -pthread |
---|
1380 | :info:build libtool: link: /usr/bin/clang++ -pipe -Os -arch x86_64 -stdlib=libc++ -Wl,-headerpad_max_install_names -arch x86_64 -D_THREAD_SAFE -pthread -o blkstat blkstat.o -L/opt/local/lib ../../tsk/.libs/libtsk.a -lewf -lz -ldl -lstdc++ -pthread |
---|
1381 | :info:build clang: warning: argument unused during compilation: '-pthread' |
---|
1382 | :info:build clang: warning: argument unused during compilation: '-pthread' |
---|
1383 | :info:build clang: warning: argument unused during compilation: '-pthread' |
---|
1384 | :info:build clang: warning: argument unused during compilation: '-pthread' |
---|
1385 | :info:build libtool: link: /usr/bin/clang++ -pipe -Os -arch x86_64 -stdlib=libc++ -Wl,-headerpad_max_install_names -arch x86_64 -D_THREAD_SAFE -pthread -o fls fls.o -L/opt/local/lib ../../tsk/.libs/libtsk.a -lewf -lz -ldl -lstdc++ -pthread |
---|
1386 | :info:build libtool: link: /usr/bin/clang++ -pipe -Os -arch x86_64 -stdlib=libc++ -Wl,-headerpad_max_install_names -arch x86_64 -D_THREAD_SAFE -pthread -o ffind ffind.o -L/opt/local/lib ../../tsk/.libs/libtsk.a -lewf -lz -ldl -lstdc++ -pthread |
---|
1387 | :info:build clang: warning: argument unused during compilation: '-pthread' |
---|
1388 | :info:build clang: warning: argument unused during compilation: '-pthread' |
---|
1389 | :info:build clang: warning: argument unused during compilation: '-pthread' |
---|
1390 | :info:build clang: warning: argument unused during compilation: '-pthread' |
---|
1391 | :info:build libtool: link: /usr/bin/clang++ -pipe -Os -arch x86_64 -stdlib=libc++ -Wl,-headerpad_max_install_names -arch x86_64 -D_THREAD_SAFE -pthread -o fcat fcat.o -L/opt/local/lib ../../tsk/.libs/libtsk.a -lewf -lz -ldl -lstdc++ -pthread |
---|
1392 | :info:build /bin/sh ../../libtool --tag=CXX --mode=link /usr/bin/clang++ -pipe -Os -arch x86_64 -stdlib=libc++ -L/opt/local/lib -Wl,-headerpad_max_install_names -arch x86_64 -D_THREAD_SAFE -pthread -static -o ils ils.o ../../tsk/libtsk.la -lewf -ldl -lz -ldl -lstdc++ |
---|
1393 | :info:build /bin/sh ../../libtool --tag=CXX --mode=link /usr/bin/clang++ -pipe -Os -arch x86_64 -stdlib=libc++ -L/opt/local/lib -Wl,-headerpad_max_install_names -arch x86_64 -D_THREAD_SAFE -pthread -static -o istat istat.o ../../tsk/libtsk.la -lewf -ldl -lz -ldl -lstdc++ |
---|
1394 | :info:build clang: warning: argument unused during compilation: '-pthread' |
---|
1395 | :info:build clang: warning: argument unused during compilation: '-pthread' |
---|
1396 | :info:build libtool: link: /usr/bin/clang++ -pipe -Os -arch x86_64 -stdlib=libc++ -Wl,-headerpad_max_install_names -arch x86_64 -D_THREAD_SAFE -pthread -o fsstat fsstat.o -L/opt/local/lib ../../tsk/.libs/libtsk.a -lewf -lz -ldl -lstdc++ -pthread |
---|
1397 | :info:build /bin/sh ../../libtool --tag=CXX --mode=link /usr/bin/clang++ -pipe -Os -arch x86_64 -stdlib=libc++ -L/opt/local/lib -Wl,-headerpad_max_install_names -arch x86_64 -D_THREAD_SAFE -pthread -static -o jcat jcat.o ../../tsk/libtsk.la -lewf -ldl -lz -ldl -lstdc++ |
---|
1398 | :info:build clang: warning: argument unused during compilation: '-pthread' |
---|
1399 | :info:build clang: warning: argument unused during compilation: '-pthread' |
---|
1400 | :info:build libtool: link: /usr/bin/clang++ -pipe -Os -arch x86_64 -stdlib=libc++ -Wl,-headerpad_max_install_names -arch x86_64 -D_THREAD_SAFE -pthread -o ifind ifind.o -L/opt/local/lib ../../tsk/.libs/libtsk.a -lewf -lz -ldl -lstdc++ -pthread |
---|
1401 | :info:build /bin/sh ../../libtool --tag=CXX --mode=link /usr/bin/clang++ -pipe -Os -arch x86_64 -stdlib=libc++ -L/opt/local/lib -Wl,-headerpad_max_install_names -arch x86_64 -D_THREAD_SAFE -pthread -static -o jls jls.o ../../tsk/libtsk.la -lewf -ldl -lz -ldl -lstdc++ |
---|
1402 | :info:build libtool: link: /usr/bin/clang++ -pipe -Os -arch x86_64 -stdlib=libc++ -Wl,-headerpad_max_install_names -arch x86_64 -D_THREAD_SAFE -pthread -o icat icat.o -L/opt/local/lib ../../tsk/.libs/libtsk.a -lewf -lz -ldl -lstdc++ -pthread |
---|
1403 | :info:build clang: warning: argument unused during compilation: '-pthread' |
---|
1404 | :info:build clang: warning: argument unused during compilation: '-pthread' |
---|
1405 | :info:build clang: warning: argument unused during compilation: '-pthread' |
---|
1406 | :info:build clang: warning: argument unused during compilation: '-pthread' |
---|
1407 | :info:build libtool: link: /usr/bin/clang++ -pipe -Os -arch x86_64 -stdlib=libc++ -Wl,-headerpad_max_install_names -arch x86_64 -D_THREAD_SAFE -pthread -o istat istat.o -L/opt/local/lib ../../tsk/.libs/libtsk.a -lewf -lz -ldl -lstdc++ -pthread |
---|
1408 | :info:build libtool: link: /usr/bin/clang++ -pipe -Os -arch x86_64 -stdlib=libc++ -Wl,-headerpad_max_install_names -arch x86_64 -D_THREAD_SAFE -pthread -o ils ils.o -L/opt/local/lib ../../tsk/.libs/libtsk.a -lewf -lz -ldl -lstdc++ -pthread |
---|
1409 | :info:build libtool: link: /usr/bin/clang++ -pipe -Os -arch x86_64 -stdlib=libc++ -Wl,-headerpad_max_install_names -arch x86_64 -D_THREAD_SAFE -pthread -o jls jls.o -L/opt/local/lib ../../tsk/.libs/libtsk.a -lewf -lz -ldl -lstdc++ -pthread |
---|
1410 | :info:build libtool: link: /usr/bin/clang++ -pipe -Os -arch x86_64 -stdlib=libc++ -Wl,-headerpad_max_install_names -arch x86_64 -D_THREAD_SAFE -pthread -o jcat jcat.o -L/opt/local/lib ../../tsk/.libs/libtsk.a -lewf -lz -ldl -lstdc++ -pthread |
---|
1411 | :info:build clang: warning: argument unused during compilation: '-pthread' |
---|
1412 | :info:build clang: warning: argument unused during compilation: '-pthread' |
---|
1413 | :info:build clang: warning: argument unused during compilation: '-pthread' |
---|
1414 | :info:build clang: warning: argument unused during compilation: '-pthread' |
---|
1415 | :info:build clang: warning: argument unused during compilation: '-pthread' |
---|
1416 | :info:build clang: warning: argument unused during compilation: '-pthread' |
---|
1417 | :info:build clang: warning: argument unused during compilation: '-pthread' |
---|
1418 | :info:build clang: warning: argument unused during compilation: '-pthread' |
---|
1419 | :info:build make[2]: Leaving directory `/opt/local/var/macports/build/_opt_local_var_macports_sources_rsync.macports.org_release_tarballs_ports_sysutils_sleuthkit/sleuthkit/work/sleuthkit-4.1.3/tools/fstools' |
---|
1420 | :info:build Making all in hashtools |
---|
1421 | :info:build make[2]: Entering directory `/opt/local/var/macports/build/_opt_local_var_macports_sources_rsync.macports.org_release_tarballs_ports_sysutils_sleuthkit/sleuthkit/work/sleuthkit-4.1.3/tools/hashtools' |
---|
1422 | :info:build /usr/bin/clang++ -DHAVE_CONFIG_H -I. -I../../tsk -I../.. -I./../.. -Wall -I/opt/local/include -D_THREAD_SAFE -pthread -pipe -Os -arch x86_64 -stdlib=libc++ -MT hfind.o -MD -MP -MF .deps/hfind.Tpo -c -o hfind.o hfind.cpp |
---|
1423 | :info:build mv -f .deps/hfind.Tpo .deps/hfind.Po |
---|
1424 | :info:build /bin/sh ../../libtool --tag=CXX --mode=link /usr/bin/clang++ -pipe -Os -arch x86_64 -stdlib=libc++ -L/opt/local/lib -Wl,-headerpad_max_install_names -arch x86_64 -D_THREAD_SAFE -pthread -static -o hfind hfind.o ../../tsk/libtsk.la -lewf -ldl -lz -ldl -lstdc++ |
---|
1425 | :info:build libtool: link: /usr/bin/clang++ -pipe -Os -arch x86_64 -stdlib=libc++ -Wl,-headerpad_max_install_names -arch x86_64 -D_THREAD_SAFE -pthread -o hfind hfind.o -L/opt/local/lib ../../tsk/.libs/libtsk.a -lewf -lz -ldl -lstdc++ -pthread |
---|
1426 | :info:build clang: warning: argument unused during compilation: '-pthread' |
---|
1427 | :info:build clang: warning: argument unused during compilation: '-pthread' |
---|
1428 | :info:build make[2]: Leaving directory `/opt/local/var/macports/build/_opt_local_var_macports_sources_rsync.macports.org_release_tarballs_ports_sysutils_sleuthkit/sleuthkit/work/sleuthkit-4.1.3/tools/hashtools' |
---|
1429 | :info:build Making all in srchtools |
---|
1430 | :info:build make[2]: Entering directory `/opt/local/var/macports/build/_opt_local_var_macports_sources_rsync.macports.org_release_tarballs_ports_sysutils_sleuthkit/sleuthkit/work/sleuthkit-4.1.3/tools/srchtools' |
---|
1431 | :info:build /usr/bin/clang -DHAVE_CONFIG_H -I. -I../../tsk -I../.. -I./../.. -Wall -I/opt/local/include -D_THREAD_SAFE -pthread -pipe -Os -arch x86_64 -MT srch_strings.o -MD -MP -MF .deps/srch_strings.Tpo -c -o srch_strings.o srch_strings.c |
---|
1432 | :info:build /usr/bin/clang++ -DHAVE_CONFIG_H -I. -I../../tsk -I../.. -I./../.. -Wall -I/opt/local/include -D_THREAD_SAFE -pthread -pipe -Os -arch x86_64 -stdlib=libc++ -MT sigfind.o -MD -MP -MF .deps/sigfind.Tpo -c -o sigfind.o sigfind.cpp |
---|
1433 | :info:build mv -f .deps/srch_strings.Tpo .deps/srch_strings.Po |
---|
1434 | :info:build /bin/sh ../../libtool --tag=CC --mode=link /usr/bin/clang -pipe -Os -arch x86_64 -L/opt/local/lib -Wl,-headerpad_max_install_names -arch x86_64 -D_THREAD_SAFE -pthread -o srch_strings srch_strings.o -lewf -ldl -lz -ldl -lstdc++ |
---|
1435 | :info:build libtool: link: /usr/bin/clang -pipe -Os -arch x86_64 -Wl,-headerpad_max_install_names -arch x86_64 -D_THREAD_SAFE -pthread -o srch_strings srch_strings.o -L/opt/local/lib -lewf -lz -ldl -lstdc++ -pthread |
---|
1436 | :info:build clang: warning: argument unused during compilation: '-pthread' |
---|
1437 | :info:build clang: warning: argument unused during compilation: '-pthread' |
---|
1438 | :info:build mv -f .deps/sigfind.Tpo .deps/sigfind.Po |
---|
1439 | :info:build /bin/sh ../../libtool --tag=CXX --mode=link /usr/bin/clang++ -pipe -Os -arch x86_64 -stdlib=libc++ -static -L/opt/local/lib -Wl,-headerpad_max_install_names -arch x86_64 -D_THREAD_SAFE -pthread -o sigfind sigfind.o ../../tsk/libtsk.la -lewf -ldl -lz -ldl -lstdc++ |
---|
1440 | :info:build libtool: link: /usr/bin/clang++ -pipe -Os -arch x86_64 -stdlib=libc++ -Wl,-headerpad_max_install_names -arch x86_64 -D_THREAD_SAFE -pthread -o sigfind sigfind.o -L/opt/local/lib ../../tsk/.libs/libtsk.a -lewf -lz -ldl -lstdc++ -pthread |
---|
1441 | :info:build clang: warning: argument unused during compilation: '-pthread' |
---|
1442 | :info:build clang: warning: argument unused during compilation: '-pthread' |
---|
1443 | :info:build make[2]: Leaving directory `/opt/local/var/macports/build/_opt_local_var_macports_sources_rsync.macports.org_release_tarballs_ports_sysutils_sleuthkit/sleuthkit/work/sleuthkit-4.1.3/tools/srchtools' |
---|
1444 | :info:build Making all in sorter |
---|
1445 | :info:build make[2]: Entering directory `/opt/local/var/macports/build/_opt_local_var_macports_sources_rsync.macports.org_release_tarballs_ports_sysutils_sleuthkit/sleuthkit/work/sleuthkit-4.1.3/tools/sorter' |
---|
1446 | :info:build make[2]: Leaving directory `/opt/local/var/macports/build/_opt_local_var_macports_sources_rsync.macports.org_release_tarballs_ports_sysutils_sleuthkit/sleuthkit/work/sleuthkit-4.1.3/tools/sorter' |
---|
1447 | :info:build Making all in timeline |
---|
1448 | :info:build make[2]: Entering directory `/opt/local/var/macports/build/_opt_local_var_macports_sources_rsync.macports.org_release_tarballs_ports_sysutils_sleuthkit/sleuthkit/work/sleuthkit-4.1.3/tools/timeline' |
---|
1449 | :info:build make[2]: Leaving directory `/opt/local/var/macports/build/_opt_local_var_macports_sources_rsync.macports.org_release_tarballs_ports_sysutils_sleuthkit/sleuthkit/work/sleuthkit-4.1.3/tools/timeline' |
---|
1450 | :info:build Making all in autotools |
---|
1451 | :info:build make[2]: Entering directory `/opt/local/var/macports/build/_opt_local_var_macports_sources_rsync.macports.org_release_tarballs_ports_sysutils_sleuthkit/sleuthkit/work/sleuthkit-4.1.3/tools/autotools' |
---|
1452 | :info:build /usr/bin/clang++ -DHAVE_CONFIG_H -I. -I../../tsk -I../.. -I./../.. -Wall -I/opt/local/include -D_THREAD_SAFE -pthread -pipe -Os -arch x86_64 -stdlib=libc++ -MT tsk_recover.o -MD -MP -MF .deps/tsk_recover.Tpo -c -o tsk_recover.o tsk_recover.cpp |
---|
1453 | :info:build /usr/bin/clang++ -DHAVE_CONFIG_H -I. -I../../tsk -I../.. -I./../.. -Wall -I/opt/local/include -D_THREAD_SAFE -pthread -pipe -Os -arch x86_64 -stdlib=libc++ -MT tsk_loaddb.o -MD -MP -MF .deps/tsk_loaddb.Tpo -c -o tsk_loaddb.o tsk_loaddb.cpp |
---|
1454 | :info:build /usr/bin/clang++ -DHAVE_CONFIG_H -I. -I../../tsk -I../.. -I./../.. -Wall -I/opt/local/include -D_THREAD_SAFE -pthread -pipe -Os -arch x86_64 -stdlib=libc++ -MT tsk_comparedir.o -MD -MP -MF .deps/tsk_comparedir.Tpo -c -o tsk_comparedir.o tsk_comparedir.cpp |
---|
1455 | :info:build /usr/bin/clang++ -DHAVE_CONFIG_H -I. -I../../tsk -I../.. -I./../.. -Wall -I/opt/local/include -D_THREAD_SAFE -pthread -pipe -Os -arch x86_64 -stdlib=libc++ -MT tsk_gettimes.o -MD -MP -MF .deps/tsk_gettimes.Tpo -c -o tsk_gettimes.o tsk_gettimes.cpp |
---|
1456 | :info:build mv -f .deps/tsk_gettimes.Tpo .deps/tsk_gettimes.Po |
---|
1457 | :info:build /bin/sh ../../libtool --tag=CXX --mode=link /usr/bin/clang++ -pipe -Os -arch x86_64 -stdlib=libc++ -L/opt/local/lib -Wl,-headerpad_max_install_names -arch x86_64 -D_THREAD_SAFE -pthread -static -o tsk_gettimes tsk_gettimes.o ../../tsk/libtsk.la -lewf -ldl -lz -ldl -lstdc++ |
---|
1458 | :info:build mv -f .deps/tsk_recover.Tpo .deps/tsk_recover.Po |
---|
1459 | :info:build /bin/sh ../../libtool --tag=CXX --mode=link /usr/bin/clang++ -pipe -Os -arch x86_64 -stdlib=libc++ -L/opt/local/lib -Wl,-headerpad_max_install_names -arch x86_64 -D_THREAD_SAFE -pthread -static -o tsk_recover tsk_recover.o ../../tsk/libtsk.la -lewf -ldl -lz -ldl -lstdc++ |
---|
1460 | :info:build mv -f .deps/tsk_comparedir.Tpo .deps/tsk_comparedir.Po |
---|
1461 | :info:build /bin/sh ../../libtool --tag=CXX --mode=link /usr/bin/clang++ -pipe -Os -arch x86_64 -stdlib=libc++ -L/opt/local/lib -Wl,-headerpad_max_install_names -arch x86_64 -D_THREAD_SAFE -pthread -static -o tsk_comparedir tsk_comparedir.o ../../tsk/libtsk.la -lewf -ldl -lz -ldl -lstdc++ |
---|
1462 | :info:build mv -f .deps/tsk_loaddb.Tpo .deps/tsk_loaddb.Po |
---|
1463 | :info:build /bin/sh ../../libtool --tag=CXX --mode=link /usr/bin/clang++ -pipe -Os -arch x86_64 -stdlib=libc++ -L/opt/local/lib -Wl,-headerpad_max_install_names -arch x86_64 -D_THREAD_SAFE -pthread -static -o tsk_loaddb tsk_loaddb.o ../../tsk/libtsk.la -lewf -ldl -lz -ldl -lstdc++ |
---|
1464 | :info:build libtool: link: /usr/bin/clang++ -pipe -Os -arch x86_64 -stdlib=libc++ -Wl,-headerpad_max_install_names -arch x86_64 -D_THREAD_SAFE -pthread -o tsk_gettimes tsk_gettimes.o -L/opt/local/lib ../../tsk/.libs/libtsk.a -lewf -lz -ldl -lstdc++ -pthread |
---|
1465 | :info:build libtool: link: /usr/bin/clang++ -pipe -Os -arch x86_64 -stdlib=libc++ -Wl,-headerpad_max_install_names -arch x86_64 -D_THREAD_SAFE -pthread -o tsk_recover tsk_recover.o -L/opt/local/lib ../../tsk/.libs/libtsk.a -lewf -lz -ldl -lstdc++ -pthread |
---|
1466 | :info:build clang: warning: argument unused during compilation: '-pthread' |
---|
1467 | :info:build clang: warning: argument unused during compilation: '-pthread' |
---|
1468 | :info:build clang: warning: argument unused during compilation: '-pthread' |
---|
1469 | :info:build clang: warning: argument unused during compilation: '-pthread' |
---|
1470 | :info:build libtool: link: /usr/bin/clang++ -pipe -Os -arch x86_64 -stdlib=libc++ -Wl,-headerpad_max_install_names -arch x86_64 -D_THREAD_SAFE -pthread -o tsk_comparedir tsk_comparedir.o -L/opt/local/lib ../../tsk/.libs/libtsk.a -lewf -lz -ldl -lstdc++ -pthread |
---|
1471 | :info:build clang: warning: argument unused during compilation: '-pthread' |
---|
1472 | :info:build clang: warning: argument unused during compilation: '-pthread' |
---|
1473 | :info:build libtool: link: /usr/bin/clang++ -pipe -Os -arch x86_64 -stdlib=libc++ -Wl,-headerpad_max_install_names -arch x86_64 -D_THREAD_SAFE -pthread -o tsk_loaddb tsk_loaddb.o -L/opt/local/lib ../../tsk/.libs/libtsk.a -lewf -lz -ldl -lstdc++ -pthread |
---|
1474 | :info:build clang: warning: argument unused during compilation: '-pthread' |
---|
1475 | :info:build clang: warning: argument unused during compilation: '-pthread' |
---|
1476 | :info:build make[2]: Leaving directory `/opt/local/var/macports/build/_opt_local_var_macports_sources_rsync.macports.org_release_tarballs_ports_sysutils_sleuthkit/sleuthkit/work/sleuthkit-4.1.3/tools/autotools' |
---|
1477 | :info:build Making all in fiwalk |
---|
1478 | :info:build make[2]: Entering directory `/opt/local/var/macports/build/_opt_local_var_macports_sources_rsync.macports.org_release_tarballs_ports_sysutils_sleuthkit/sleuthkit/work/sleuthkit-4.1.3/tools/fiwalk' |
---|
1479 | :info:build Making all in src |
---|
1480 | :info:build make[3]: Entering directory `/opt/local/var/macports/build/_opt_local_var_macports_sources_rsync.macports.org_release_tarballs_ports_sysutils_sleuthkit/sleuthkit/work/sleuthkit-4.1.3/tools/fiwalk/src' |
---|
1481 | :info:build /usr/bin/clang++ -DHAVE_CONFIG_H -I. -I../../../tsk -I../../.. -Wall -I/opt/local/include -D_THREAD_SAFE -pthread -pipe -Os -arch x86_64 -stdlib=libc++ -MT fiwalk.o -MD -MP -MF .deps/fiwalk.Tpo -c -o fiwalk.o fiwalk.cpp |
---|
1482 | :info:build /usr/bin/clang++ -DHAVE_CONFIG_H -I. -I../../../tsk -I../../.. -Wall -I/opt/local/include -D_THREAD_SAFE -pthread -pipe -Os -arch x86_64 -stdlib=libc++ -MT fiwalk_tsk.o -MD -MP -MF .deps/fiwalk_tsk.Tpo -c -o fiwalk_tsk.o fiwalk_tsk.cpp |
---|
1483 | :info:build /usr/bin/clang++ -DHAVE_CONFIG_H -I. -I../../../tsk -I../../.. -Wall -I/opt/local/include -D_THREAD_SAFE -pthread -pipe -Os -arch x86_64 -stdlib=libc++ -MT content.o -MD -MP -MF .deps/content.Tpo -c -o content.o content.cpp |
---|
1484 | :info:build /usr/bin/clang++ -DHAVE_CONFIG_H -I. -I../../../tsk -I../../.. -Wall -I/opt/local/include -D_THREAD_SAFE -pthread -pipe -Os -arch x86_64 -stdlib=libc++ -MT arff.o -MD -MP -MF .deps/arff.Tpo -c -o arff.o arff.cpp |
---|
1485 | :info:build /usr/bin/clang++ -DHAVE_CONFIG_H -I. -I../../../tsk -I../../.. -Wall -I/opt/local/include -D_THREAD_SAFE -pthread -pipe -Os -arch x86_64 -stdlib=libc++ -MT plugin.o -MD -MP -MF .deps/plugin.Tpo -c -o plugin.o plugin.cpp |
---|
1486 | :info:build /usr/bin/clang -DHAVE_CONFIG_H -I. -I../../../tsk -I../../.. -Wall -I/opt/local/include -D_THREAD_SAFE -pthread -Wall -pipe -Os -arch x86_64 -MT utils.o -MD -MP -MF .deps/utils.Tpo -c -o utils.o utils.c |
---|
1487 | :info:build /usr/bin/clang++ -DHAVE_CONFIG_H -I. -I../../../tsk -I../../.. -Wall -I/opt/local/include -D_THREAD_SAFE -pthread -pipe -Os -arch x86_64 -stdlib=libc++ -MT dfxml.o -MD -MP -MF .deps/dfxml.Tpo -c -o dfxml.o dfxml.cpp |
---|
1488 | :info:build /usr/bin/clang -DHAVE_CONFIG_H -I. -I../../../tsk -I../../.. -Wall -I/opt/local/include -D_THREAD_SAFE -pthread -Wall -pipe -Os -arch x86_64 -MT hexbuf.o -MD -MP -MF .deps/hexbuf.Tpo -c -o hexbuf.o hexbuf.c |
---|
1489 | :info:build mv -f .deps/hexbuf.Tpo .deps/hexbuf.Po |
---|
1490 | :info:build /usr/bin/clang++ -DHAVE_CONFIG_H -I. -I../../../tsk -I../../.. -Wall -I/opt/local/include -D_THREAD_SAFE -pthread -pipe -Os -arch x86_64 -stdlib=libc++ -MT unicode_escape.o -MD -MP -MF .deps/unicode_escape.Tpo -c -o unicode_escape.o unicode_escape.cpp |
---|
1491 | :info:build mv -f .deps/utils.Tpo .deps/utils.Po |
---|
1492 | :info:build /usr/bin/clang++ -DHAVE_CONFIG_H -I. -I../../../tsk -I../../.. -Wall -I/opt/local/include -D_THREAD_SAFE -pthread -pipe -Os -arch x86_64 -stdlib=libc++ -MT base64.o -MD -MP -MF .deps/base64.Tpo -c -o base64.o base64.cpp |
---|
1493 | :info:build mv -f .deps/base64.Tpo .deps/base64.Po |
---|
1494 | :info:build /usr/bin/clang -DHAVE_CONFIG_H -I. -I../../../tsk -I../../.. -Wall -I/opt/local/include -D_THREAD_SAFE -pthread -Wall -pipe -Os -arch x86_64 -MT sha2.o -MD -MP -MF .deps/sha2.Tpo -c -o sha2.o sha2.c |
---|
1495 | :info:build mv -f .deps/sha2.Tpo .deps/sha2.Po |
---|
1496 | :info:build fiwalk.cpp:235:22: warning: comparison of unsigned expression < 0 is always false [-Wtautological-compare] |
---|
1497 | :info:build if(name.find(" ")<0) err(1,"partition_info(%s) has a space in it",cstr(name)); |
---|
1498 | :info:build ~~~~~~~~~~~~~~^~ |
---|
1499 | :info:build content.cpp:318:5: warning: struct 'seg' was previously declared as a class [-Wmismatched-tags]fiwalk.cpp:502:28: warning: incrementing expression of type bool is deprecated [-Wdeprecated-increment-bool] |
---|
1500 | :info:build case _TSK_T('1'): opt_sha1++;break; |
---|
1501 | :info:build ~~~~~~~~^ |
---|
1502 | :info:build |
---|
1503 | :info:build struct seg newseg; |
---|
1504 | :info:build fiwalk.cpp:529:27: warning: incrementing expression of type bool is deprecated [-Wdeprecated-increment-bool] |
---|
1505 | :info:build case _TSK_T('M'): opt_md5++; break; |
---|
1506 | :info:build ~~~~~~~^ |
---|
1507 | :info:build ^ |
---|
1508 | :info:build ./content.h:18:7: note: previous use is here |
---|
1509 | :info:build class seg { |
---|
1510 | :info:build ^ |
---|
1511 | :info:build content.cpp:318:5: note: did you mean class here? |
---|
1512 | :info:build struct seg newseg; |
---|
1513 | :info:build ^~~~~~ |
---|
1514 | :info:build class |
---|
1515 | :info:build mv -f .deps/unicode_escape.Tpo .deps/unicode_escape.Po |
---|
1516 | :info:build In file included from fiwalk_tsk.cpp:23: |
---|
1517 | :info:build In file included from ./arff.h:35: |
---|
1518 | :info:build ./outfile.h:31:11: warning: private field 'tempfile' is not used [-Wunused-private-field] |
---|
1519 | :info:build FILE *tempfile; // temporary file |
---|
1520 | :info:build ^ |
---|
1521 | :info:build In file included from plugin.cpp:51: |
---|
1522 | :info:build In file included from ./arff.h:35: |
---|
1523 | :info:build ./outfile.h:31:11: warning: private field 'tempfile' is not used [-Wunused-private-field] |
---|
1524 | :info:build FILE *tempfile; // temporary file |
---|
1525 | :info:build ^ |
---|
1526 | :info:build In file included from fiwalk.cpp:42: |
---|
1527 | :info:build In file included from ./arff.h:35: |
---|
1528 | :info:build ./outfile.h:31:11: warning: private field 'tempfile' is not used [-Wunused-private-field] |
---|
1529 | :info:build FILE *tempfile; // temporary file |
---|
1530 | :info:build ^ |
---|
1531 | :info:build In file included from arff.cpp:39: |
---|
1532 | :info:build In file included from ./arff.h:35: |
---|
1533 | :info:build ./outfile.h:31:11: warning: private field 'tempfile' is not used [-Wunused-private-field] |
---|
1534 | :info:build FILE *tempfile; // temporary file |
---|
1535 | :info:build ^ |
---|
1536 | :info:build 1 warning generated. |
---|
1537 | :info:build mv -f .deps/plugin.Tpo .deps/plugin.Po |
---|
1538 | :info:build 1 warning generated. |
---|
1539 | :info:build mv -f .deps/content.Tpo .deps/content.Po |
---|
1540 | :info:build 1 warning generated. |
---|
1541 | :info:build mv -f .deps/fiwalk_tsk.Tpo .deps/fiwalk_tsk.Po |
---|
1542 | :info:build 4 warnings generated. |
---|
1543 | :info:build mv -f .deps/fiwalk.Tpo .deps/fiwalk.Po |
---|
1544 | :info:build 1 warning generated. |
---|
1545 | :info:build mv -f .deps/arff.Tpo .deps/arff.Po |
---|
1546 | :info:build mv -f .deps/dfxml.Tpo .deps/dfxml.Po |
---|
1547 | :info:build /bin/sh ../../../libtool --tag=CXX --mode=link /usr/bin/clang++ -pipe -Os -arch x86_64 -stdlib=libc++ -L/opt/local/lib -Wl,-headerpad_max_install_names -arch x86_64 -D_THREAD_SAFE -pthread -o fiwalk fiwalk.o fiwalk_tsk.o content.o arff.o plugin.o utils.o dfxml.o hexbuf.o unicode_escape.o base64.o sha2.o ../../../tsk/libtsk.la -lewf -ldl -lz -ldl -lstdc++ |
---|
1548 | :info:build libtool: link: /usr/bin/clang++ -pipe -Os -arch x86_64 -stdlib=libc++ -Wl,-headerpad_max_install_names -arch x86_64 -D_THREAD_SAFE -pthread -o .libs/fiwalk fiwalk.o fiwalk_tsk.o content.o arff.o plugin.o utils.o dfxml.o hexbuf.o unicode_escape.o base64.o sha2.o -L/opt/local/lib ../../../tsk/.libs/libtsk.10.2.0.dylib -lewf -lz -ldl -lstdc++ -pthread |
---|
1549 | :info:build clang: warning: argument unused during compilation: '-pthread' |
---|
1550 | :info:build clang: warning: argument unused during compilation: '-pthread' |
---|
1551 | :info:build make[3]: Leaving directory `/opt/local/var/macports/build/_opt_local_var_macports_sources_rsync.macports.org_release_tarballs_ports_sysutils_sleuthkit/sleuthkit/work/sleuthkit-4.1.3/tools/fiwalk/src' |
---|
1552 | :info:build Making all in plugins |
---|
1553 | :info:build make[3]: Entering directory `/opt/local/var/macports/build/_opt_local_var_macports_sources_rsync.macports.org_release_tarballs_ports_sysutils_sleuthkit/sleuthkit/work/sleuthkit-4.1.3/tools/fiwalk/plugins' |
---|
1554 | :info:build /usr/bin/clang++ -DHAVE_CONFIG_H -I. -I../../../tsk -I/opt/local/include -D_THREAD_SAFE -pthread -pipe -Os -arch x86_64 -stdlib=libc++ -MT jpeg_extract.o -MD -MP -MF .deps/jpeg_extract.Tpo -c -o jpeg_extract.o jpeg_extract.cpp |
---|
1555 | :info:build jpeg_extract.cpp:40:27: warning: expression result unused [-Wunused-value] |
---|
1556 | :info:build for(char *cc=linebuf;*cc;*cc++){ // change ' '->'_" and '\t'->':' until we find the \t |
---|
1557 | :info:build ^~~~~ |
---|
1558 | :info:build 1 warning generated. |
---|
1559 | :info:build mv -f .deps/jpeg_extract.Tpo .deps/jpeg_extract.Po |
---|
1560 | :info:build /bin/sh ../../../libtool --tag=CXX --mode=link /usr/bin/clang++ -pipe -Os -arch x86_64 -stdlib=libc++ -L/opt/local/lib -Wl,-headerpad_max_install_names -arch x86_64 -D_THREAD_SAFE -pthread -o jpeg_extract jpeg_extract.o -lewf -ldl -lz -ldl -lstdc++ |
---|
1561 | :info:build libtool: link: /usr/bin/clang++ -pipe -Os -arch x86_64 -stdlib=libc++ -Wl,-headerpad_max_install_names -arch x86_64 -D_THREAD_SAFE -pthread -o jpeg_extract jpeg_extract.o -L/opt/local/lib -lewf -lz -ldl -lstdc++ -pthread |
---|
1562 | :info:build clang: warning: argument unused during compilation: '-pthread' |
---|
1563 | :info:build clang: warning: argument unused during compilation: '-pthread' |
---|
1564 | :info:build make[3]: Leaving directory `/opt/local/var/macports/build/_opt_local_var_macports_sources_rsync.macports.org_release_tarballs_ports_sysutils_sleuthkit/sleuthkit/work/sleuthkit-4.1.3/tools/fiwalk/plugins' |
---|
1565 | :info:build make[3]: Entering directory `/opt/local/var/macports/build/_opt_local_var_macports_sources_rsync.macports.org_release_tarballs_ports_sysutils_sleuthkit/sleuthkit/work/sleuthkit-4.1.3/tools/fiwalk' |
---|
1566 | :info:build make[3]: Nothing to be done for `all-am'. |
---|
1567 | :info:build make[3]: Leaving directory `/opt/local/var/macports/build/_opt_local_var_macports_sources_rsync.macports.org_release_tarballs_ports_sysutils_sleuthkit/sleuthkit/work/sleuthkit-4.1.3/tools/fiwalk' |
---|
1568 | :info:build make[2]: Leaving directory `/opt/local/var/macports/build/_opt_local_var_macports_sources_rsync.macports.org_release_tarballs_ports_sysutils_sleuthkit/sleuthkit/work/sleuthkit-4.1.3/tools/fiwalk' |
---|
1569 | :info:build make[2]: Entering directory `/opt/local/var/macports/build/_opt_local_var_macports_sources_rsync.macports.org_release_tarballs_ports_sysutils_sleuthkit/sleuthkit/work/sleuthkit-4.1.3/tools' |
---|
1570 | :info:build make[2]: Nothing to be done for `all-am'. |
---|
1571 | :info:build make[2]: Leaving directory `/opt/local/var/macports/build/_opt_local_var_macports_sources_rsync.macports.org_release_tarballs_ports_sysutils_sleuthkit/sleuthkit/work/sleuthkit-4.1.3/tools' |
---|
1572 | :info:build make[1]: Leaving directory `/opt/local/var/macports/build/_opt_local_var_macports_sources_rsync.macports.org_release_tarballs_ports_sysutils_sleuthkit/sleuthkit/work/sleuthkit-4.1.3/tools' |
---|
1573 | :info:build Making all in tests |
---|
1574 | :info:build make[1]: Entering directory `/opt/local/var/macports/build/_opt_local_var_macports_sources_rsync.macports.org_release_tarballs_ports_sysutils_sleuthkit/sleuthkit/work/sleuthkit-4.1.3/tests' |
---|
1575 | :info:build /usr/bin/clang++ -DHAVE_CONFIG_H -I. -I../tsk -I.. -I./.. -Wall -D_THREAD_SAFE -pthread -I/opt/local/include -D_THREAD_SAFE -pthread -pipe -Os -arch x86_64 -stdlib=libc++ -MT read_apis.o -MD -MP -MF .deps/read_apis.Tpo -c -o read_apis.o read_apis.cpp |
---|
1576 | :info:build /usr/bin/clang++ -DHAVE_CONFIG_H -I. -I../tsk -I.. -I./.. -Wall -D_THREAD_SAFE -pthread -I/opt/local/include -D_THREAD_SAFE -pthread -pipe -Os -arch x86_64 -stdlib=libc++ -MT fs_fname_apis.o -MD -MP -MF .deps/fs_fname_apis.Tpo -c -o fs_fname_apis.o fs_fname_apis.cpp |
---|
1577 | :info:build /usr/bin/clang++ -DHAVE_CONFIG_H -I. -I../tsk -I.. -I./.. -Wall -D_THREAD_SAFE -pthread -I/opt/local/include -D_THREAD_SAFE -pthread -pipe -Os -arch x86_64 -stdlib=libc++ -MT fs_attrlist_apis.o -MD -MP -MF .deps/fs_attrlist_apis.Tpo -c -o fs_attrlist_apis.o fs_attrlist_apis.cpp |
---|
1578 | :info:build /usr/bin/clang++ -DHAVE_CONFIG_H -I. -I../tsk -I.. -I./.. -Wall -D_THREAD_SAFE -pthread -I/opt/local/include -D_THREAD_SAFE -pthread -pipe -Os -arch x86_64 -stdlib=libc++ -MT fs_thread_test.o -MD -MP -MF .deps/fs_thread_test.Tpo -c -o fs_thread_test.o fs_thread_test.cpp |
---|
1579 | :info:build /usr/bin/clang++ -DHAVE_CONFIG_H -I. -I../tsk -I.. -I./.. -Wall -D_THREAD_SAFE -pthread -I/opt/local/include -D_THREAD_SAFE -pthread -pipe -Os -arch x86_64 -stdlib=libc++ -MT tsk_thread.o -MD -MP -MF .deps/tsk_thread.Tpo -c -o tsk_thread.o tsk_thread.cpp |
---|
1580 | :info:build mv -f .deps/tsk_thread.Tpo .deps/tsk_thread.Po |
---|
1581 | :info:build mv -f .deps/fs_attrlist_apis.Tpo .deps/fs_attrlist_apis.Po |
---|
1582 | :info:build /bin/sh ../libtool --tag=CXX --mode=link /usr/bin/clang++ -pipe -Os -arch x86_64 -stdlib=libc++ -L/opt/local/lib -Wl,-headerpad_max_install_names -arch x86_64 -D_THREAD_SAFE -pthread -static -o fs_attrlist_apis fs_attrlist_apis.o ../tsk/libtsk.la -lewf -ldl -lz -ldl -lstdc++ |
---|
1583 | :info:build mv -f .deps/fs_thread_test.Tpo .deps/fs_thread_test.Po |
---|
1584 | :info:build mv -f .deps/fs_fname_apis.Tpo .deps/fs_fname_apis.Po |
---|
1585 | :info:build /bin/sh ../libtool --tag=CXX --mode=link /usr/bin/clang++ -pipe -Os -arch x86_64 -stdlib=libc++ -L/opt/local/lib -Wl,-headerpad_max_install_names -arch x86_64 -D_THREAD_SAFE -pthread -static -o fs_thread_test fs_thread_test.o tsk_thread.o ../tsk/libtsk.la -lewf -ldl -lz -ldl -lstdc++ |
---|
1586 | :info:build /bin/sh ../libtool --tag=CXX --mode=link /usr/bin/clang++ -pipe -Os -arch x86_64 -stdlib=libc++ -L/opt/local/lib -Wl,-headerpad_max_install_names -arch x86_64 -D_THREAD_SAFE -pthread -static -o fs_fname_apis fs_fname_apis.o ../tsk/libtsk.la -lewf -ldl -lz -ldl -lstdc++ |
---|
1587 | :info:build mv -f .deps/read_apis.Tpo .deps/read_apis.Po |
---|
1588 | :info:build /bin/sh ../libtool --tag=CXX --mode=link /usr/bin/clang++ -pipe -Os -arch x86_64 -stdlib=libc++ -L/opt/local/lib -Wl,-headerpad_max_install_names -arch x86_64 -D_THREAD_SAFE -pthread -static -o read_apis read_apis.o ../tsk/libtsk.la -lewf -ldl -lz -ldl -lstdc++ |
---|
1589 | :info:build libtool: link: /usr/bin/clang++ -pipe -Os -arch x86_64 -stdlib=libc++ -Wl,-headerpad_max_install_names -arch x86_64 -D_THREAD_SAFE -pthread -o fs_attrlist_apis fs_attrlist_apis.o -L/opt/local/lib ../tsk/.libs/libtsk.a -lewf -lz -ldl -lstdc++ -pthread |
---|
1590 | :info:build clang: warning: argument unused during compilation: '-pthread' |
---|
1591 | :info:build clang: warning: argument unused during compilation: '-pthread' |
---|
1592 | :info:build libtool: link: /usr/bin/clang++ -pipe -Os -arch x86_64 -stdlib=libc++ -Wl,-headerpad_max_install_names -arch x86_64 -D_THREAD_SAFE -pthread -o fs_thread_test fs_thread_test.o tsk_thread.o -L/opt/local/lib ../tsk/.libs/libtsk.a -lewf -lz -ldl -lstdc++ -pthread |
---|
1593 | :info:build libtool: link: /usr/bin/clang++ -pipe -Os -arch x86_64 -stdlib=libc++ -Wl,-headerpad_max_install_names -arch x86_64 -D_THREAD_SAFE -pthread -o fs_fname_apis fs_fname_apis.o -L/opt/local/lib ../tsk/.libs/libtsk.a -lewf -lz -ldl -lstdc++ -pthread |
---|
1594 | :info:build clang: warning: argument unused during compilation: '-pthread' |
---|
1595 | :info:build clang: warning: argument unused during compilation: '-pthread' |
---|
1596 | :info:build clang: warning: argument unused during compilation: '-pthread' |
---|
1597 | :info:build clang: warning: argument unused during compilation: '-pthread' |
---|
1598 | :info:build libtool: link: /usr/bin/clang++ -pipe -Os -arch x86_64 -stdlib=libc++ -Wl,-headerpad_max_install_names -arch x86_64 -D_THREAD_SAFE -pthread -o read_apis read_apis.o -L/opt/local/lib ../tsk/.libs/libtsk.a -lewf -lz -ldl -lstdc++ -pthread |
---|
1599 | :info:build clang: warning: argument unused during compilation: '-pthread' |
---|
1600 | :info:build clang: warning: argument unused during compilation: '-pthread' |
---|
1601 | :info:build make[1]: Leaving directory `/opt/local/var/macports/build/_opt_local_var_macports_sources_rsync.macports.org_release_tarballs_ports_sysutils_sleuthkit/sleuthkit/work/sleuthkit-4.1.3/tests' |
---|
1602 | :info:build Making all in samples |
---|
1603 | :info:build make[1]: Entering directory `/opt/local/var/macports/build/_opt_local_var_macports_sources_rsync.macports.org_release_tarballs_ports_sysutils_sleuthkit/sleuthkit/work/sleuthkit-4.1.3/samples' |
---|
1604 | :info:build /usr/bin/clang++ -DHAVE_CONFIG_H -I. -I../tsk -I.. -I./.. -Wall -I/opt/local/include -D_THREAD_SAFE -pthread -pipe -Os -arch x86_64 -stdlib=libc++ -MT posix-style.o -MD -MP -MF .deps/posix-style.Tpo -c -o posix-style.o posix-style.cpp |
---|
1605 | :info:build /usr/bin/clang++ -DHAVE_CONFIG_H -I. -I../tsk -I.. -I./.. -Wall -I/opt/local/include -D_THREAD_SAFE -pthread -pipe -Os -arch x86_64 -stdlib=libc++ -MT callback-style.o -MD -MP -MF .deps/callback-style.Tpo -c -o callback-style.o callback-style.cpp |
---|
1606 | :info:build /usr/bin/clang++ -DHAVE_CONFIG_H -I. -I../tsk -I.. -I./.. -Wall -I/opt/local/include -D_THREAD_SAFE -pthread -pipe -Os -arch x86_64 -stdlib=libc++ -MT posix-cpp-style.o -MD -MP -MF .deps/posix-cpp-style.Tpo -c -o posix-cpp-style.o posix-cpp-style.cpp |
---|
1607 | :info:build /usr/bin/clang++ -DHAVE_CONFIG_H -I. -I../tsk -I.. -I./.. -Wall -I/opt/local/include -D_THREAD_SAFE -pthread -pipe -Os -arch x86_64 -stdlib=libc++ -MT callback-cpp-style.o -MD -MP -MF .deps/callback-cpp-style.Tpo -c -o callback-cpp-style.o callback-cpp-style.cpp |
---|
1608 | :info:build mv -f .deps/callback-style.Tpo .deps/callback-style.Po |
---|
1609 | :info:build /bin/sh ../libtool --tag=CXX --mode=link /usr/bin/clang++ -pipe -Os -arch x86_64 -stdlib=libc++ -static -L/opt/local/lib -Wl,-headerpad_max_install_names -arch x86_64 -D_THREAD_SAFE -pthread -o callback_style callback-style.o ../tsk/libtsk.la -lewf -ldl -lz -ldl -lstdc++ |
---|
1610 | :info:build mv -f .deps/posix-style.Tpo .deps/posix-style.Po |
---|
1611 | :info:build /bin/sh ../libtool --tag=CXX --mode=link /usr/bin/clang++ -pipe -Os -arch x86_64 -stdlib=libc++ -static -L/opt/local/lib -Wl,-headerpad_max_install_names -arch x86_64 -D_THREAD_SAFE -pthread -o posix_style posix-style.o ../tsk/libtsk.la -lewf -ldl -lz -ldl -lstdc++ |
---|
1612 | :info:build mv -f .deps/callback-cpp-style.Tpo .deps/callback-cpp-style.Po |
---|
1613 | :info:build /bin/sh ../libtool --tag=CXX --mode=link /usr/bin/clang++ -pipe -Os -arch x86_64 -stdlib=libc++ -static -L/opt/local/lib -Wl,-headerpad_max_install_names -arch x86_64 -D_THREAD_SAFE -pthread -o callback_cpp_style callback-cpp-style.o ../tsk/libtsk.la -lewf -ldl -lz -ldl -lstdc++ |
---|
1614 | :info:build mv -f .deps/posix-cpp-style.Tpo .deps/posix-cpp-style.Po |
---|
1615 | :info:build /bin/sh ../libtool --tag=CXX --mode=link /usr/bin/clang++ -pipe -Os -arch x86_64 -stdlib=libc++ -static -L/opt/local/lib -Wl,-headerpad_max_install_names -arch x86_64 -D_THREAD_SAFE -pthread -o posix_cpp_style posix-cpp-style.o ../tsk/libtsk.la -lewf -ldl -lz -ldl -lstdc++ |
---|
1616 | :info:build libtool: link: /usr/bin/clang++ -pipe -Os -arch x86_64 -stdlib=libc++ -Wl,-headerpad_max_install_names -arch x86_64 -D_THREAD_SAFE -pthread -o callback_style callback-style.o -L/opt/local/lib ../tsk/.libs/libtsk.a -lewf -lz -ldl -lstdc++ -pthread |
---|
1617 | :info:build libtool: link: /usr/bin/clang++ -pipe -Os -arch x86_64 -stdlib=libc++ -Wl,-headerpad_max_install_names -arch x86_64 -D_THREAD_SAFE -pthread -o posix_style posix-style.o -L/opt/local/lib ../tsk/.libs/libtsk.a -lewf -lz -ldl -lstdc++ -pthread |
---|
1618 | :info:build clang: warning: argument unused during compilation: '-pthread' |
---|
1619 | :info:build clang: warning: argument unused during compilation: '-pthread' |
---|
1620 | :info:build libtool: link: /usr/bin/clang++ -pipe -Os -arch x86_64 -stdlib=libc++ -Wl,-headerpad_max_install_names -arch x86_64 -D_THREAD_SAFE -pthread -o callback_cpp_style callback-cpp-style.o -L/opt/local/lib ../tsk/.libs/libtsk.a -lewf -lz -ldl -lstdc++ -pthread |
---|
1621 | :info:build clang: warning: argument unused during compilation: '-pthread' |
---|
1622 | :info:build clang: warning: argument unused during compilation: '-pthread' |
---|
1623 | :info:build clang: warning: argument unused during compilation: '-pthread' |
---|
1624 | :info:build clang: warning: argument unused during compilation: '-pthread' |
---|
1625 | :info:build libtool: link: /usr/bin/clang++ -pipe -Os -arch x86_64 -stdlib=libc++ -Wl,-headerpad_max_install_names -arch x86_64 -D_THREAD_SAFE -pthread -o posix_cpp_style posix-cpp-style.o -L/opt/local/lib ../tsk/.libs/libtsk.a -lewf -lz -ldl -lstdc++ -pthread |
---|
1626 | :info:build clang: warning: argument unused during compilation: '-pthread' |
---|
1627 | :info:build clang: warning: argument unused during compilation: '-pthread' |
---|
1628 | :info:build make[1]: Leaving directory `/opt/local/var/macports/build/_opt_local_var_macports_sources_rsync.macports.org_release_tarballs_ports_sysutils_sleuthkit/sleuthkit/work/sleuthkit-4.1.3/samples' |
---|
1629 | :info:build Making all in man |
---|
1630 | :info:build make[1]: Entering directory `/opt/local/var/macports/build/_opt_local_var_macports_sources_rsync.macports.org_release_tarballs_ports_sysutils_sleuthkit/sleuthkit/work/sleuthkit-4.1.3/man' |
---|
1631 | :info:build make[1]: Nothing to be done for `all'. |
---|
1632 | :info:build make[1]: Leaving directory `/opt/local/var/macports/build/_opt_local_var_macports_sources_rsync.macports.org_release_tarballs_ports_sysutils_sleuthkit/sleuthkit/work/sleuthkit-4.1.3/man' |
---|
1633 | :info:build Making all in bindings/java |
---|
1634 | :info:build make[1]: Entering directory `/opt/local/var/macports/build/_opt_local_var_macports_sources_rsync.macports.org_release_tarballs_ports_sysutils_sleuthkit/sleuthkit/work/sleuthkit-4.1.3/bindings/java' |
---|
1635 | :info:build Making all in jni |
---|
1636 | :info:build make[2]: Entering directory `/opt/local/var/macports/build/_opt_local_var_macports_sources_rsync.macports.org_release_tarballs_ports_sysutils_sleuthkit/sleuthkit/work/sleuthkit-4.1.3/bindings/java/jni' |
---|
1637 | :info:build /bin/sh ../../../libtool --tag=CXX --mode=compile /usr/bin/clang++ -DHAVE_CONFIG_H -I. -I../../../tsk -I../../.. -I./../../.. -Wall -I/System/Library/Frameworks/JavaVM.framework/Versions/Current/Headers -I/opt/local/include -D_THREAD_SAFE -pthread -pipe -Os -arch x86_64 -stdlib=libc++ -MT dataModel_SleuthkitJNI.lo -MD -MP -MF .deps/dataModel_SleuthkitJNI.Tpo -c -o dataModel_SleuthkitJNI.lo dataModel_SleuthkitJNI.cpp |
---|
1638 | :info:build libtool: compile: /usr/bin/clang++ -DHAVE_CONFIG_H -I. -I../../../tsk -I../../.. -I./../../.. -Wall -I/System/Library/Frameworks/JavaVM.framework/Versions/Current/Headers -I/opt/local/include -D_THREAD_SAFE -pthread -pipe -Os -arch x86_64 -stdlib=libc++ -MT dataModel_SleuthkitJNI.lo -MD -MP -MF .deps/dataModel_SleuthkitJNI.Tpo -c dataModel_SleuthkitJNI.cpp -fno-common -DPIC -o .libs/dataModel_SleuthkitJNI.o |
---|
1639 | :info:build dataModel_SleuthkitJNI.cpp:97:1: warning: unused function 'setThrowTskDataError' [-Wunused-function] |
---|
1640 | :info:build setThrowTskDataError(JNIEnv * env) |
---|
1641 | :info:build ^ |
---|
1642 | :info:build 1 warning generated. |
---|
1643 | :info:build libtool: compile: /usr/bin/clang++ -DHAVE_CONFIG_H -I. -I../../../tsk -I../../.. -I./../../.. -Wall -I/System/Library/Frameworks/JavaVM.framework/Versions/Current/Headers -I/opt/local/include -D_THREAD_SAFE -pthread -pipe -Os -arch x86_64 -stdlib=libc++ -MT dataModel_SleuthkitJNI.lo -MD -MP -MF .deps/dataModel_SleuthkitJNI.Tpo -c dataModel_SleuthkitJNI.cpp -o dataModel_SleuthkitJNI.o >/dev/null 2>&1 |
---|
1644 | :info:build mv -f .deps/dataModel_SleuthkitJNI.Tpo .deps/dataModel_SleuthkitJNI.Plo |
---|
1645 | :info:build /bin/sh ../../../libtool --tag=CXX --mode=link /usr/bin/clang++ -pipe -Os -arch x86_64 -stdlib=libc++ -L/opt/local/lib -Wl,-headerpad_max_install_names -arch x86_64 -D_THREAD_SAFE -pthread -o libtsk_jni.la -rpath /opt/local/lib dataModel_SleuthkitJNI.lo ../../../tsk/libtsk.la -lewf -ldl -lz -ldl -lstdc++ |
---|
1646 | :info:build libtool: link: /usr/bin/clang++ -dynamiclib -Wl,-flat_namespace -Wl,-undefined -Wl,suppress -o .libs/libtsk_jni.0.dylib .libs/dataModel_SleuthkitJNI.o -L/opt/local/lib ../../../tsk/.libs/libtsk.10.2.0.dylib -lewf -lz -ldl -lstdc++ -arch x86_64 -Wl,-headerpad_max_install_names -arch x86_64 -pthread -pthread -install_name /opt/local/lib/libtsk_jni.0.dylib -compatibility_version 1 -current_version 1.0 -Wl,-single_module |
---|
1647 | :info:build clang: warning: argument unused during compilation: '-pthread' |
---|
1648 | :info:build clang: warning: argument unused during compilation: '-pthread' |
---|
1649 | :info:build libtool: link: dsymutil .libs/libtsk_jni.0.dylib || : |
---|
1650 | :info:build warning: no debug symbols in executable (-arch x86_64) |
---|
1651 | :info:build libtool: link: (cd ".libs" && rm -f "libtsk_jni.dylib" && ln -s "libtsk_jni.0.dylib" "libtsk_jni.dylib") |
---|
1652 | :info:build libtool: link: (cd ".libs" && rm -f "libtsk_jni.0.0.0.dylib" && ln -s "libtsk_jni.0.dylib" "libtsk_jni.0.0.0.dylib") |
---|
1653 | :info:build libtool: link: ar cru .libs/libtsk_jni.a dataModel_SleuthkitJNI.o |
---|
1654 | :info:build libtool: link: ranlib .libs/libtsk_jni.a |
---|
1655 | :info:build libtool: link: ( cd ".libs" && rm -f "libtsk_jni.la" && ln -s "../libtsk_jni.la" "libtsk_jni.la" ) |
---|
1656 | :info:build make[2]: Leaving directory `/opt/local/var/macports/build/_opt_local_var_macports_sources_rsync.macports.org_release_tarballs_ports_sysutils_sleuthkit/sleuthkit/work/sleuthkit-4.1.3/bindings/java/jni' |
---|
1657 | :info:build make[2]: Entering directory `/opt/local/var/macports/build/_opt_local_var_macports_sources_rsync.macports.org_release_tarballs_ports_sysutils_sleuthkit/sleuthkit/work/sleuthkit-4.1.3/bindings/java' |
---|
1658 | :info:build ant dist |
---|
1659 | :info:build Buildfile: /opt/local/var/macports/build/_opt_local_var_macports_sources_rsync.macports.org_release_tarballs_ports_sysutils_sleuthkit/sleuthkit/work/sleuthkit-4.1.3/bindings/java/build.xml |
---|
1660 | :info:build |
---|
1661 | :info:build testTSKLibs: |
---|
1662 | :info:build |
---|
1663 | :info:build check-native-build-mac: |
---|
1664 | :info:build |
---|
1665 | :info:build check-native-build-unix: |
---|
1666 | :info:build |
---|
1667 | :info:build check-native-build: |
---|
1668 | :info:build |
---|
1669 | :info:build check-build: |
---|
1670 | :info:build |
---|
1671 | :info:build dist: |
---|
1672 | :info:build |
---|
1673 | :info:build download-ivy: |
---|
1674 | :info:build |
---|
1675 | :info:build -download-ivy: |
---|
1676 | :info:build [get] Getting: http://repo2.maven.org/maven2/org/apache/ivy/ivy/2.3.0-rc2/ivy-2.3.0-rc2.jar |
---|
1677 | :info:build [get] To: /opt/local/var/macports/home/.ant/lib/ivy.jar |
---|
1678 | :info:build [get] Error getting http://repo2.maven.org/maven2/org/apache/ivy/ivy/2.3.0-rc2/ivy-2.3.0-rc2.jar to /opt/local/var/macports/home/.ant/lib/ivy.jar |
---|
1679 | :info:build |
---|
1680 | :info:build BUILD FAILED |
---|
1681 | :info:build /opt/local/var/macports/build/_opt_local_var_macports_sources_rsync.macports.org_release_tarballs_ports_sysutils_sleuthkit/sleuthkit/work/sleuthkit-4.1.3/bindings/java/build.xml:119: The following error occurred while executing this line: |
---|
1682 | :info:build /opt/local/var/macports/build/_opt_local_var_macports_sources_rsync.macports.org_release_tarballs_ports_sysutils_sleuthkit/sleuthkit/work/sleuthkit-4.1.3/bindings/java/build.xml:79: The following error occurred while executing this line: |
---|
1683 | :info:build /opt/local/var/macports/build/_opt_local_var_macports_sources_rsync.macports.org_release_tarballs_ports_sysutils_sleuthkit/sleuthkit/work/sleuthkit-4.1.3/bindings/java/build.xml:85: java.io.FileNotFoundException: /opt/local/var/macports/home/.ant/lib/ivy.jar (Operation not permitted) |
---|
1684 | :info:build at java.io.FileOutputStream.open(Native Method) |
---|
1685 | :info:build at java.io.FileOutputStream.<init>(FileOutputStream.java:213) |
---|
1686 | :info:build at java.io.FileOutputStream.<init>(FileOutputStream.java:162) |
---|
1687 | :info:build at org.apache.tools.ant.taskdefs.Get$GetThread.downloadFile(Get.java:815) |
---|
1688 | :info:build at org.apache.tools.ant.taskdefs.Get$GetThread.get(Get.java:647) |
---|
1689 | :info:build at org.apache.tools.ant.taskdefs.Get$GetThread.run(Get.java:631) |
---|
1690 | :info:build |
---|
1691 | :info:build Total time: 0 seconds |
---|
1692 | :info:build make[2]: *** [all-local] Error 1 |
---|
1693 | :info:build make[2]: Leaving directory `/opt/local/var/macports/build/_opt_local_var_macports_sources_rsync.macports.org_release_tarballs_ports_sysutils_sleuthkit/sleuthkit/work/sleuthkit-4.1.3/bindings/java' |
---|
1694 | :info:build make[1]: *** [all-recursive] Error 1 |
---|
1695 | :info:build make[1]: Leaving directory `/opt/local/var/macports/build/_opt_local_var_macports_sources_rsync.macports.org_release_tarballs_ports_sysutils_sleuthkit/sleuthkit/work/sleuthkit-4.1.3/bindings/java' |
---|
1696 | :info:build make: *** [all-recursive] Error 1 |
---|
1697 | :info:build make: Leaving directory `/opt/local/var/macports/build/_opt_local_var_macports_sources_rsync.macports.org_release_tarballs_ports_sysutils_sleuthkit/sleuthkit/work/sleuthkit-4.1.3' |
---|
1698 | :info:build Command failed: cd "/opt/local/var/macports/build/_opt_local_var_macports_sources_rsync.macports.org_release_tarballs_ports_sysutils_sleuthkit/sleuthkit/work/sleuthkit-4.1.3" && /usr/bin/make -j8 -w all |
---|
1699 | :info:build Exit code: 2 |
---|
1700 | :error:build org.macports.build for port sleuthkit returned: command execution failed |
---|
1701 | :debug:build Error code: CHILDSTATUS 31807 2 |
---|
1702 | :debug:build Backtrace: command execution failed |
---|
1703 | while executing |
---|
1704 | "system -nice 0 $fullcmdstring" |
---|
1705 | ("eval" body line 1) |
---|
1706 | invoked from within |
---|
1707 | "eval system $notty $nice \$fullcmdstring" |
---|
1708 | invoked from within |
---|
1709 | "command_exec build" |
---|
1710 | (procedure "portbuild::build_main" line 8) |
---|
1711 | invoked from within |
---|
1712 | "portbuild::build_main org.macports.build" |
---|
1713 | ("eval" body line 1) |
---|
1714 | invoked from within |
---|
1715 | "eval $procedure $targetname" |
---|
1716 | :info:build Warning: targets not executed for sleuthkit: org.macports.activate org.macports.build org.macports.destroot org.macports.install |
---|
1717 | :notice:build Please see the log file for port sleuthkit for details: |
---|
1718 | /opt/local/var/macports/logs/_opt_local_var_macports_sources_rsync.macports.org_release_tarballs_ports_sysutils_sleuthkit/sleuthkit/main.log |
---|