1 | version:1 |
---|
2 | :debug:main epoch: in tree: 0 installed: 0 |
---|
3 | :debug:main subversion 1.9.3_0 exists in the ports tree |
---|
4 | :debug:main subversion 1.9.3_0 is the latest installed |
---|
5 | :debug:main subversion 1.9.3_0 is active |
---|
6 | :debug:main Merging existing variants '' into variants |
---|
7 | :debug:main new fully merged portvariants: |
---|
8 | :debug:main Changing to port directory: /opt/local/var/macports/sources/rsync.macports.org/release/tarballs/ports/devel/subversion |
---|
9 | :debug:main OS darwin/15.2.0 (Mac OS X 10.11) arch i386 |
---|
10 | :debug:main adding the default universal variant |
---|
11 | :debug:main Reading variant descriptions from /opt/local/var/macports/sources/rsync.macports.org/release/tarballs/ports/_resources/port1.0/variant_descriptions.conf |
---|
12 | :debug:main Running callback portconfigure::add_automatic_compiler_dependencies |
---|
13 | :debug:main Finished running callback portconfigure::add_automatic_compiler_dependencies |
---|
14 | :debug:main Running callback portbuild::add_automatic_buildsystem_dependencies |
---|
15 | :debug:main Finished running callback portbuild::add_automatic_buildsystem_dependencies |
---|
16 | :debug:main No need to upgrade! subversion 1.9.3_0 >= subversion 1.9.3_0 |
---|
17 | :debug:main epoch: in tree: 0 installed: 0 |
---|
18 | :debug:main expat 2.1.0_0 exists in the ports tree |
---|
19 | :debug:main expat 2.1.0_0 is the latest installed |
---|
20 | :debug:main expat 2.1.0_0 is active |
---|
21 | :debug:main Merging existing variants '' into variants |
---|
22 | :debug:main new fully merged portvariants: |
---|
23 | :debug:main Changing to port directory: /opt/local/var/macports/sources/rsync.macports.org/release/tarballs/ports/textproc/expat |
---|
24 | :debug:main OS darwin/15.2.0 (Mac OS X 10.11) arch i386 |
---|
25 | :debug:main adding the default universal variant |
---|
26 | :debug:main Reading variant descriptions from /opt/local/var/macports/sources/rsync.macports.org/release/tarballs/ports/_resources/port1.0/variant_descriptions.conf |
---|
27 | :debug:main Running callback portconfigure::add_automatic_compiler_dependencies |
---|
28 | :debug:main Finished running callback portconfigure::add_automatic_compiler_dependencies |
---|
29 | :debug:main Running callback portbuild::add_automatic_buildsystem_dependencies |
---|
30 | :debug:main Finished running callback portbuild::add_automatic_buildsystem_dependencies |
---|
31 | :debug:main No need to upgrade! expat 2.1.0_0 >= expat 2.1.0_0 |
---|
32 | :debug:main epoch: in tree: 0 installed: 0 |
---|
33 | :debug:main apr 1.5.2_1 exists in the ports tree |
---|
34 | :debug:main apr 1.5.2_1 is the latest installed |
---|
35 | :debug:main apr 1.5.2_1 is active |
---|
36 | :debug:main Merging existing variants '' into variants |
---|
37 | :debug:main new fully merged portvariants: |
---|
38 | :debug:main Changing to port directory: /opt/local/var/macports/sources/rsync.macports.org/release/tarballs/ports/devel/apr |
---|
39 | :debug:main OS darwin/15.2.0 (Mac OS X 10.11) arch i386 |
---|
40 | :debug:main adding the default universal variant |
---|
41 | :debug:main Reading variant descriptions from /opt/local/var/macports/sources/rsync.macports.org/release/tarballs/ports/_resources/port1.0/variant_descriptions.conf |
---|
42 | :debug:main Running callback portconfigure::add_automatic_compiler_dependencies |
---|
43 | :debug:main Finished running callback portconfigure::add_automatic_compiler_dependencies |
---|
44 | :debug:main Running callback portbuild::add_automatic_buildsystem_dependencies |
---|
45 | :debug:main Finished running callback portbuild::add_automatic_buildsystem_dependencies |
---|
46 | :debug:main No need to upgrade! apr 1.5.2_1 >= apr 1.5.2_1 |
---|
47 | :debug:main epoch: in tree: 0 installed: 0 |
---|
48 | :debug:main apr-util 1.5.4_0 exists in the ports tree |
---|
49 | :debug:main apr-util 1.5.4_0 is the latest installed |
---|
50 | :debug:main apr-util 1.5.4_0 is active |
---|
51 | :debug:main Merging existing variants '' into variants |
---|
52 | :debug:main new fully merged portvariants: |
---|
53 | :debug:main Changing to port directory: /opt/local/var/macports/sources/rsync.macports.org/release/tarballs/ports/devel/apr-util |
---|
54 | :debug:main OS darwin/15.2.0 (Mac OS X 10.11) arch i386 |
---|
55 | :debug:main adding the default universal variant |
---|
56 | :debug:main Reading variant descriptions from /opt/local/var/macports/sources/rsync.macports.org/release/tarballs/ports/_resources/port1.0/variant_descriptions.conf |
---|
57 | :debug:main Running callback portconfigure::add_automatic_compiler_dependencies |
---|
58 | :debug:main Finished running callback portconfigure::add_automatic_compiler_dependencies |
---|
59 | :debug:main Running callback portbuild::add_automatic_buildsystem_dependencies |
---|
60 | :debug:main Finished running callback portbuild::add_automatic_buildsystem_dependencies |
---|
61 | :debug:main No need to upgrade! apr-util 1.5.4_0 >= apr-util 1.5.4_0 |
---|
62 | :debug:main epoch: in tree: 0 installed: 0 |
---|
63 | :debug:main libiconv 1.14_0 exists in the ports tree |
---|
64 | :debug:main libiconv 1.14_0 is the latest installed |
---|
65 | :debug:main libiconv 1.14_0 is active |
---|
66 | :debug:main Merging existing variants '' into variants |
---|
67 | :debug:main new fully merged portvariants: |
---|
68 | :debug:main Changing to port directory: /opt/local/var/macports/sources/rsync.macports.org/release/tarballs/ports/textproc/libiconv |
---|
69 | :debug:main OS darwin/15.2.0 (Mac OS X 10.11) arch i386 |
---|
70 | :debug:main Reading variant descriptions from /opt/local/var/macports/sources/rsync.macports.org/release/tarballs/ports/_resources/port1.0/variant_descriptions.conf |
---|
71 | :debug:main Sourcing PortGroup muniversal 1.0 from /opt/local/var/macports/sources/rsync.macports.org/release/tarballs/ports/_resources/port1.0/group/muniversal-1.0.tcl |
---|
72 | :debug:main universal variant already exists, so not adding the default one |
---|
73 | :debug:main Running callback portconfigure::add_automatic_compiler_dependencies |
---|
74 | :debug:main Finished running callback portconfigure::add_automatic_compiler_dependencies |
---|
75 | :debug:main Running callback portbuild::add_automatic_buildsystem_dependencies |
---|
76 | :debug:main Finished running callback portbuild::add_automatic_buildsystem_dependencies |
---|
77 | :debug:main No need to upgrade! libiconv 1.14_0 >= libiconv 1.14_0 |
---|
78 | :debug:main epoch: in tree: 0 installed: 0 |
---|
79 | :debug:main db46 4.6.21_10 exists in the ports tree |
---|
80 | :debug:main db46 4.6.21_10 is the latest installed |
---|
81 | :debug:main db46 4.6.21_10 is active |
---|
82 | :debug:main Merging existing variants '' into variants |
---|
83 | :debug:main new fully merged portvariants: |
---|
84 | :debug:main Changing to port directory: /opt/local/var/macports/sources/rsync.macports.org/release/tarballs/ports/databases/db46 |
---|
85 | :debug:main OS darwin/15.2.0 (Mac OS X 10.11) arch i386 |
---|
86 | :debug:main Reading variant descriptions from /opt/local/var/macports/sources/rsync.macports.org/release/tarballs/ports/_resources/port1.0/variant_descriptions.conf |
---|
87 | :debug:main Sourcing PortGroup muniversal 1.0 from /opt/local/var/macports/sources/rsync.macports.org/release/tarballs/ports/_resources/port1.0/group/muniversal-1.0.tcl |
---|
88 | :debug:main universal variant already exists, so not adding the default one |
---|
89 | :debug:main Running callback portconfigure::add_automatic_compiler_dependencies |
---|
90 | :debug:main Finished running callback portconfigure::add_automatic_compiler_dependencies |
---|
91 | :debug:main Running callback portbuild::add_automatic_buildsystem_dependencies |
---|
92 | :debug:main Finished running callback portbuild::add_automatic_buildsystem_dependencies |
---|
93 | :debug:main No need to upgrade! db46 4.6.21_10 >= db46 4.6.21_10 |
---|
94 | :debug:main epoch: in tree: 0 installed: 0 |
---|
95 | :debug:main sqlite3 3.9.2_0 exists in the ports tree |
---|
96 | :debug:main sqlite3 3.9.2_0 is the latest installed |
---|
97 | :debug:main sqlite3 3.9.2_0 is active |
---|
98 | :debug:main Merging existing variants '' into variants |
---|
99 | :debug:main new fully merged portvariants: |
---|
100 | :debug:main Changing to port directory: /opt/local/var/macports/sources/rsync.macports.org/release/tarballs/ports/databases/sqlite3 |
---|
101 | :debug:main OS darwin/15.2.0 (Mac OS X 10.11) arch i386 |
---|
102 | :debug:main adding the default universal variant |
---|
103 | :debug:main Reading variant descriptions from /opt/local/var/macports/sources/rsync.macports.org/release/tarballs/ports/_resources/port1.0/variant_descriptions.conf |
---|
104 | :debug:main Running callback portconfigure::add_automatic_compiler_dependencies |
---|
105 | :debug:main Finished running callback portconfigure::add_automatic_compiler_dependencies |
---|
106 | :debug:main Running callback portbuild::add_automatic_buildsystem_dependencies |
---|
107 | :debug:main Finished running callback portbuild::add_automatic_buildsystem_dependencies |
---|
108 | :debug:main No need to upgrade! sqlite3 3.9.2_0 >= sqlite3 3.9.2_0 |
---|
109 | :debug:main epoch: in tree: 20090923 installed: 20090923 |
---|
110 | :debug:main libedit 20150325-3.1_0 exists in the ports tree |
---|
111 | :debug:main libedit 20150325-3.1_0 is the latest installed |
---|
112 | :debug:main libedit 20150325-3.1_0 is active |
---|
113 | :debug:main Merging existing variants '' into variants |
---|
114 | :debug:main new fully merged portvariants: |
---|
115 | :debug:main Changing to port directory: /opt/local/var/macports/sources/rsync.macports.org/release/tarballs/ports/devel/libedit |
---|
116 | :debug:main OS darwin/15.2.0 (Mac OS X 10.11) arch i386 |
---|
117 | :debug:main Reading variant descriptions from /opt/local/var/macports/sources/rsync.macports.org/release/tarballs/ports/_resources/port1.0/variant_descriptions.conf |
---|
118 | :debug:main Sourcing PortGroup muniversal 1.0 from /opt/local/var/macports/sources/rsync.macports.org/release/tarballs/ports/_resources/port1.0/group/muniversal-1.0.tcl |
---|
119 | :debug:main universal variant already exists, so not adding the default one |
---|
120 | :debug:main Running callback portconfigure::add_automatic_compiler_dependencies |
---|
121 | :debug:main Finished running callback portconfigure::add_automatic_compiler_dependencies |
---|
122 | :debug:main Running callback portbuild::add_automatic_buildsystem_dependencies |
---|
123 | :debug:main Finished running callback portbuild::add_automatic_buildsystem_dependencies |
---|
124 | :debug:main No need to upgrade! libedit 20150325-3.1_0 >= libedit 20150325-3.1_0 |
---|
125 | :debug:main epoch: in tree: 0 installed: 0 |
---|
126 | :debug:main ncurses 6.0_0 exists in the ports tree |
---|
127 | :debug:main ncurses 6.0_0 is the latest installed |
---|
128 | :debug:main ncurses 6.0_0 is active |
---|
129 | :debug:main Merging existing variants '' into variants |
---|
130 | :debug:main new fully merged portvariants: |
---|
131 | :debug:main Changing to port directory: /opt/local/var/macports/sources/rsync.macports.org/release/tarballs/ports/devel/ncurses |
---|
132 | :debug:main OS darwin/15.2.0 (Mac OS X 10.11) arch i386 |
---|
133 | :debug:main adding the default universal variant |
---|
134 | :debug:main Reading variant descriptions from /opt/local/var/macports/sources/rsync.macports.org/release/tarballs/ports/_resources/port1.0/variant_descriptions.conf |
---|
135 | :debug:main Running callback portconfigure::add_automatic_compiler_dependencies |
---|
136 | :debug:main Finished running callback portconfigure::add_automatic_compiler_dependencies |
---|
137 | :debug:main Running callback portbuild::add_automatic_buildsystem_dependencies |
---|
138 | :debug:main Finished running callback portbuild::add_automatic_buildsystem_dependencies |
---|
139 | :debug:main No need to upgrade! ncurses 6.0_0 >= ncurses 6.0_0 |
---|
140 | :debug:main epoch: in tree: 2 installed: 2 |
---|
141 | :debug:main gettext 0.19.6_0 exists in the ports tree |
---|
142 | :debug:main gettext 0.19.6_0 is the latest installed |
---|
143 | :debug:main gettext 0.19.6_0 is active |
---|
144 | :debug:main Merging existing variants '' into variants |
---|
145 | :debug:main new fully merged portvariants: |
---|
146 | :debug:main Changing to port directory: /opt/local/var/macports/sources/rsync.macports.org/release/tarballs/ports/devel/gettext |
---|
147 | :debug:main OS darwin/15.2.0 (Mac OS X 10.11) arch i386 |
---|
148 | :debug:main Sourcing PortGroup compiler_blacklist_versions 1.0 from /opt/local/var/macports/sources/rsync.macports.org/release/tarballs/ports/_resources/port1.0/group/compiler_blacklist_versions-1.0.tcl |
---|
149 | :debug:main Reading variant descriptions from /opt/local/var/macports/sources/rsync.macports.org/release/tarballs/ports/_resources/port1.0/variant_descriptions.conf |
---|
150 | :debug:main Sourcing PortGroup muniversal 1.0 from /opt/local/var/macports/sources/rsync.macports.org/release/tarballs/ports/_resources/port1.0/group/muniversal-1.0.tcl |
---|
151 | :debug:main compiler clang 700.1.81 not blacklisted because it doesn't match {clang < 211.10.1} |
---|
152 | :debug:main universal variant already exists, so not adding the default one |
---|
153 | :debug:main Running callback portconfigure::add_automatic_compiler_dependencies |
---|
154 | :debug:main Finished running callback portconfigure::add_automatic_compiler_dependencies |
---|
155 | :debug:main Running callback portbuild::add_automatic_buildsystem_dependencies |
---|
156 | :debug:main Finished running callback portbuild::add_automatic_buildsystem_dependencies |
---|
157 | :debug:main No need to upgrade! gettext 0.19.6_0 >= gettext 0.19.6_0 |
---|
158 | :debug:main epoch: in tree: 0 installed: 0 |
---|
159 | :debug:main serf1 1.3.4_0 exists in the ports tree |
---|
160 | :debug:main serf1 1.3.4_0 is the latest installed |
---|
161 | :debug:main serf1 1.3.4_0 is active |
---|
162 | :debug:main Merging existing variants '' into variants |
---|
163 | :debug:main new fully merged portvariants: |
---|
164 | :debug:main Changing to port directory: /opt/local/var/macports/sources/rsync.macports.org/release/tarballs/ports/www/serf1 |
---|
165 | :debug:main OS darwin/15.2.0 (Mac OS X 10.11) arch i386 |
---|
166 | :debug:main Reading variant descriptions from /opt/local/var/macports/sources/rsync.macports.org/release/tarballs/ports/_resources/port1.0/variant_descriptions.conf |
---|
167 | :debug:main universal variant already exists, so not adding the default one |
---|
168 | :debug:main Running callback portconfigure::add_automatic_compiler_dependencies |
---|
169 | :debug:main Finished running callback portconfigure::add_automatic_compiler_dependencies |
---|
170 | :debug:main Running callback portbuild::add_automatic_buildsystem_dependencies |
---|
171 | :debug:main Finished running callback portbuild::add_automatic_buildsystem_dependencies |
---|
172 | :debug:main No need to upgrade! serf1 1.3.4_0 >= serf1 1.3.4_0 |
---|
173 | :debug:main epoch: in tree: 1 installed: 1 |
---|
174 | :debug:main openssl 1.0.2e_0 exists in the ports tree |
---|
175 | :debug:main openssl 1.0.2e_0 is the latest installed |
---|
176 | :debug:main openssl 1.0.2e_0 is active |
---|
177 | :debug:main Merging existing variants '' into variants |
---|
178 | :debug:main new fully merged portvariants: |
---|
179 | :debug:main Changing to port directory: /opt/local/var/macports/sources/rsync.macports.org/release/tarballs/ports/devel/openssl |
---|
180 | :debug:main OS darwin/15.2.0 (Mac OS X 10.11) arch i386 |
---|
181 | :debug:main Reading variant descriptions from /opt/local/var/macports/sources/rsync.macports.org/release/tarballs/ports/_resources/port1.0/variant_descriptions.conf |
---|
182 | :debug:main Sourcing PortGroup muniversal 1.0 from /opt/local/var/macports/sources/rsync.macports.org/release/tarballs/ports/_resources/port1.0/group/muniversal-1.0.tcl |
---|
183 | :debug:main universal variant already exists, so not adding the default one |
---|
184 | :debug:main Running callback portconfigure::add_automatic_compiler_dependencies |
---|
185 | :debug:main Finished running callback portconfigure::add_automatic_compiler_dependencies |
---|
186 | :debug:main Running callback portbuild::add_automatic_buildsystem_dependencies |
---|
187 | :debug:main Finished running callback portbuild::add_automatic_buildsystem_dependencies |
---|
188 | :debug:main No need to upgrade! openssl 1.0.2e_0 >= openssl 1.0.2e_0 |
---|
189 | :debug:main epoch: in tree: 0 installed: 0 |
---|
190 | :debug:main zlib 1.2.8_0 exists in the ports tree |
---|
191 | :debug:main zlib 1.2.8_0 is the latest installed |
---|
192 | :debug:main zlib 1.2.8_0 is active |
---|
193 | :debug:main Merging existing variants '' into variants |
---|
194 | :debug:main new fully merged portvariants: |
---|
195 | :debug:main Changing to port directory: /opt/local/var/macports/sources/rsync.macports.org/release/tarballs/ports/archivers/zlib |
---|
196 | :debug:main OS darwin/15.2.0 (Mac OS X 10.11) arch i386 |
---|
197 | :debug:main Sourcing PortGroup xcodeversion 1.0 from /opt/local/var/macports/sources/rsync.macports.org/release/tarballs/ports/_resources/port1.0/group/xcodeversion-1.0.tcl |
---|
198 | :debug:main adding the default universal variant |
---|
199 | :debug:main Reading variant descriptions from /opt/local/var/macports/sources/rsync.macports.org/release/tarballs/ports/_resources/port1.0/variant_descriptions.conf |
---|
200 | :debug:main Running callback portconfigure::add_automatic_compiler_dependencies |
---|
201 | :debug:main Finished running callback portconfigure::add_automatic_compiler_dependencies |
---|
202 | :debug:main Running callback portbuild::add_automatic_buildsystem_dependencies |
---|
203 | :debug:main Finished running callback portbuild::add_automatic_buildsystem_dependencies |
---|
204 | :debug:main No need to upgrade! zlib 1.2.8_0 >= zlib 1.2.8_0 |
---|
205 | :debug:main epoch: in tree: 0 installed: 0 |
---|
206 | :debug:main cyrus-sasl2 2.1.26_5 exists in the ports tree |
---|
207 | :debug:main cyrus-sasl2 2.1.26_5 +kerberos is the latest installed |
---|
208 | :debug:main cyrus-sasl2 2.1.26_5 +kerberos is active |
---|
209 | :debug:main Merging existing variants '+kerberos' into variants |
---|
210 | :debug:main new fully merged portvariants: kerberos + |
---|
211 | :debug:main Changing to port directory: /opt/local/var/macports/sources/rsync.macports.org/release/tarballs/ports/security/cyrus-sasl2 |
---|
212 | :debug:main OS darwin/15.2.0 (Mac OS X 10.11) arch i386 |
---|
213 | :debug:main Reading variant descriptions from /opt/local/var/macports/sources/rsync.macports.org/release/tarballs/ports/_resources/port1.0/variant_descriptions.conf |
---|
214 | :debug:main Sourcing PortGroup muniversal 1.0 from /opt/local/var/macports/sources/rsync.macports.org/release/tarballs/ports/_resources/port1.0/group/muniversal-1.0.tcl |
---|
215 | :debug:main universal variant already exists, so not adding the default one |
---|
216 | :debug:main Executing variant kerberos provides kerberos |
---|
217 | :debug:main Running callback portconfigure::add_automatic_compiler_dependencies |
---|
218 | :debug:main Finished running callback portconfigure::add_automatic_compiler_dependencies |
---|
219 | :debug:main Running callback portbuild::add_automatic_buildsystem_dependencies |
---|
220 | :debug:main Finished running callback portbuild::add_automatic_buildsystem_dependencies |
---|
221 | :debug:main No need to upgrade! cyrus-sasl2 2.1.26_5 >= cyrus-sasl2 2.1.26_5 |
---|
222 | :debug:main epoch: in tree: 0 installed: 0 |
---|
223 | :debug:main kerberos5 1.13.2_2 exists in the ports tree |
---|
224 | :debug:main kerberos5 1.13.2_2 is the latest installed |
---|
225 | :debug:main kerberos5 1.13.2_2 is active |
---|
226 | :debug:main Merging existing variants '' into variants |
---|
227 | :debug:main new fully merged portvariants: |
---|
228 | :debug:main Changing to port directory: /opt/local/var/macports/sources/rsync.macports.org/release/tarballs/ports/net/kerberos5 |
---|
229 | :debug:main OS darwin/15.2.0 (Mac OS X 10.11) arch i386 |
---|
230 | :debug:main Sourcing PortGroup github 1.0 from /opt/local/var/macports/sources/rsync.macports.org/release/tarballs/ports/_resources/port1.0/group/github-1.0.tcl |
---|
231 | :debug:main Sourcing PortGroup compiler_blacklist_versions 1.0 from /opt/local/var/macports/sources/rsync.macports.org/release/tarballs/ports/_resources/port1.0/group/compiler_blacklist_versions-1.0.tcl |
---|
232 | :debug:main compiler clang 700.1.81 not blacklisted because it doesn't match {clang <= 318.0.61} |
---|
233 | :debug:main adding the default universal variant |
---|
234 | :debug:main Reading variant descriptions from /opt/local/var/macports/sources/rsync.macports.org/release/tarballs/ports/_resources/port1.0/variant_descriptions.conf |
---|
235 | :debug:main Running callback portconfigure::add_automatic_compiler_dependencies |
---|
236 | :debug:main Finished running callback portconfigure::add_automatic_compiler_dependencies |
---|
237 | :debug:main Running callback portbuild::add_automatic_buildsystem_dependencies |
---|
238 | :debug:main Finished running callback portbuild::add_automatic_buildsystem_dependencies |
---|
239 | :debug:main No need to upgrade! kerberos5 1.13.2_2 >= kerberos5 1.13.2_2 |
---|
240 | :debug:main epoch: in tree: 0 installed: 0 |
---|
241 | :debug:main libcomerr 1.42.13_0 exists in the ports tree |
---|
242 | :debug:main libcomerr 1.42.13_0 is the latest installed |
---|
243 | :debug:main libcomerr 1.42.13_0 is active |
---|
244 | :debug:main Merging existing variants '' into variants |
---|
245 | :debug:main new fully merged portvariants: |
---|
246 | :debug:main Changing to port directory: /opt/local/var/macports/sources/rsync.macports.org/release/tarballs/ports/sysutils/e2fsprogs |
---|
247 | :debug:main OS darwin/15.2.0 (Mac OS X 10.11) arch i386 |
---|
248 | :debug:main adding the default universal variant |
---|
249 | :debug:main Reading variant descriptions from /opt/local/var/macports/sources/rsync.macports.org/release/tarballs/ports/_resources/port1.0/variant_descriptions.conf |
---|
250 | :debug:main Running callback portconfigure::add_automatic_compiler_dependencies |
---|
251 | :debug:main Finished running callback portconfigure::add_automatic_compiler_dependencies |
---|
252 | :debug:main Running callback portbuild::add_automatic_buildsystem_dependencies |
---|
253 | :debug:main Finished running callback portbuild::add_automatic_buildsystem_dependencies |
---|
254 | :debug:main No need to upgrade! libcomerr 1.42.13_0 >= libcomerr 1.42.13_0 |
---|
255 | :debug:main epoch: in tree: 0 installed: 0 |
---|
256 | :debug:main libmagic 5.25_0 exists in the ports tree |
---|
257 | :debug:main libmagic 5.25_0 is the latest installed |
---|
258 | :debug:main libmagic 5.25_0 is active |
---|
259 | :debug:main Merging existing variants '' into variants |
---|
260 | :debug:main new fully merged portvariants: |
---|
261 | :debug:main Changing to port directory: /opt/local/var/macports/sources/rsync.macports.org/release/tarballs/ports/sysutils/file |
---|
262 | :debug:main OS darwin/15.2.0 (Mac OS X 10.11) arch i386 |
---|
263 | :debug:main adding the default universal variant |
---|
264 | :debug:main Reading variant descriptions from /opt/local/var/macports/sources/rsync.macports.org/release/tarballs/ports/_resources/port1.0/variant_descriptions.conf |
---|
265 | :debug:main Running callback portconfigure::add_automatic_compiler_dependencies |
---|
266 | :debug:main Finished running callback portconfigure::add_automatic_compiler_dependencies |
---|
267 | :debug:main Running callback portbuild::add_automatic_buildsystem_dependencies |
---|
268 | :debug:main Finished running callback portbuild::add_automatic_buildsystem_dependencies |
---|
269 | :debug:main No need to upgrade! libmagic 5.25_0 >= libmagic 5.25_0 |
---|
270 | :debug:main epoch: in tree: 0 installed: 0 |
---|
271 | :debug:main curl-ca-bundle 7.46.0_0 exists in the ports tree |
---|
272 | :debug:main curl-ca-bundle 7.46.0_0 is the latest installed |
---|
273 | :debug:main curl-ca-bundle 7.46.0_0 is active |
---|
274 | :debug:main Merging existing variants '' into variants |
---|
275 | :debug:main new fully merged portvariants: |
---|
276 | :debug:main Changing to port directory: /opt/local/var/macports/sources/rsync.macports.org/release/tarballs/ports/net/curl |
---|
277 | :debug:main OS darwin/15.2.0 (Mac OS X 10.11) arch i386 |
---|
278 | :debug:main universal_variant is false, so not adding the default universal variant |
---|
279 | :debug:main Running callback portconfigure::add_automatic_compiler_dependencies |
---|
280 | :debug:main Finished running callback portconfigure::add_automatic_compiler_dependencies |
---|
281 | :debug:main Running callback portbuild::add_automatic_buildsystem_dependencies |
---|
282 | :debug:main Finished running callback portbuild::add_automatic_buildsystem_dependencies |
---|
283 | :debug:main No need to upgrade! curl-ca-bundle 7.46.0_0 >= curl-ca-bundle 7.46.0_0 |
---|
284 | :debug:main epoch: in tree: 0 installed: 0 |
---|
285 | :debug:main apache-ant 1.9.6_0 exists in the ports tree |
---|
286 | :debug:main apache-ant 1.9.6_0 is the latest installed |
---|
287 | :debug:main apache-ant 1.9.6_0 is active |
---|
288 | :debug:main Merging existing variants '' into variants |
---|
289 | :debug:main new fully merged portvariants: |
---|
290 | :debug:main Changing to port directory: /opt/local/var/macports/sources/rsync.macports.org/release/tarballs/ports/devel/apache-ant |
---|
291 | :debug:main OS darwin/15.2.0 (Mac OS X 10.11) arch i386 |
---|
292 | :debug:main universal_variant is false, so not adding the default universal variant |
---|
293 | :debug:main Running callback portconfigure::add_automatic_compiler_dependencies |
---|
294 | :debug:main Finished running callback portconfigure::add_automatic_compiler_dependencies |
---|
295 | :debug:main Running callback portbuild::add_automatic_buildsystem_dependencies |
---|
296 | :debug:main Finished running callback portbuild::add_automatic_buildsystem_dependencies |
---|
297 | :debug:main No need to upgrade! apache-ant 1.9.6_0 >= apache-ant 1.9.6_0 |
---|
298 | :msg:main ---> Computing dependencies for processing:info:main .:debug:main processing has no conflicts |
---|
299 | :debug:main Searching for dependency: subversion |
---|
300 | :debug:main Found Dependency: receipt exists for subversion |
---|
301 | :debug:main Searching for dependency: apache-ant |
---|
302 | :debug:main Found Dependency: receipt exists for apache-ant |
---|
303 | :msg:main |
---|
304 | :debug:main Executing org.macports.main (processing) |
---|
305 | :debug:main changing euid/egid - current euid: 0 - current egid: 0 |
---|
306 | :debug:main egid changed to: 501 |
---|
307 | :debug:main euid changed to: 502 |
---|
308 | :debug:archivefetch archivefetch phase started at Tue Dec 29 22:07:03 CST 2015 |
---|
309 | :msg:archivefetch ---> Fetching archive for processing |
---|
310 | :debug:archivefetch Executing org.macports.archivefetch (processing) |
---|
311 | :debug:archivefetch euid/egid changed to: 0/0 |
---|
312 | :debug:archivefetch chowned /opt/local/var/macports/incoming to macports |
---|
313 | :debug:archivefetch euid/egid changed to: 502/501 |
---|
314 | :info:archivefetch ---> processing-1.2.1_0.darwin_15.x86_64.tbz2 doesn't seem to exist in /opt/local/var/macports/incoming/verified |
---|
315 | :msg:archivefetch ---> Attempting to fetch processing-1.2.1_0.darwin_15.x86_64.tbz2 from http://packages.macports.org/processing |
---|
316 | :debug:archivefetch Fetching archive failed:: The requested URL returned error: 404 Not Found |
---|
317 | :msg:archivefetch ---> Attempting to fetch processing-1.2.1_0.darwin_15.x86_64.tbz2 from http://lil.fr.packages.macports.org/processing |
---|
318 | :debug:archivefetch Fetching archive failed:: The requested URL returned error: 404 Not Found |
---|
319 | :msg:archivefetch ---> Attempting to fetch processing-1.2.1_0.darwin_15.x86_64.tbz2 from http://nue.de.packages.macports.org/macports/packages/processing |
---|
320 | :debug:archivefetch Fetching archive failed:: The requested URL returned error: 404 Not Found |
---|
321 | :debug:archivefetch Privilege de-escalation not attempted as not running as root. |
---|
322 | :debug:fetch fetch phase started at Tue Dec 29 22:07:09 CST 2015 |
---|
323 | :notice:fetch ---> Fetching distfiles for processing |
---|
324 | :debug:fetch Can't run fetch on this port without elevated privileges. Escalating privileges back to root. |
---|
325 | :debug:fetch euid changed to: 0. egid changed to: 0. |
---|
326 | :debug:fetch changing euid/egid - current euid: 0 - current egid: 0 |
---|
327 | :debug:fetch egid changed to: 501 |
---|
328 | :debug:fetch euid changed to: 502 |
---|
329 | :debug:fetch Executing org.macports.fetch (processing) |
---|
330 | :debug:fetch Environment: |
---|
331 | CC_PRINT_OPTIONS='YES' |
---|
332 | CC_PRINT_OPTIONS_FILE='/opt/local/var/macports/build/_opt_local_var_macports_sources_rsync.macports.org_release_tarballs_ports_lang_processing/processing/work/.CC_PRINT_OPTIONS' |
---|
333 | CPATH='/opt/local/include' |
---|
334 | LIBRARY_PATH='/opt/local/lib' |
---|
335 | MACOSX_DEPLOYMENT_TARGET='10.11' |
---|
336 | :debug:fetch Assembled command: 'cd "/opt/local/var/macports/build/_opt_local_var_macports_sources_rsync.macports.org_release_tarballs_ports_lang_processing/processing/work" && /usr/bin/svn --non-interactive --trust-server-cert export http://processing.googlecode.com/svn/tags/processing-1.2.1' |
---|
337 | :debug:fetch Executing command line: cd "/opt/local/var/macports/build/_opt_local_var_macports_sources_rsync.macports.org_release_tarballs_ports_lang_processing/processing/work" && /usr/bin/svn --non-interactive --trust-server-cert export http://processing.googlecode.com/svn/tags/processing-1.2.1 2>&1 |
---|
338 | :info:fetch A processing-1.2.1 |
---|
339 | :info:fetch A processing-1.2.1/serial |
---|
340 | :info:fetch A processing-1.2.1/serial/.classpath |
---|
341 | :info:fetch A processing-1.2.1/serial/library |
---|
342 | :info:fetch A processing-1.2.1/serial/library/export.txt |
---|
343 | :info:fetch A processing-1.2.1/serial/library/rxtxSerial.dll |
---|
344 | :info:fetch A processing-1.2.1/serial/library/librxtxSerial.jnilib |
---|
345 | :info:fetch A processing-1.2.1/serial/library/librxtxSerial.so |
---|
346 | :info:fetch A processing-1.2.1/serial/library/RXTXcomm.jar |
---|
347 | :info:fetch A processing-1.2.1/serial/library/.cvsignore |
---|
348 | :info:fetch A processing-1.2.1/serial/.project |
---|
349 | :info:fetch A processing-1.2.1/serial/src |
---|
350 | :info:fetch A processing-1.2.1/serial/src/processing |
---|
351 | :info:fetch A processing-1.2.1/serial/src/processing/serial |
---|
352 | :info:fetch A processing-1.2.1/serial/src/processing/serial/Serial.java |
---|
353 | :info:fetch A processing-1.2.1/serial/build.xml |
---|
354 | :info:fetch A processing-1.2.1/serial/.settings |
---|
355 | :info:fetch A processing-1.2.1/serial/.settings/org.eclipse.jdt.core.prefs |
---|
356 | :info:fetch A processing-1.2.1/app |
---|
357 | :info:fetch A processing-1.2.1/app/test |
---|
358 | :info:fetch A processing-1.2.1/app/test/lib |
---|
359 | :info:fetch A processing-1.2.1/app/test/lib/junit-4.8.1.jar |
---|
360 | :info:fetch A processing-1.2.1/app/test/src |
---|
361 | :info:fetch A processing-1.2.1/app/test/src/test |
---|
362 | :info:fetch A processing-1.2.1/app/test/src/test/processing |
---|
363 | :info:fetch A processing-1.2.1/app/test/src/test/processing/parsing |
---|
364 | :info:fetch A processing-1.2.1/app/test/src/test/processing/parsing/ParserTests.java |
---|
365 | :info:fetch A processing-1.2.1/app/test/src/test/processing/parsing/UTCompiler.java |
---|
366 | :info:fetch A processing-1.2.1/app/test/src/test/processing/parsing/AutoFormatTests.java |
---|
367 | :info:fetch A processing-1.2.1/app/test/src/test/processing/parsing/ProcessingTestUtil.java |
---|
368 | :info:fetch A processing-1.2.1/app/test/resources |
---|
369 | :info:fetch A processing-1.2.1/app/test/resources/preferences.txt |
---|
370 | :info:fetch A processing-1.2.1/app/test/resources/bug598.expected |
---|
371 | :info:fetch A processing-1.2.1/app/test/resources/bug315g.pde |
---|
372 | :info:fetch A processing-1.2.1/app/test/resources/bug196.pde |
---|
373 | :info:fetch A processing-1.2.1/app/test/resources/bug1511.expected |
---|
374 | :info:fetch A processing-1.2.1/app/test/resources/bug1064.expected |
---|
375 | :info:fetch A processing-1.2.1/app/test/resources/bug1442.expected |
---|
376 | :info:fetch A processing-1.2.1/app/test/resources/bug1515.expected |
---|
377 | :info:fetch A processing-1.2.1/app/test/resources/bug1514a.expected |
---|
378 | :info:fetch A processing-1.2.1/app/test/resources/bug1525.expected |
---|
379 | :info:fetch A processing-1.2.1/app/test/resources/bug598.pde |
---|
380 | :info:fetch A processing-1.2.1/app/test/resources/bug16.pde |
---|
381 | :info:fetch A processing-1.2.1/app/test/resources/bug1517.expected |
---|
382 | :info:fetch A processing-1.2.1/app/test/resources/bug1511.pde |
---|
383 | :info:fetch A processing-1.2.1/app/test/resources/bug1512.pde |
---|
384 | :info:fetch A processing-1.2.1/app/test/resources/bug1518a.expected |
---|
385 | :info:fetch A processing-1.2.1/app/test/resources/bug1532.pde |
---|
386 | :info:fetch A processing-1.2.1/app/test/resources/bug1515.pde |
---|
387 | :info:fetch A processing-1.2.1/app/test/resources/bug1514a.pde |
---|
388 | :info:fetch A processing-1.2.1/app/test/resources/bug1534.pde |
---|
389 | :info:fetch A processing-1.2.1/app/test/resources/bug1514b.pde |
---|
390 | :info:fetch A processing-1.2.1/app/test/resources/bug1516.pde |
---|
391 | :info:fetch A processing-1.2.1/app/test/resources/bug1517.pde |
---|
392 | :info:fetch A processing-1.2.1/app/test/resources/bug5b.expected |
---|
393 | :info:fetch A processing-1.2.1/app/test/resources/bug1518a.pde |
---|
394 | :info:fetch A processing-1.2.1/app/test/resources/bug1519.pde |
---|
395 | :info:fetch A processing-1.2.1/app/test/resources/bug1518b.pde |
---|
396 | :info:fetch A processing-1.2.1/app/test/resources/bug109.expected |
---|
397 | :info:fetch A processing-1.2.1/app/test/resources/bug109.pde |
---|
398 | :info:fetch A processing-1.2.1/app/test/resources/bug820.pde |
---|
399 | :info:fetch A processing-1.2.1/app/test/resources/bug281.pde |
---|
400 | :info:fetch A processing-1.2.1/app/test/resources/bug507.pde |
---|
401 | :info:fetch A processing-1.2.1/app/test/resources/bug481.pde |
---|
402 | :info:fetch A processing-1.2.1/app/test/resources/bug763.pde |
---|
403 | :info:fetch A processing-1.2.1/app/test/resources/bug1512.expected |
---|
404 | :info:fetch A processing-1.2.1/app/test/resources/bug1362.expected |
---|
405 | :info:fetch A processing-1.2.1/app/test/resources/bug1516.expected |
---|
406 | :info:fetch A processing-1.2.1/app/test/resources/bug1514b.expected |
---|
407 | :info:fetch A processing-1.2.1/app/test/resources/bug1534.expected |
---|
408 | :info:fetch A processing-1.2.1/app/test/resources/bug1518b.expected |
---|
409 | :info:fetch A processing-1.2.1/app/test/resources/bug1145.pde |
---|
410 | :info:fetch A processing-1.2.1/app/test/resources/bug1064.pde |
---|
411 | :info:fetch A processing-1.2.1/app/test/resources/bug1442.pde |
---|
412 | :info:fetch A processing-1.2.1/app/test/resources/bug1362.pde |
---|
413 | :info:fetch A processing-1.2.1/app/test/resources/bug4.expected |
---|
414 | :info:fetch A processing-1.2.1/app/test/resources/bug1525.pde |
---|
415 | :info:fetch A processing-1.2.1/app/test/resources/whitespace_test.pde |
---|
416 | :info:fetch A processing-1.2.1/app/test/resources/bug5a.expected |
---|
417 | :info:fetch A processing-1.2.1/app/test/resources/bug136.expected |
---|
418 | :info:fetch A processing-1.2.1/app/test/resources/bug631.expected |
---|
419 | :info:fetch A processing-1.2.1/app/test/resources/bug281.expected |
---|
420 | :info:fetch A processing-1.2.1/app/test/resources/bug4.pde |
---|
421 | :info:fetch A processing-1.2.1/app/test/resources/bug481.expected |
---|
422 | :info:fetch A processing-1.2.1/app/test/resources/bug6.pde |
---|
423 | :info:fetch A processing-1.2.1/app/test/resources/bug5a.pde |
---|
424 | :info:fetch A processing-1.2.1/app/test/resources/bug5b.pde |
---|
425 | :info:fetch A processing-1.2.1/app/test/resources/bug315g.expected |
---|
426 | :info:fetch A processing-1.2.1/app/test/resources/bug631.pde |
---|
427 | :info:fetch A processing-1.2.1/app/test/resources/bug136.pde |
---|
428 | :info:fetch A processing-1.2.1/app/.classpath |
---|
429 | :info:fetch A processing-1.2.1/app/.project |
---|
430 | :info:fetch A processing-1.2.1/app/lib |
---|
431 | :info:fetch A processing-1.2.1/app/lib/jna.jar |
---|
432 | :info:fetch A processing-1.2.1/app/lib/antlr-src.zip |
---|
433 | :info:fetch A processing-1.2.1/app/lib/antlr.jar |
---|
434 | :info:fetch A processing-1.2.1/app/lib/ant-launcher.jar |
---|
435 | :info:fetch A processing-1.2.1/app/lib/ecj.jar |
---|
436 | :info:fetch A processing-1.2.1/app/lib/apple.jar |
---|
437 | :info:fetch A processing-1.2.1/app/lib/ant.jar |
---|
438 | :info:fetch A processing-1.2.1/app/.classpath_vista |
---|
439 | :info:fetch A processing-1.2.1/app/src |
---|
440 | :info:fetch A processing-1.2.1/app/src/antlr |
---|
441 | :info:fetch A processing-1.2.1/app/src/antlr/TokenStreamCopyingHiddenTokenFilter.java |
---|
442 | :info:fetch A processing-1.2.1/app/src/antlr/ExtendedCommonASTWithHiddenTokens.java |
---|
443 | :info:fetch A processing-1.2.1/app/src/processing |
---|
444 | :info:fetch A processing-1.2.1/app/src/processing/app |
---|
445 | :info:fetch A processing-1.2.1/app/src/processing/app/EditorHeader.java |
---|
446 | :info:fetch A processing-1.2.1/app/src/processing/app/LibraryFolder.java |
---|
447 | :info:fetch A processing-1.2.1/app/src/processing/app/Preferences.java |
---|
448 | :info:fetch A processing-1.2.1/app/src/processing/app/EditorLineStatus.java |
---|
449 | :info:fetch A processing-1.2.1/app/src/processing/app/Theme.java |
---|
450 | :info:fetch A processing-1.2.1/app/src/processing/app/exec |
---|
451 | :info:fetch A processing-1.2.1/app/src/processing/app/exec/ProcessRegistry.java |
---|
452 | :info:fetch A processing-1.2.1/app/src/processing/app/exec/LineProcessor.java |
---|
453 | :info:fetch A processing-1.2.1/app/src/processing/app/exec/StreamPump.java |
---|
454 | :info:fetch A processing-1.2.1/app/src/processing/app/exec/ProcessResult.java |
---|
455 | :info:fetch A processing-1.2.1/app/src/processing/app/exec/ProcessHelper.java |
---|
456 | :info:fetch A processing-1.2.1/app/src/processing/app/WebServer.java |
---|
457 | :info:fetch A processing-1.2.1/app/src/processing/app/StreamRedirectThread.java |
---|
458 | :info:fetch A processing-1.2.1/app/src/processing/app/Commander.java |
---|
459 | :info:fetch A processing-1.2.1/app/src/processing/app/debug |
---|
460 | :info:fetch A processing-1.2.1/app/src/processing/app/debug/RunnerListener.java |
---|
461 | :info:fetch A processing-1.2.1/app/src/processing/app/debug/MessageStream.java |
---|
462 | :info:fetch A processing-1.2.1/app/src/processing/app/debug/MessageConsumer.java |
---|
463 | :info:fetch A processing-1.2.1/app/src/processing/app/debug/MessageSiphon.java |
---|
464 | :info:fetch A processing-1.2.1/app/src/processing/app/debug/RunnerException.java |
---|
465 | :info:fetch A processing-1.2.1/app/src/processing/app/debug/EventThread.java |
---|
466 | :info:fetch A processing-1.2.1/app/src/processing/app/debug/Runner.java |
---|
467 | :info:fetch A processing-1.2.1/app/src/processing/app/debug/Compiler.java |
---|
468 | :info:fetch A processing-1.2.1/app/src/processing/app/debug/SystemOutSiphon.java |
---|
469 | :info:fetch A processing-1.2.1/app/src/processing/app/syntax |
---|
470 | :info:fetch A processing-1.2.1/app/src/processing/app/syntax/PdeKeywords.java |
---|
471 | :info:fetch A processing-1.2.1/app/src/processing/app/syntax/TextAreaPainter.java |
---|
472 | :info:fetch A processing-1.2.1/app/src/processing/app/syntax/DefaultInputHandler.java |
---|
473 | :info:fetch A processing-1.2.1/app/src/processing/app/syntax/TextAreaDefaults.java |
---|
474 | :info:fetch A processing-1.2.1/app/src/processing/app/syntax/SyntaxStyle.java |
---|
475 | :info:fetch A processing-1.2.1/app/src/processing/app/syntax/TextUtilities.java |
---|
476 | :info:fetch A processing-1.2.1/app/src/processing/app/syntax/Token.java |
---|
477 | :info:fetch A processing-1.2.1/app/src/processing/app/syntax/KeywordMap.java |
---|
478 | :info:fetch A processing-1.2.1/app/src/processing/app/syntax/SyntaxUtilities.java |
---|
479 | :info:fetch A processing-1.2.1/app/src/processing/app/syntax/TokenMarker.java |
---|
480 | :info:fetch A processing-1.2.1/app/src/processing/app/syntax/im |
---|
481 | :info:fetch A processing-1.2.1/app/src/processing/app/syntax/im/CompositionTextManager.java |
---|
482 | :info:fetch A processing-1.2.1/app/src/processing/app/syntax/im/CompositionTextPainter.java |
---|
483 | :info:fetch A processing-1.2.1/app/src/processing/app/syntax/im/InputMethodSupport.java |
---|
484 | :info:fetch A processing-1.2.1/app/src/processing/app/syntax/CTokenMarker.java |
---|
485 | :info:fetch A processing-1.2.1/app/src/processing/app/syntax/SyntaxDocument.java |
---|
486 | :info:fetch A processing-1.2.1/app/src/processing/app/syntax/readme.txt |
---|
487 | :info:fetch A processing-1.2.1/app/src/processing/app/syntax/JEditTextArea.java |
---|
488 | :info:fetch A processing-1.2.1/app/src/processing/app/syntax/InputHandler.java |
---|
489 | :info:fetch A processing-1.2.1/app/src/processing/app/syntax/PdeTextAreaDefaults.java |
---|
490 | :info:fetch A processing-1.2.1/app/src/processing/app/syntax/Brackets.java |
---|
491 | :info:fetch A processing-1.2.1/app/src/processing/app/format |
---|
492 | :info:fetch A processing-1.2.1/app/src/processing/app/format/AutoFormat.java |
---|
493 | :info:fetch A processing-1.2.1/app/src/processing/app/EditorConsole.java |
---|
494 | :info:fetch A processing-1.2.1/app/src/processing/app/EditorToolbar.java |
---|
495 | :info:fetch A processing-1.2.1/app/src/processing/app/Base.java |
---|
496 | :info:fetch A processing-1.2.1/app/src/processing/app/macosx |
---|
497 | :info:fetch A processing-1.2.1/app/src/processing/app/macosx/Platform.java |
---|
498 | :info:fetch A processing-1.2.1/app/src/processing/app/macosx/ThinkDifferent.java |
---|
499 | :info:fetch A processing-1.2.1/app/src/processing/app/windows |
---|
500 | :info:fetch A processing-1.2.1/app/src/processing/app/windows/WINNT.java |
---|
501 | :info:fetch A processing-1.2.1/app/src/processing/app/windows/Platform.java |
---|
502 | :info:fetch A processing-1.2.1/app/src/processing/app/windows/WINERROR.java |
---|
503 | :info:fetch A processing-1.2.1/app/src/processing/app/windows/Registry.java |
---|
504 | :info:fetch A processing-1.2.1/app/src/processing/app/windows/WINBASE.java |
---|
505 | :info:fetch A processing-1.2.1/app/src/processing/app/windows/Advapi32.java |
---|
506 | :info:fetch A processing-1.2.1/app/src/processing/app/windows/Options.java |
---|
507 | :info:fetch A processing-1.2.1/app/src/processing/app/windows/WINREG.java |
---|
508 | :info:fetch A processing-1.2.1/app/src/processing/app/FindReplace.java |
---|
509 | :info:fetch A processing-1.2.1/app/src/processing/app/SketchCode.java |
---|
510 | :info:fetch A processing-1.2.1/app/src/processing/app/linux |
---|
511 | :info:fetch A processing-1.2.1/app/src/processing/app/linux/Platform.java |
---|
512 | :info:fetch A processing-1.2.1/app/src/processing/app/tools |
---|
513 | :info:fetch A processing-1.2.1/app/src/processing/app/tools/ColorSelector.java |
---|
514 | :info:fetch A processing-1.2.1/app/src/processing/app/tools/AutoFormatTool.java |
---|
515 | :info:fetch A processing-1.2.1/app/src/processing/app/tools/Archiver.java |
---|
516 | :info:fetch A processing-1.2.1/app/src/processing/app/tools/format |
---|
517 | :info:fetch A processing-1.2.1/app/src/processing/app/tools/format/src |
---|
518 | :info:fetch A processing-1.2.1/app/src/processing/app/tools/format/src/AutoFormat.java |
---|
519 | :info:fetch A processing-1.2.1/app/src/processing/app/tools/format/tool |
---|
520 | :info:fetch A processing-1.2.1/app/src/processing/app/tools/format/tool/jalopy.jar |
---|
521 | :info:fetch A processing-1.2.1/app/src/processing/app/tools/format/tool/log4j.jar |
---|
522 | :info:fetch A processing-1.2.1/app/src/processing/app/tools/DiscourseFormat.java |
---|
523 | :info:fetch A processing-1.2.1/app/src/processing/app/tools/CreateFont.java |
---|
524 | :info:fetch A processing-1.2.1/app/src/processing/app/tools/Uncrustify.java |
---|
525 | :info:fetch A processing-1.2.1/app/src/processing/app/tools/FixEncoding.java |
---|
526 | :info:fetch A processing-1.2.1/app/src/processing/app/tools/Tool.java |
---|
527 | :info:fetch A processing-1.2.1/app/src/processing/app/UpdateCheck.java |
---|
528 | :info:fetch A processing-1.2.1/app/src/processing/app/Sketch.java |
---|
529 | :info:fetch A processing-1.2.1/app/src/processing/app/Platform.java |
---|
530 | :info:fetch A processing-1.2.1/app/src/processing/app/PresentMode.java |
---|
531 | :info:fetch A processing-1.2.1/app/src/processing/app/Editor.java |
---|
532 | :info:fetch A processing-1.2.1/app/src/processing/app/EditorStatus.java |
---|
533 | :info:fetch A processing-1.2.1/app/src/processing/app/preproc |
---|
534 | :info:fetch A processing-1.2.1/app/src/processing/app/preproc/PdePreprocessor.java |
---|
535 | :info:fetch A processing-1.2.1/app/src/processing/app/preproc/PdeEmitter.java |
---|
536 | :info:fetch A processing-1.2.1/app/src/processing/app/preproc/PreprocessResult.java |
---|
537 | :info:fetch A processing-1.2.1/app/src/processing/app/preproc/.cvsignore |
---|
538 | :info:fetch A processing-1.2.1/app/src/processing/app/preproc/TokenUtil.java |
---|
539 | :info:fetch A processing-1.2.1/app/src/processing/app/EditorListener.java |
---|
540 | :info:fetch A processing-1.2.1/app/ParserTests.launch |
---|
541 | :info:fetch A processing-1.2.1/app/grammars |
---|
542 | :info:fetch A processing-1.2.1/app/grammars/java15.g |
---|
543 | :info:fetch A processing-1.2.1/app/grammars/pde.g |
---|
544 | :info:fetch A processing-1.2.1/app/.classpath_macosx |
---|
545 | :info:fetch A processing-1.2.1/app/build.xml |
---|
546 | :info:fetch A processing-1.2.1/app/.settings |
---|
547 | :info:fetch A processing-1.2.1/app/.settings/org.eclipse.jdt.core.prefs |
---|
548 | :info:fetch A processing-1.2.1/app/.settings/org.eclipse.jdt.ui.prefs |
---|
549 | :info:fetch A processing-1.2.1/app/generated |
---|
550 | :info:fetch A processing-1.2.1/app/generated/processing |
---|
551 | :info:fetch A processing-1.2.1/app/generated/processing/app |
---|
552 | :info:fetch A processing-1.2.1/app/generated/processing/app/antlr |
---|
553 | :info:fetch A processing-1.2.1/android |
---|
554 | :info:fetch A processing-1.2.1/android/.classpath |
---|
555 | :info:fetch A processing-1.2.1/android/done.txt |
---|
556 | :info:fetch A processing-1.2.1/android/todo.txt |
---|
557 | :info:fetch A processing-1.2.1/android/.project |
---|
558 | :info:fetch A processing-1.2.1/android/core |
---|
559 | :info:fetch A processing-1.2.1/android/core/.classpath |
---|
560 | :info:fetch A processing-1.2.1/android/core/.project |
---|
561 | :info:fetch A processing-1.2.1/android/core/src |
---|
562 | :info:fetch A processing-1.2.1/android/core/src/processing |
---|
563 | :info:fetch A processing-1.2.1/android/core/src/processing/xml |
---|
564 | :info:fetch A processing-1.2.1/android/core/src/processing/xml/XMLEntityResolver.java |
---|
565 | :info:fetch A processing-1.2.1/android/core/src/processing/xml/XMLException.java |
---|
566 | :info:fetch A processing-1.2.1/android/core/src/processing/xml/CDATAReader.java |
---|
567 | :info:fetch A processing-1.2.1/android/core/src/processing/xml/StdXMLBuilder.java |
---|
568 | :info:fetch A processing-1.2.1/android/core/src/processing/xml/XMLAttribute.java |
---|
569 | :info:fetch A processing-1.2.1/android/core/src/processing/xml/XMLValidator.java |
---|
570 | :info:fetch A processing-1.2.1/android/core/src/processing/xml/StdXMLParser.java |
---|
571 | :info:fetch A processing-1.2.1/android/core/src/processing/xml/XMLParseException.java |
---|
572 | :info:fetch A processing-1.2.1/android/core/src/processing/xml/XMLValidationException.java |
---|
573 | :info:fetch A processing-1.2.1/android/core/src/processing/xml/XMLElement.java |
---|
574 | :info:fetch A processing-1.2.1/android/core/src/processing/xml/PIReader.java |
---|
575 | :info:fetch A processing-1.2.1/android/core/src/processing/xml/ContentReader.java |
---|
576 | :info:fetch A processing-1.2.1/android/core/src/processing/xml/XMLWriter.java |
---|
577 | :info:fetch A processing-1.2.1/android/core/src/processing/xml/XMLUtil.java |
---|
578 | :info:fetch A processing-1.2.1/android/core/src/processing/xml/StdXMLReader.java |
---|
579 | :info:fetch A processing-1.2.1/android/core/src/processing/core |
---|
580 | :info:fetch A processing-1.2.1/android/core/src/processing/core/PShapeSVG.java |
---|
581 | :info:fetch A processing-1.2.1/android/core/src/processing/core/PImage.java |
---|
582 | :info:fetch A processing-1.2.1/android/core/src/processing/core/PFramebuffer.java |
---|
583 | :info:fetch A processing-1.2.1/android/core/src/processing/core/PApplet.java |
---|
584 | :info:fetch A processing-1.2.1/android/core/src/processing/core/PPolygon.java |
---|
585 | :info:fetch A processing-1.2.1/android/core/src/processing/core/PGraphicsAndroid2D.java |
---|
586 | :info:fetch A processing-1.2.1/android/core/src/processing/core/PShape3D.java |
---|
587 | :info:fetch A processing-1.2.1/android/core/src/processing/core/PGraphicsAndroid3D.java |
---|
588 | :info:fetch A processing-1.2.1/android/core/src/processing/core/PMatrix2D.java |
---|
589 | :info:fetch A processing-1.2.1/android/core/src/processing/core/PMatrix3D.java |
---|
590 | :info:fetch A processing-1.2.1/android/core/src/processing/core/PTexture.java |
---|
591 | :info:fetch A processing-1.2.1/android/core/src/processing/core/PShape.java |
---|
592 | :info:fetch A processing-1.2.1/android/core/src/processing/core/PStyle.java |
---|
593 | :info:fetch A processing-1.2.1/android/core/src/processing/core/PGraphics.java |
---|
594 | :info:fetch A processing-1.2.1/android/core/src/processing/core/PVector.java |
---|
595 | :info:fetch A processing-1.2.1/android/core/src/processing/core/PMatrix.java |
---|
596 | :info:fetch A processing-1.2.1/android/core/src/processing/core/PFont.java |
---|
597 | :info:fetch A processing-1.2.1/android/core/src/processing/core/PConstants.java |
---|
598 | :info:fetch A processing-1.2.1/android/core/.settings |
---|
599 | :info:fetch A processing-1.2.1/android/core/.settings/org.eclipse.jdt.core.prefs |
---|
600 | :info:fetch A processing-1.2.1/android/core/.settings/org.eclipse.jdt.ui.prefs |
---|
601 | :info:fetch A processing-1.2.1/android/core.zip |
---|
602 | :info:fetch A processing-1.2.1/android/tool |
---|
603 | :info:fetch A processing-1.2.1/android/tool/.classpath |
---|
604 | :info:fetch A processing-1.2.1/android/tool/.project |
---|
605 | :info:fetch A processing-1.2.1/android/tool/src |
---|
606 | :info:fetch A processing-1.2.1/android/tool/src/processing |
---|
607 | :info:fetch A processing-1.2.1/android/tool/src/processing/app |
---|
608 | :info:fetch A processing-1.2.1/android/tool/src/processing/app/tools |
---|
609 | :info:fetch A processing-1.2.1/android/tool/src/processing/app/tools/android |
---|
610 | :info:fetch A processing-1.2.1/android/tool/src/processing/app/tools/android/Build.java |
---|
611 | :info:fetch A processing-1.2.1/android/tool/src/processing/app/tools/android/AndroidDevice.java |
---|
612 | :info:fetch A processing-1.2.1/android/tool/src/processing/app/tools/android/Reset.java |
---|
613 | :info:fetch A processing-1.2.1/android/tool/src/processing/app/tools/android/AndroidSDK.java |
---|
614 | :info:fetch A processing-1.2.1/android/tool/src/processing/app/tools/android/LogEntry.java |
---|
615 | :info:fetch A processing-1.2.1/android/tool/src/processing/app/tools/android/DeviceListener.java |
---|
616 | :info:fetch A processing-1.2.1/android/tool/src/processing/app/tools/android/AndroidEnvironment.java |
---|
617 | :info:fetch A processing-1.2.1/android/tool/src/processing/app/tools/android/IndeterminateProgressMonitor.java |
---|
618 | :info:fetch A processing-1.2.1/android/tool/src/processing/app/tools/android/BadSDKException.java |
---|
619 | :info:fetch A processing-1.2.1/android/tool/src/processing/app/tools/android/AVD.java |
---|
620 | :info:fetch A processing-1.2.1/android/tool/src/processing/app/tools/android/Permissions.java |
---|
621 | :info:fetch A processing-1.2.1/android/tool/src/processing/app/tools/android/EmulatorController.java |
---|
622 | :info:fetch A processing-1.2.1/android/tool/src/processing/app/tools/android/AndroidDeviceProperties.java |
---|
623 | :info:fetch A processing-1.2.1/android/tool/src/processing/app/tools/android/AndroidTool.java |
---|
624 | :info:fetch A processing-1.2.1/android/tool/.settings |
---|
625 | :info:fetch A processing-1.2.1/android/tool/.settings/org.eclipse.jdt.core.prefs |
---|
626 | :info:fetch A processing-1.2.1/android/tool/.settings/org.eclipse.jdt.ui.prefs |
---|
627 | :info:fetch A processing-1.2.1/android/build.xml |
---|
628 | :info:fetch A processing-1.2.1/dxf |
---|
629 | :info:fetch A processing-1.2.1/dxf/.classpath |
---|
630 | :info:fetch A processing-1.2.1/dxf/library |
---|
631 | :info:fetch A processing-1.2.1/dxf/library/export.txt |
---|
632 | :info:fetch A processing-1.2.1/dxf/library/.cvsignore |
---|
633 | :info:fetch A processing-1.2.1/dxf/.project |
---|
634 | :info:fetch A processing-1.2.1/dxf/src |
---|
635 | :info:fetch A processing-1.2.1/dxf/src/processing |
---|
636 | :info:fetch A processing-1.2.1/dxf/src/processing/dxf |
---|
637 | :info:fetch A processing-1.2.1/dxf/src/processing/dxf/RawDXF.java |
---|
638 | :info:fetch A processing-1.2.1/dxf/build.xml |
---|
639 | :info:fetch A processing-1.2.1/dxf/dxfviewer.jar |
---|
640 | :info:fetch A processing-1.2.1/dxf/.settings |
---|
641 | :info:fetch A processing-1.2.1/dxf/.settings/org.eclipse.jdt.core.prefs |
---|
642 | :info:fetch A processing-1.2.1/todo.txt |
---|
643 | :info:fetch A processing-1.2.1/opengl |
---|
644 | :info:fetch A processing-1.2.1/opengl/.classpath |
---|
645 | :info:fetch A processing-1.2.1/opengl/jogl-src.zip |
---|
646 | :info:fetch A processing-1.2.1/opengl/library |
---|
647 | :info:fetch A processing-1.2.1/opengl/library/gluegen-rt.jar.pack.gz |
---|
648 | :info:fetch A processing-1.2.1/opengl/library/libgluegen-rt.so |
---|
649 | :info:fetch A processing-1.2.1/opengl/library/jogl_awt.dll |
---|
650 | :info:fetch A processing-1.2.1/opengl/library/gluegen-rt-natives-linux-i586.jar |
---|
651 | :info:fetch A processing-1.2.1/opengl/library/gluegen-rt.dll |
---|
652 | :info:fetch A processing-1.2.1/opengl/library/jogl-natives-linux-amd64.jar |
---|
653 | :info:fetch A processing-1.2.1/opengl/library/gluegen-rt.jar |
---|
654 | :info:fetch A processing-1.2.1/opengl/library/jogl-natives-macosx-ppc.jar |
---|
655 | :info:fetch A processing-1.2.1/opengl/library/libjogl.jnilib |
---|
656 | :info:fetch A processing-1.2.1/opengl/library/gluegen-rt-natives-macosx-universal.jar |
---|
657 | :info:fetch A processing-1.2.1/opengl/library/gluegen-rt-natives-windows-amd64.jar |
---|
658 | :info:fetch A processing-1.2.1/opengl/library/jogl-natives-windows-i586.jar |
---|
659 | :info:fetch A processing-1.2.1/opengl/library/export.txt |
---|
660 | :info:fetch A processing-1.2.1/opengl/library/gluegen-rt-natives-linux-amd64.jar |
---|
661 | :info:fetch A processing-1.2.1/opengl/library/libjogl_cg.jnilib |
---|
662 | :info:fetch A processing-1.2.1/opengl/library/jogl.jar.pack.gz |
---|
663 | :info:fetch A processing-1.2.1/opengl/library/libjogl.so |
---|
664 | :info:fetch A processing-1.2.1/opengl/library/gluegen-rt-natives-macosx-ppc.jar |
---|
665 | :info:fetch A processing-1.2.1/opengl/library/libjogl_awt.jnilib |
---|
666 | :info:fetch A processing-1.2.1/opengl/library/jogl-natives-linux-i586.jar |
---|
667 | :info:fetch A processing-1.2.1/opengl/library/jogl.dll |
---|
668 | :info:fetch A processing-1.2.1/opengl/library/jogl.jar |
---|
669 | :info:fetch A processing-1.2.1/opengl/library/libgluegen-rt.jnilib |
---|
670 | :info:fetch A processing-1.2.1/opengl/library/libjogl_cg.so |
---|
671 | :info:fetch A processing-1.2.1/opengl/library/jogl-natives-macosx-universal.jar |
---|
672 | :info:fetch A processing-1.2.1/opengl/library/gluegen-rt-natives-windows-i586.jar |
---|
673 | :info:fetch A processing-1.2.1/opengl/library/libjogl_awt.so |
---|
674 | :info:fetch A processing-1.2.1/opengl/library/jogl-natives-windows-amd64.jar |
---|
675 | :info:fetch A processing-1.2.1/opengl/library/jogl_cg.dll |
---|
676 | :info:fetch A processing-1.2.1/opengl/.project |
---|
677 | :info:fetch A processing-1.2.1/opengl/src |
---|
678 | :info:fetch A processing-1.2.1/opengl/src/processing |
---|
679 | :info:fetch A processing-1.2.1/opengl/src/processing/opengl |
---|
680 | :info:fetch A processing-1.2.1/opengl/src/processing/opengl/PGraphicsOpenGL.java |
---|
681 | :info:fetch A processing-1.2.1/opengl/build.xml |
---|
682 | :info:fetch A processing-1.2.1/opengl/.settings |
---|
683 | :info:fetch A processing-1.2.1/opengl/.settings/org.eclipse.jdt.core.prefs |
---|
684 | :info:fetch A processing-1.2.1/opengl/.settings/org.eclipse.jdt.ui.prefs |
---|
685 | :info:fetch A processing-1.2.1/.project |
---|
686 | :info:fetch A processing-1.2.1/net |
---|
687 | :info:fetch A processing-1.2.1/net/.classpath |
---|
688 | :info:fetch A processing-1.2.1/net/library |
---|
689 | :info:fetch A processing-1.2.1/net/library/export.txt |
---|
690 | :info:fetch A processing-1.2.1/net/library/.cvsignore |
---|
691 | :info:fetch A processing-1.2.1/net/.project |
---|
692 | :info:fetch A processing-1.2.1/net/src |
---|
693 | :info:fetch A processing-1.2.1/net/src/processing |
---|
694 | :info:fetch A processing-1.2.1/net/src/processing/net |
---|
695 | :info:fetch A processing-1.2.1/net/src/processing/net/Server.java |
---|
696 | :info:fetch A processing-1.2.1/net/src/processing/net/Client.java |
---|
697 | :info:fetch A processing-1.2.1/net/build.xml |
---|
698 | :info:fetch A processing-1.2.1/net/.settings |
---|
699 | :info:fetch A processing-1.2.1/net/.settings/org.eclipse.jdt.core.prefs |
---|
700 | :info:fetch A processing-1.2.1/net/.settings/org.eclipse.jdt.ui.prefs |
---|
701 | :info:fetch A processing-1.2.1/editor |
---|
702 | :info:fetch A processing-1.2.1/editor/org.processing.editor |
---|
703 | :info:fetch A processing-1.2.1/editor/org.processing.editor/META-INF |
---|
704 | :info:fetch A processing-1.2.1/editor/org.processing.editor/META-INF/MANIFEST.MF |
---|
705 | :info:fetch A processing-1.2.1/editor/org.processing.editor/schema |
---|
706 | :info:fetch A processing-1.2.1/editor/org.processing.editor/.classpath |
---|
707 | :info:fetch A processing-1.2.1/editor/org.processing.editor/.project |
---|
708 | :info:fetch A processing-1.2.1/editor/org.processing.editor/keywords.txt |
---|
709 | :info:fetch A processing-1.2.1/editor/org.processing.editor/src |
---|
710 | :info:fetch A processing-1.2.1/editor/org.processing.editor/src/org |
---|
711 | :info:fetch A processing-1.2.1/editor/org.processing.editor/src/org/processing |
---|
712 | :info:fetch A processing-1.2.1/editor/org.processing.editor/src/org/processing/actions |
---|
713 | :info:fetch A processing-1.2.1/editor/org.processing.editor/src/org/processing/actions/RunButton.java |
---|
714 | :info:fetch A processing-1.2.1/editor/org.processing.editor/src/org/processing/preferences |
---|
715 | :info:fetch A processing-1.2.1/editor/org.processing.editor/src/org/processing/preferences/PreferenceInitializer.java |
---|
716 | :info:fetch A processing-1.2.1/editor/org.processing.editor/src/org/processing/preferences/PreferenceConstants.java |
---|
717 | :info:fetch A processing-1.2.1/editor/org.processing.editor/src/org/processing/preferences/ProcessingPreferencesPage.java |
---|
718 | :info:fetch A processing-1.2.1/editor/org.processing.editor/src/org/processing/editor |
---|
719 | :info:fetch A processing-1.2.1/editor/org.processing.editor/src/org/processing/editor/ProcessingEditorPlugin.java |
---|
720 | :info:fetch A processing-1.2.1/editor/org.processing.editor/src/org/processing/editor/language |
---|
721 | :info:fetch A processing-1.2.1/editor/org.processing.editor/src/org/processing/editor/language/ProcessingCodeScanner.java |
---|
722 | :info:fetch A processing-1.2.1/editor/org.processing.editor/src/org/processing/editor/language/ProcessingCompletionProcessor.java |
---|
723 | :info:fetch A processing-1.2.1/editor/org.processing.editor/src/org/processing/editor/language/ProcessingAutoIndentStrategy.java |
---|
724 | :info:fetch A processing-1.2.1/editor/org.processing.editor/src/org/processing/editor/language/ProcessingEditorMessages.java |
---|
725 | :info:fetch A processing-1.2.1/editor/org.processing.editor/src/org/processing/editor/language/ProcessingDoubleClickSelector.java |
---|
726 | :info:fetch A processing-1.2.1/editor/org.processing.editor/src/org/processing/editor/ProcessingContentOutlinePage.java |
---|
727 | :info:fetch A processing-1.2.1/editor/org.processing.editor/src/org/processing/editor/ProcessingActionContributor.java |
---|
728 | :info:fetch A processing-1.2.1/editor/org.processing.editor/src/org/processing/editor/ProcessingSourceViewerConfiguration.java |
---|
729 | :info:fetch A processing-1.2.1/editor/org.processing.editor/src/org/processing/editor/PresentationAction.java |
---|
730 | :info:fetch A processing-1.2.1/editor/org.processing.editor/src/org/processing/editor/ProcessingEditorMessages.java |
---|
731 | :info:fetch A processing-1.2.1/editor/org.processing.editor/src/org/processing/editor/ProcessingAnnotationHover.java |
---|
732 | :info:fetch A processing-1.2.1/editor/org.processing.editor/src/org/processing/editor/ProcessingLog.java |
---|
733 | :info:fetch A processing-1.2.1/editor/org.processing.editor/src/org/processing/editor/ProcessingPartitionScanner.java |
---|
734 | :info:fetch A processing-1.2.1/editor/org.processing.editor/src/org/processing/editor/ProcessingEditor.java |
---|
735 | :info:fetch A processing-1.2.1/editor/org.processing.editor/src/org/processing/editor/ProcessingTextHover.java |
---|
736 | :info:fetch A processing-1.2.1/editor/org.processing.editor/src/org/processing/editor/ProcessingEditorMessages.properties |
---|
737 | :info:fetch A processing-1.2.1/editor/org.processing.editor/src/org/processing/editor/javadoc |
---|
738 | :info:fetch A processing-1.2.1/editor/org.processing.editor/src/org/processing/editor/javadoc/JavaDocCompletionProcessor.java |
---|
739 | :info:fetch A processing-1.2.1/editor/org.processing.editor/src/org/processing/editor/javadoc/JavaDocScanner.java |
---|
740 | :info:fetch A processing-1.2.1/editor/org.processing.editor/src/org/processing/editor/ProcessingDocumentSetupParticipant.java |
---|
741 | :info:fetch A processing-1.2.1/editor/org.processing.editor/src/org/processing/editor/util |
---|
742 | :info:fetch A processing-1.2.1/editor/org.processing.editor/src/org/processing/editor/util/ProcessingWordDetector.java |
---|
743 | :info:fetch A processing-1.2.1/editor/org.processing.editor/src/org/processing/editor/util/ProcessingWhitespaceDetector.java |
---|
744 | :info:fetch A processing-1.2.1/editor/org.processing.editor/src/org/processing/editor/util/ProcessingColorProvider.java |
---|
745 | :info:fetch A processing-1.2.1/editor/org.processing.editor/bin |
---|
746 | :info:fetch A processing-1.2.1/editor/org.processing.editor/bin/org |
---|
747 | :info:fetch A processing-1.2.1/editor/org.processing.editor/bin/org/processing |
---|
748 | :info:fetch A processing-1.2.1/editor/org.processing.editor/bin/org/processing/preferences |
---|
749 | :info:fetch A processing-1.2.1/editor/org.processing.editor/bin/org/processing/preferences/ProcessingPreferencesPage.class |
---|
750 | :info:fetch A processing-1.2.1/editor/org.processing.editor/bin/org/processing/preferences/PreferenceConstants.class |
---|
751 | :info:fetch A processing-1.2.1/editor/org.processing.editor/bin/org/processing/preferences/PreferenceInitializer.class |
---|
752 | :info:fetch A processing-1.2.1/editor/org.processing.editor/bin/org/processing/editor |
---|
753 | :info:fetch A processing-1.2.1/editor/org.processing.editor/bin/org/processing/editor/ProcessingEditorMessages.class |
---|
754 | :info:fetch A processing-1.2.1/editor/org.processing.editor/bin/org/processing/editor/ProcessingAnnotationHover.class |
---|
755 | :info:fetch A processing-1.2.1/editor/org.processing.editor/bin/org/processing/editor/ProcessingContentOutlinePage$ContentProvider.class |
---|
756 | :info:fetch A processing-1.2.1/editor/org.processing.editor/bin/org/processing/editor/language |
---|
757 | :info:fetch A processing-1.2.1/editor/org.processing.editor/bin/org/processing/editor/language/ProcessingEditorMessages.class |
---|
758 | :info:fetch A processing-1.2.1/editor/org.processing.editor/bin/org/processing/editor/language/ProcessingDoubleClickSelector.class |
---|
759 | :info:fetch A processing-1.2.1/editor/org.processing.editor/bin/org/processing/editor/language/ProcessingCompletionProcessor$Validator.class |
---|
760 | :info:fetch A processing-1.2.1/editor/org.processing.editor/bin/org/processing/editor/language/ProcessingCodeScanner.class |
---|
761 | :info:fetch A processing-1.2.1/editor/org.processing.editor/bin/org/processing/editor/language/ProcessingCompletionProcessor.class |
---|
762 | :info:fetch A processing-1.2.1/editor/org.processing.editor/bin/org/processing/editor/language/ProcessingAutoIndentStrategy.class |
---|
763 | :info:fetch A processing-1.2.1/editor/org.processing.editor/bin/org/processing/editor/ProcessingPartitionScanner$EmptyCommentDetector.class |
---|
764 | :info:fetch A processing-1.2.1/editor/org.processing.editor/bin/org/processing/editor/ProcessingPartitionScanner.class |
---|
765 | :info:fetch A processing-1.2.1/editor/org.processing.editor/bin/org/processing/editor/ProcessingEditor.class |
---|
766 | :info:fetch A processing-1.2.1/editor/org.processing.editor/bin/org/processing/editor/ProcessingTextHover.class |
---|
767 | :info:fetch A processing-1.2.1/editor/org.processing.editor/bin/org/processing/editor/ProcessingSourceViewerConfiguration$SingleTokenScanner.class |
---|
768 | :info:fetch A processing-1.2.1/editor/org.processing.editor/bin/org/processing/editor/ProcessingPartitionScanner$WordPredicateRule.class |
---|
769 | :info:fetch A processing-1.2.1/editor/org.processing.editor/bin/org/processing/editor/ProcessingDocumentSetupParticipant.class |
---|
770 | :info:fetch A processing-1.2.1/editor/org.processing.editor/bin/org/processing/editor/ProcessingContentOutlinePage$Segment.class |
---|
771 | :info:fetch A processing-1.2.1/editor/org.processing.editor/bin/org/processing/editor/ProcessingEditorMessages.properties |
---|
772 | :info:fetch A processing-1.2.1/editor/org.processing.editor/bin/org/processing/editor/ProcessingEditorPlugin.class |
---|
773 | :info:fetch A processing-1.2.1/editor/org.processing.editor/bin/org/processing/editor/javadoc |
---|
774 | :info:fetch A processing-1.2.1/editor/org.processing.editor/bin/org/processing/editor/javadoc/JavaDocCompletionProcessor.class |
---|
775 | :info:fetch A processing-1.2.1/editor/org.processing.editor/bin/org/processing/editor/javadoc/JavaDocScanner.class |
---|
776 | :info:fetch A processing-1.2.1/editor/org.processing.editor/bin/org/processing/editor/javadoc/JavaDocScanner$JavaDocWordDetector.class |
---|
777 | :info:fetch A processing-1.2.1/editor/org.processing.editor/bin/org/processing/editor/ProcessingContentOutlinePage.class |
---|
778 | :info:fetch A processing-1.2.1/editor/org.processing.editor/bin/org/processing/editor/ProcessingActionContributor.class |
---|
779 | :info:fetch A processing-1.2.1/editor/org.processing.editor/bin/org/processing/editor/ProcessingSourceViewerConfiguration.class |
---|
780 | :info:fetch A processing-1.2.1/editor/org.processing.editor/bin/org/processing/editor/ProcessingEditor$DefineFoldingRegionAction.class |
---|
781 | :info:fetch A processing-1.2.1/editor/org.processing.editor/bin/org/processing/editor/util |
---|
782 | :info:fetch A processing-1.2.1/editor/org.processing.editor/bin/org/processing/editor/util/ProcessingWordDetector.class |
---|
783 | :info:fetch A processing-1.2.1/editor/org.processing.editor/bin/org/processing/editor/util/ProcessingWhitespaceDetector.class |
---|
784 | :info:fetch A processing-1.2.1/editor/org.processing.editor/bin/org/processing/editor/util/ProcessingColorProvider.class |
---|
785 | :info:fetch A processing-1.2.1/editor/org.processing.editor/bin/org/processing/editor/PresentationAction.class |
---|
786 | :info:fetch A processing-1.2.1/editor/org.processing.editor/libs |
---|
787 | :info:fetch A processing-1.2.1/editor/org.processing.editor/libs/pde.jar |
---|
788 | :info:fetch A processing-1.2.1/editor/org.processing.editor/libs/jna.jar |
---|
789 | :info:fetch A processing-1.2.1/editor/org.processing.editor/libs/core.jar |
---|
790 | :info:fetch A processing-1.2.1/editor/org.processing.editor/libs/antlr.jar |
---|
791 | :info:fetch A processing-1.2.1/editor/org.processing.editor/libs/ant-launcher.jar |
---|
792 | :info:fetch A processing-1.2.1/editor/org.processing.editor/libs/ecj.jar |
---|
793 | :info:fetch A processing-1.2.1/editor/org.processing.editor/libs/ant.jar |
---|
794 | :info:fetch A processing-1.2.1/editor/org.processing.editor/build.properties |
---|
795 | :info:fetch A processing-1.2.1/editor/org.processing.editor/icons |
---|
796 | :info:fetch A processing-1.2.1/editor/org.processing.editor/icons/processing.gif |
---|
797 | :info:fetch A processing-1.2.1/editor/org.processing.editor/plugin.xml |
---|
798 | :info:fetch A processing-1.2.1/editor/org.processing.editor/.settings |
---|
799 | :info:fetch A processing-1.2.1/editor/org.processing.editor/.settings/org.eclipse.jdt.core.prefs |
---|
800 | :info:fetch A processing-1.2.1/core |
---|
801 | :info:fetch A processing-1.2.1/core/license.txt |
---|
802 | :info:fetch A processing-1.2.1/core/.classpath |
---|
803 | :info:fetch A processing-1.2.1/core/done.txt |
---|
804 | :info:fetch A processing-1.2.1/core/todo.txt |
---|
805 | :info:fetch A processing-1.2.1/core/methods |
---|
806 | :info:fetch A processing-1.2.1/core/methods/.classpath |
---|
807 | :info:fetch A processing-1.2.1/core/methods/demo |
---|
808 | :info:fetch A processing-1.2.1/core/methods/demo/PGraphics.java |
---|
809 | :info:fetch A processing-1.2.1/core/methods/demo/PImage.java |
---|
810 | :info:fetch A processing-1.2.1/core/methods/demo/PApplet.java |
---|
811 | :info:fetch A processing-1.2.1/core/methods/.project |
---|
812 | :info:fetch A processing-1.2.1/core/methods/src |
---|
813 | :info:fetch A processing-1.2.1/core/methods/src/PAppletMethods.java |
---|
814 | :info:fetch A processing-1.2.1/core/methods/build.xml |
---|
815 | :info:fetch A processing-1.2.1/core/methods/methods.jar |
---|
816 | :info:fetch A processing-1.2.1/core/.project |
---|
817 | :info:fetch A processing-1.2.1/core/make.sh |
---|
818 | :info:fetch A processing-1.2.1/core/src |
---|
819 | :info:fetch A processing-1.2.1/core/src/processing |
---|
820 | :info:fetch A processing-1.2.1/core/src/processing/xml |
---|
821 | :info:fetch A processing-1.2.1/core/src/processing/xml/XMLEntityResolver.java |
---|
822 | :info:fetch A processing-1.2.1/core/src/processing/xml/XMLException.java |
---|
823 | :info:fetch A processing-1.2.1/core/src/processing/xml/CDATAReader.java |
---|
824 | :info:fetch A processing-1.2.1/core/src/processing/xml/StdXMLBuilder.java |
---|
825 | :info:fetch A processing-1.2.1/core/src/processing/xml/XMLAttribute.java |
---|
826 | :info:fetch A processing-1.2.1/core/src/processing/xml/XMLValidator.java |
---|
827 | :info:fetch A processing-1.2.1/core/src/processing/xml/StdXMLParser.java |
---|
828 | :info:fetch A processing-1.2.1/core/src/processing/xml/XMLParseException.java |
---|
829 | :info:fetch A processing-1.2.1/core/src/processing/xml/XMLValidationException.java |
---|
830 | :info:fetch A processing-1.2.1/core/src/processing/xml/XMLElement.java |
---|
831 | :info:fetch A processing-1.2.1/core/src/processing/xml/PIReader.java |
---|
832 | :info:fetch A processing-1.2.1/core/src/processing/xml/ContentReader.java |
---|
833 | :info:fetch A processing-1.2.1/core/src/processing/xml/XMLWriter.java |
---|
834 | :info:fetch A processing-1.2.1/core/src/processing/xml/XMLUtil.java |
---|
835 | :info:fetch A processing-1.2.1/core/src/processing/xml/StdXMLReader.java |
---|
836 | :info:fetch A processing-1.2.1/core/src/processing/core |
---|
837 | :info:fetch A processing-1.2.1/core/src/processing/core/PShapeSVG.java |
---|
838 | :info:fetch A processing-1.2.1/core/src/processing/core/PImage.java |
---|
839 | :info:fetch A processing-1.2.1/core/src/processing/core/PApplet.java |
---|
840 | :info:fetch A processing-1.2.1/core/src/processing/core/PGraphics2D.java |
---|
841 | :info:fetch A processing-1.2.1/core/src/processing/core/PGraphics3D.java |
---|
842 | :info:fetch A processing-1.2.1/core/src/processing/core/PPolygon.java |
---|
843 | :info:fetch A processing-1.2.1/core/src/processing/core/PLine.java |
---|
844 | :info:fetch A processing-1.2.1/core/src/processing/core/PGraphicsJava2D.java |
---|
845 | :info:fetch A processing-1.2.1/core/src/processing/core/PMatrix2D.java |
---|
846 | :info:fetch A processing-1.2.1/core/src/processing/core/PMatrix3D.java |
---|
847 | :info:fetch A processing-1.2.1/core/src/processing/core/PSmoothTriangle.java |
---|
848 | :info:fetch A processing-1.2.1/core/src/processing/core/PShape.java |
---|
849 | :info:fetch A processing-1.2.1/core/src/processing/core/PStyle.java |
---|
850 | :info:fetch A processing-1.2.1/core/src/processing/core/PGraphics.java |
---|
851 | :info:fetch A processing-1.2.1/core/src/processing/core/PVector.java |
---|
852 | :info:fetch A processing-1.2.1/core/src/processing/core/PMatrix.java |
---|
853 | :info:fetch A processing-1.2.1/core/src/processing/core/PTriangle.java |
---|
854 | :info:fetch A processing-1.2.1/core/src/processing/core/PFont.java |
---|
855 | :info:fetch A processing-1.2.1/core/src/processing/core/PConstants.java |
---|
856 | :info:fetch A processing-1.2.1/core/api.txt |
---|
857 | :info:fetch A processing-1.2.1/core/build.xml |
---|
858 | :info:fetch A processing-1.2.1/core/.settings |
---|
859 | :info:fetch A processing-1.2.1/core/.settings/org.eclipse.jdt.core.prefs |
---|
860 | :info:fetch A processing-1.2.1/core/.settings/org.eclipse.jdt.ui.prefs |
---|
861 | :info:fetch A processing-1.2.1/future.txt |
---|
862 | :info:fetch A processing-1.2.1/build |
---|
863 | :info:fetch A processing-1.2.1/build/linux |
---|
864 | :info:fetch A processing-1.2.1/build/linux/processing |
---|
865 | :info:fetch A processing-1.2.1/build/googlecode_upload.py |
---|
866 | :info:fetch A processing-1.2.1/build/formatter.xml |
---|
867 | :info:fetch A processing-1.2.1/build/cmd |
---|
868 | :info:fetch A processing-1.2.1/build/cmd/dist |
---|
869 | :info:fetch A processing-1.2.1/build/cmd/dist/processing |
---|
870 | :info:fetch A processing-1.2.1/build/cmd/dist.sh |
---|
871 | :info:fetch A processing-1.2.1/build/shared |
---|
872 | :info:fetch A processing-1.2.1/build/shared/examples.zip |
---|
873 | :info:fetch A processing-1.2.1/build/shared/revisions.txt |
---|
874 | :info:fetch A processing-1.2.1/build/shared/reference.zip |
---|
875 | :info:fetch A processing-1.2.1/build/shared/tools |
---|
876 | :info:fetch A processing-1.2.1/build/shared/tools/Mangler |
---|
877 | :info:fetch A processing-1.2.1/build/shared/tools/Mangler/make.sh |
---|
878 | :info:fetch A processing-1.2.1/build/shared/tools/Mangler/src |
---|
879 | :info:fetch A processing-1.2.1/build/shared/tools/Mangler/src/Mangler.java |
---|
880 | :info:fetch A processing-1.2.1/build/shared/tools/Mangler/bin |
---|
881 | :info:fetch A processing-1.2.1/build/shared/tools/Mangler/tool |
---|
882 | :info:fetch A processing-1.2.1/build/shared/tools/howto.txt |
---|
883 | :info:fetch A processing-1.2.1/build/shared/lib |
---|
884 | :info:fetch A processing-1.2.1/build/shared/lib/preferences.txt |
---|
885 | :info:fetch A processing-1.2.1/build/shared/lib/export |
---|
886 | :info:fetch A processing-1.2.1/build/shared/lib/export/loading.gif |
---|
887 | :info:fetch A processing-1.2.1/build/shared/lib/export/application.exe |
---|
888 | :info:fetch A processing-1.2.1/build/shared/lib/export/skeleton.app |
---|
889 | :info:fetch A processing-1.2.1/build/shared/lib/export/skeleton.app/Contents |
---|
890 | :info:fetch A processing-1.2.1/build/shared/lib/export/skeleton.app/Contents/MacOS |
---|
891 | :info:fetch A processing-1.2.1/build/shared/lib/export/skeleton.app/Contents/MacOS/JavaApplicationStub |
---|
892 | :info:fetch A processing-1.2.1/build/shared/lib/export/skeleton.app/Contents/MacOS/JavaApplicationStub64 |
---|
893 | :info:fetch A processing-1.2.1/build/shared/lib/export/skeleton.app/Contents/Resources |
---|
894 | :info:fetch A processing-1.2.1/build/shared/lib/export/skeleton.app/Contents/Resources/Java |
---|
895 | :info:fetch A processing-1.2.1/build/shared/lib/export/skeleton.app/Contents/Resources/sketch.icns |
---|
896 | :info:fetch A processing-1.2.1/build/shared/lib/export/skeleton.app/Contents/PkgInfo |
---|
897 | :info:fetch A processing-1.2.1/build/shared/lib/export/template.plist |
---|
898 | :info:fetch A processing-1.2.1/build/shared/lib/export/applet.html |
---|
899 | :info:fetch A processing-1.2.1/build/shared/lib/export/applet-opengl.html |
---|
900 | :info:fetch A processing-1.2.1/build/shared/lib/theme |
---|
901 | :info:fetch A processing-1.2.1/build/shared/lib/theme/theme.txt |
---|
902 | :info:fetch A processing-1.2.1/build/shared/lib/theme/tab-unsel-menu.gif |
---|
903 | :info:fetch A processing-1.2.1/build/shared/lib/theme/buttons.gif |
---|
904 | :info:fetch A processing-1.2.1/build/shared/lib/theme/tab-sel-mid.gif |
---|
905 | :info:fetch A processing-1.2.1/build/shared/lib/theme/tab-sel-left.gif |
---|
906 | :info:fetch A processing-1.2.1/build/shared/lib/theme/resize.gif |
---|
907 | :info:fetch A processing-1.2.1/build/shared/lib/theme/tab-unsel-mid.gif |
---|
908 | :info:fetch A processing-1.2.1/build/shared/lib/theme/tab-unsel-left.gif |
---|
909 | :info:fetch A processing-1.2.1/build/shared/lib/theme/tab-sel-right.gif |
---|
910 | :info:fetch A processing-1.2.1/build/shared/lib/theme/tab-unsel-right.gif |
---|
911 | :info:fetch A processing-1.2.1/build/shared/lib/theme/tab-sel-menu.gif |
---|
912 | :info:fetch A processing-1.2.1/build/shared/lib/keywords.txt |
---|
913 | :info:fetch A processing-1.2.1/build/shared/lib/about.jpg |
---|
914 | :info:fetch A processing-1.2.1/build/shared/libraries |
---|
915 | :info:fetch A processing-1.2.1/build/shared/libraries/javascript |
---|
916 | :info:fetch A processing-1.2.1/build/shared/libraries/javascript/library |
---|
917 | :info:fetch A processing-1.2.1/build/shared/libraries/javascript/library/export.txt |
---|
918 | :info:fetch A processing-1.2.1/build/shared/libraries/javascript/library/javascript.jar |
---|
919 | :info:fetch A processing-1.2.1/build/shared/libraries/minim |
---|
920 | :info:fetch A processing-1.2.1/build/shared/libraries/minim/license.txt |
---|
921 | :info:fetch A processing-1.2.1/build/shared/libraries/minim/version.txt |
---|
922 | :info:fetch A processing-1.2.1/build/shared/libraries/minim/library |
---|
923 | :info:fetch A processing-1.2.1/build/shared/libraries/minim/library/jl1.0.jar |
---|
924 | :info:fetch A processing-1.2.1/build/shared/libraries/minim/library/export.txt |
---|
925 | :info:fetch A processing-1.2.1/build/shared/libraries/minim/library/mp3spi1.9.4.jar |
---|
926 | :info:fetch A processing-1.2.1/build/shared/libraries/minim/library/jsminim.jar |
---|
927 | :info:fetch A processing-1.2.1/build/shared/libraries/minim/library/tritonus_share.jar |
---|
928 | :info:fetch A processing-1.2.1/build/shared/libraries/minim/library/minim.jar |
---|
929 | :info:fetch A processing-1.2.1/build/shared/libraries/minim/library/tritonus_aos.jar |
---|
930 | :info:fetch A processing-1.2.1/build/shared/libraries/minim/library/minim-spi.jar |
---|
931 | :info:fetch A processing-1.2.1/build/shared/libraries/minim/changelog.txt |
---|
932 | :info:fetch A processing-1.2.1/build/shared/libraries/howto.txt |
---|
933 | :info:fetch A processing-1.2.1/build/javadoc |
---|
934 | :info:fetch A processing-1.2.1/build/javadoc/stylesheet.css |
---|
935 | :info:fetch A processing-1.2.1/build/javadoc/everything |
---|
936 | :info:fetch A processing-1.2.1/build/javadoc/everything/stylesheet.css |
---|
937 | :info:fetch A processing-1.2.1/build/javadoc/everything/antlr |
---|
938 | :info:fetch A processing-1.2.1/build/javadoc/everything/antlr/ExtendedCommonASTWithHiddenTokens.html |
---|
939 | :info:fetch A processing-1.2.1/build/javadoc/everything/antlr/package-frame.html |
---|
940 | :info:fetch A processing-1.2.1/build/javadoc/everything/antlr/package-summary.html |
---|
941 | :info:fetch A processing-1.2.1/build/javadoc/everything/antlr/TokenStreamCopyingHiddenTokenFilter.html |
---|
942 | :info:fetch A processing-1.2.1/build/javadoc/everything/antlr/package-tree.html |
---|
943 | :info:fetch A processing-1.2.1/build/javadoc/everything/index-all.html |
---|
944 | :info:fetch A processing-1.2.1/build/javadoc/everything/allclasses-frame.html |
---|
945 | :info:fetch A processing-1.2.1/build/javadoc/everything/constant-values.html |
---|
946 | :info:fetch A processing-1.2.1/build/javadoc/everything/help-doc.html |
---|
947 | :info:fetch A processing-1.2.1/build/javadoc/everything/serialized-form.html |
---|
948 | :info:fetch A processing-1.2.1/build/javadoc/everything/overview-frame.html |
---|
949 | :info:fetch A processing-1.2.1/build/javadoc/everything/package-list |
---|
950 | :info:fetch A processing-1.2.1/build/javadoc/everything/overview-summary.html |
---|
951 | :info:fetch A processing-1.2.1/build/javadoc/everything/overview-tree.html |
---|
952 | :info:fetch A processing-1.2.1/build/javadoc/everything/index.html |
---|
953 | :info:fetch A processing-1.2.1/build/javadoc/everything/resources |
---|
954 | :info:fetch A processing-1.2.1/build/javadoc/everything/resources/inherit.gif |
---|
955 | :info:fetch A processing-1.2.1/build/javadoc/everything/processing |
---|
956 | :info:fetch A processing-1.2.1/build/javadoc/everything/processing/serial |
---|
957 | :info:fetch A processing-1.2.1/build/javadoc/everything/processing/serial/Serial.html |
---|
958 | :info:fetch A processing-1.2.1/build/javadoc/everything/processing/serial/package-frame.html |
---|
959 | :info:fetch A processing-1.2.1/build/javadoc/everything/processing/serial/package-summary.html |
---|
960 | :info:fetch A processing-1.2.1/build/javadoc/everything/processing/serial/package-tree.html |
---|
961 | :info:fetch A processing-1.2.1/build/javadoc/everything/processing/app |
---|
962 | :info:fetch A processing-1.2.1/build/javadoc/everything/processing/app/SketchCode.html |
---|
963 | :info:fetch A processing-1.2.1/build/javadoc/everything/processing/app/FindReplace.html |
---|
964 | :info:fetch A processing-1.2.1/build/javadoc/everything/processing/app/UpdateCheck.html |
---|
965 | :info:fetch A processing-1.2.1/build/javadoc/everything/processing/app/Sketch.html |
---|
966 | :info:fetch A processing-1.2.1/build/javadoc/everything/processing/app/debug |
---|
967 | :info:fetch A processing-1.2.1/build/javadoc/everything/processing/app/debug/SystemOutSiphon.html |
---|
968 | :info:fetch A processing-1.2.1/build/javadoc/everything/processing/app/debug/RunnerListener.html |
---|
969 | :info:fetch A processing-1.2.1/build/javadoc/everything/processing/app/debug/MessageConsumer.html |
---|
970 | :info:fetch A processing-1.2.1/build/javadoc/everything/processing/app/debug/package-frame.html |
---|
971 | :info:fetch A processing-1.2.1/build/javadoc/everything/processing/app/debug/MessageSiphon.html |
---|
972 | :info:fetch A processing-1.2.1/build/javadoc/everything/processing/app/debug/package-summary.html |
---|
973 | :info:fetch A processing-1.2.1/build/javadoc/everything/processing/app/debug/RunnerException.html |
---|
974 | :info:fetch A processing-1.2.1/build/javadoc/everything/processing/app/debug/package-tree.html |
---|
975 | :info:fetch A processing-1.2.1/build/javadoc/everything/processing/app/debug/EventThread.html |
---|
976 | :info:fetch A processing-1.2.1/build/javadoc/everything/processing/app/debug/Runner.html |
---|
977 | :info:fetch A processing-1.2.1/build/javadoc/everything/processing/app/debug/Compiler.html |
---|
978 | :info:fetch A processing-1.2.1/build/javadoc/everything/processing/app/Platform.html |
---|
979 | :info:fetch A processing-1.2.1/build/javadoc/everything/processing/app/windows |
---|
980 | :info:fetch A processing-1.2.1/build/javadoc/everything/processing/app/windows/Advapi32.SERVICE_MAIN_FUNCTION.html |
---|
981 | :info:fetch A processing-1.2.1/build/javadoc/everything/processing/app/windows/Advapi32.HandlerEx.html |
---|
982 | :info:fetch A processing-1.2.1/build/javadoc/everything/processing/app/windows/package-frame.html |
---|
983 | :info:fetch A processing-1.2.1/build/javadoc/everything/processing/app/windows/Platform.html |
---|
984 | :info:fetch A processing-1.2.1/build/javadoc/everything/processing/app/windows/Advapi32.Handler.html |
---|
985 | :info:fetch A processing-1.2.1/build/javadoc/everything/processing/app/windows/WINBASE.FILETIME.html |
---|
986 | :info:fetch A processing-1.2.1/build/javadoc/everything/processing/app/windows/package-summary.html |
---|
987 | :info:fetch A processing-1.2.1/build/javadoc/everything/processing/app/windows/WINBASE.html |
---|
988 | :info:fetch A processing-1.2.1/build/javadoc/everything/processing/app/windows/package-tree.html |
---|
989 | :info:fetch A processing-1.2.1/build/javadoc/everything/processing/app/windows/Registry.REGISTRY_ROOT_KEY.html |
---|
990 | :info:fetch A processing-1.2.1/build/javadoc/everything/processing/app/windows/Options.html |
---|
991 | :info:fetch A processing-1.2.1/build/javadoc/everything/processing/app/windows/WINREG.html |
---|
992 | :info:fetch A processing-1.2.1/build/javadoc/everything/processing/app/windows/WINNT.html |
---|
993 | :info:fetch A processing-1.2.1/build/javadoc/everything/processing/app/windows/Advapi32.SERVICE_TABLE_ENTRY.html |
---|
994 | :info:fetch A processing-1.2.1/build/javadoc/everything/processing/app/windows/Advapi32.ChangeServiceConfig2Info.html |
---|
995 | :info:fetch A processing-1.2.1/build/javadoc/everything/processing/app/windows/WINBASE.SECURITY_ATTRIBUTES.html |
---|
996 | :info:fetch A processing-1.2.1/build/javadoc/everything/processing/app/windows/WINERROR.html |
---|
997 | :info:fetch A processing-1.2.1/build/javadoc/everything/processing/app/windows/Registry.html |
---|
998 | :info:fetch A processing-1.2.1/build/javadoc/everything/processing/app/windows/Advapi32.html |
---|
999 | :info:fetch A processing-1.2.1/build/javadoc/everything/processing/app/windows/Platform.WinLibC.html |
---|
1000 | :info:fetch A processing-1.2.1/build/javadoc/everything/processing/app/windows/Advapi32.SERVICE_STATUS.html |
---|
1001 | :info:fetch A processing-1.2.1/build/javadoc/everything/processing/app/windows/Advapi32.SERVICE_DESCRIPTION.html |
---|
1002 | :info:fetch A processing-1.2.1/build/javadoc/everything/processing/app/package-tree.html |
---|
1003 | :info:fetch A processing-1.2.1/build/javadoc/everything/processing/app/EditorStatus.html |
---|
1004 | :info:fetch A processing-1.2.1/build/javadoc/everything/processing/app/EditorListener.html |
---|
1005 | :info:fetch A processing-1.2.1/build/javadoc/everything/processing/app/tools |
---|
1006 | :info:fetch A processing-1.2.1/build/javadoc/everything/processing/app/tools/FixEncoding.html |
---|
1007 | :info:fetch A processing-1.2.1/build/javadoc/everything/processing/app/tools/Tool.html |
---|
1008 | :info:fetch A processing-1.2.1/build/javadoc/everything/processing/app/tools/ColorSelector.ColorSlider.html |
---|
1009 | :info:fetch A processing-1.2.1/build/javadoc/everything/processing/app/tools/AutoFormatTool.html |
---|
1010 | :info:fetch A processing-1.2.1/build/javadoc/everything/processing/app/tools/ColorSelector.html |
---|
1011 | :info:fetch A processing-1.2.1/build/javadoc/everything/processing/app/tools/package-frame.html |
---|
1012 | :info:fetch A processing-1.2.1/build/javadoc/everything/processing/app/tools/Archiver.html |
---|
1013 | :info:fetch A processing-1.2.1/build/javadoc/everything/processing/app/tools/package-summary.html |
---|
1014 | :info:fetch A processing-1.2.1/build/javadoc/everything/processing/app/tools/package-tree.html |
---|
1015 | :info:fetch A processing-1.2.1/build/javadoc/everything/processing/app/tools/DiscourseFormat.html |
---|
1016 | :info:fetch A processing-1.2.1/build/javadoc/everything/processing/app/tools/ColorSelector.ColorRange.html |
---|
1017 | :info:fetch A processing-1.2.1/build/javadoc/everything/processing/app/tools/CreateFont.html |
---|
1018 | :info:fetch A processing-1.2.1/build/javadoc/everything/processing/app/tools/Uncrustify.html |
---|
1019 | :info:fetch A processing-1.2.1/build/javadoc/everything/processing/app/EditorHeader.html |
---|
1020 | :info:fetch A processing-1.2.1/build/javadoc/everything/processing/app/LibraryFolder.html |
---|
1021 | :info:fetch A processing-1.2.1/build/javadoc/everything/processing/app/Preferences.html |
---|
1022 | :info:fetch A processing-1.2.1/build/javadoc/everything/processing/app/EditorLineStatus.html |
---|
1023 | :info:fetch A processing-1.2.1/build/javadoc/everything/processing/app/WebServer.html |
---|
1024 | :info:fetch A processing-1.2.1/build/javadoc/everything/processing/app/preproc |
---|
1025 | :info:fetch A processing-1.2.1/build/javadoc/everything/processing/app/preproc/TokenUtil.html |
---|
1026 | :info:fetch A processing-1.2.1/build/javadoc/everything/processing/app/preproc/PdePreprocessor.html |
---|
1027 | :info:fetch A processing-1.2.1/build/javadoc/everything/processing/app/preproc/PdeEmitter.html |
---|
1028 | :info:fetch A processing-1.2.1/build/javadoc/everything/processing/app/preproc/PdePreprocessor.Mode.html |
---|
1029 | :info:fetch A processing-1.2.1/build/javadoc/everything/processing/app/preproc/package-frame.html |
---|
1030 | :info:fetch A processing-1.2.1/build/javadoc/everything/processing/app/preproc/PreprocessResult.html |
---|
1031 | :info:fetch A processing-1.2.1/build/javadoc/everything/processing/app/preproc/package-summary.html |
---|
1032 | :info:fetch A processing-1.2.1/build/javadoc/everything/processing/app/preproc/package-tree.html |
---|
1033 | :info:fetch A processing-1.2.1/build/javadoc/everything/processing/app/antlr |
---|
1034 | :info:fetch A processing-1.2.1/build/javadoc/everything/processing/app/antlr/PdeTokenTypes.html |
---|
1035 | :info:fetch A processing-1.2.1/build/javadoc/everything/processing/app/antlr/PdeRecognizer.html |
---|
1036 | :info:fetch A processing-1.2.1/build/javadoc/everything/processing/app/antlr/JavaLexer.html |
---|
1037 | :info:fetch A processing-1.2.1/build/javadoc/everything/processing/app/antlr/package-frame.html |
---|
1038 | :info:fetch A processing-1.2.1/build/javadoc/everything/processing/app/antlr/package-summary.html |
---|
1039 | :info:fetch A processing-1.2.1/build/javadoc/everything/processing/app/antlr/JavaTokenTypes.html |
---|
1040 | :info:fetch A processing-1.2.1/build/javadoc/everything/processing/app/antlr/PdeLexer.html |
---|
1041 | :info:fetch A processing-1.2.1/build/javadoc/everything/processing/app/antlr/package-tree.html |
---|
1042 | :info:fetch A processing-1.2.1/build/javadoc/everything/processing/app/antlr/JavaRecognizer.html |
---|
1043 | :info:fetch A processing-1.2.1/build/javadoc/everything/processing/app/antlr/PdePartialTokenTypes.html |
---|
1044 | :info:fetch A processing-1.2.1/build/javadoc/everything/processing/app/package-frame.html |
---|
1045 | :info:fetch A processing-1.2.1/build/javadoc/everything/processing/app/syntax |
---|
1046 | :info:fetch A processing-1.2.1/build/javadoc/everything/processing/app/syntax/InputHandler.Wrapper.html |
---|
1047 | :info:fetch A processing-1.2.1/build/javadoc/everything/processing/app/syntax/TextUtilities.html |
---|
1048 | :info:fetch A processing-1.2.1/build/javadoc/everything/processing/app/syntax/InputHandler.next_line.html |
---|
1049 | :info:fetch A processing-1.2.1/build/javadoc/everything/processing/app/syntax/TokenMarker.html |
---|
1050 | :info:fetch A processing-1.2.1/build/javadoc/everything/processing/app/syntax/InputHandler.home.html |
---|
1051 | :info:fetch A processing-1.2.1/build/javadoc/everything/processing/app/syntax/SyntaxDocument.html |
---|
1052 | :info:fetch A processing-1.2.1/build/javadoc/everything/processing/app/syntax/CTokenMarker.html |
---|
1053 | :info:fetch A processing-1.2.1/build/javadoc/everything/processing/app/syntax/package-tree.html |
---|
1054 | :info:fetch A processing-1.2.1/build/javadoc/everything/processing/app/syntax/InputHandler.toggle_rect.html |
---|
1055 | :info:fetch A processing-1.2.1/build/javadoc/everything/processing/app/syntax/InputHandler.insert_char.html |
---|
1056 | :info:fetch A processing-1.2.1/build/javadoc/everything/processing/app/syntax/Brackets.html |
---|
1057 | :info:fetch A processing-1.2.1/build/javadoc/everything/processing/app/syntax/TextAreaPainter.html |
---|
1058 | :info:fetch A processing-1.2.1/build/javadoc/everything/processing/app/syntax/InputHandler.document_end.html |
---|
1059 | :info:fetch A processing-1.2.1/build/javadoc/everything/processing/app/syntax/DefaultInputHandler.html |
---|
1060 | :info:fetch A processing-1.2.1/build/javadoc/everything/processing/app/syntax/InputHandler.prev_word.html |
---|
1061 | :info:fetch A processing-1.2.1/build/javadoc/everything/processing/app/syntax/InputHandler.prev_page.html |
---|
1062 | :info:fetch A processing-1.2.1/build/javadoc/everything/processing/app/syntax/InputHandler.prev_char.html |
---|
1063 | :info:fetch A processing-1.2.1/build/javadoc/everything/processing/app/syntax/TextAreaPainter.Highlight.html |
---|
1064 | :info:fetch A processing-1.2.1/build/javadoc/everything/processing/app/syntax/InputHandler.NonRecordable.html |
---|
1065 | :info:fetch A processing-1.2.1/build/javadoc/everything/processing/app/syntax/InputHandler.NonRepeatable.html |
---|
1066 | :info:fetch A processing-1.2.1/build/javadoc/everything/processing/app/syntax/InputHandler.repeat.html |
---|
1067 | :info:fetch A processing-1.2.1/build/javadoc/everything/processing/app/syntax/InputHandler.prev_line.html |
---|
1068 | :info:fetch A processing-1.2.1/build/javadoc/everything/processing/app/syntax/Token.html |
---|
1069 | :info:fetch A processing-1.2.1/build/javadoc/everything/processing/app/syntax/SyntaxUtilities.html |
---|
1070 | :info:fetch A processing-1.2.1/build/javadoc/everything/processing/app/syntax/InputHandler.document_home.html |
---|
1071 | :info:fetch A processing-1.2.1/build/javadoc/everything/processing/app/syntax/KeywordMap.html |
---|
1072 | :info:fetch A processing-1.2.1/build/javadoc/everything/processing/app/syntax/InputHandler.overwrite.html |
---|
1073 | :info:fetch A processing-1.2.1/build/javadoc/everything/processing/app/syntax/InputHandler.MacroRecorder.html |
---|
1074 | :info:fetch A processing-1.2.1/build/javadoc/everything/processing/app/syntax/package-frame.html |
---|
1075 | :info:fetch A processing-1.2.1/build/javadoc/everything/processing/app/syntax/InputHandler.clipboard_copy.html |
---|
1076 | :info:fetch A processing-1.2.1/build/javadoc/everything/processing/app/syntax/InputHandler.insert_tab.html |
---|
1077 | :info:fetch A processing-1.2.1/build/javadoc/everything/processing/app/syntax/package-summary.html |
---|
1078 | :info:fetch A processing-1.2.1/build/javadoc/everything/processing/app/syntax/InputHandler.clipboard_paste.html |
---|
1079 | :info:fetch A processing-1.2.1/build/javadoc/everything/processing/app/syntax/InputHandler.delete_word.html |
---|
1080 | :info:fetch A processing-1.2.1/build/javadoc/everything/processing/app/syntax/InputHandler.html |
---|
1081 | :info:fetch A processing-1.2.1/build/javadoc/everything/processing/app/syntax/JEditTextArea.html |
---|
1082 | :info:fetch A processing-1.2.1/build/javadoc/everything/processing/app/syntax/InputHandler.delete.html |
---|
1083 | :info:fetch A processing-1.2.1/build/javadoc/everything/processing/app/syntax/PdeTextAreaDefaults.html |
---|
1084 | :info:fetch A processing-1.2.1/build/javadoc/everything/processing/app/syntax/PdeKeywords.html |
---|
1085 | :info:fetch A processing-1.2.1/build/javadoc/everything/processing/app/syntax/InputHandler.end.html |
---|
1086 | :info:fetch A processing-1.2.1/build/javadoc/everything/processing/app/syntax/InputHandler.backspace_word.html |
---|
1087 | :info:fetch A processing-1.2.1/build/javadoc/everything/processing/app/syntax/InputHandler.insert_break.html |
---|
1088 | :info:fetch A processing-1.2.1/build/javadoc/everything/processing/app/syntax/TextAreaDefaults.html |
---|
1089 | :info:fetch A processing-1.2.1/build/javadoc/everything/processing/app/syntax/InputHandler.next_word.html |
---|
1090 | :info:fetch A processing-1.2.1/build/javadoc/everything/processing/app/syntax/InputHandler.next_page.html |
---|
1091 | :info:fetch A processing-1.2.1/build/javadoc/everything/processing/app/syntax/InputHandler.clipboard_cut.html |
---|
1092 | :info:fetch A processing-1.2.1/build/javadoc/everything/processing/app/syntax/InputHandler.next_char.html |
---|
1093 | :info:fetch A processing-1.2.1/build/javadoc/everything/processing/app/syntax/SyntaxStyle.html |
---|
1094 | :info:fetch A processing-1.2.1/build/javadoc/everything/processing/app/syntax/InputHandler.backspace.html |
---|
1095 | :info:fetch A processing-1.2.1/build/javadoc/everything/processing/app/PresentMode.html |
---|
1096 | :info:fetch A processing-1.2.1/build/javadoc/everything/processing/app/package-summary.html |
---|
1097 | :info:fetch A processing-1.2.1/build/javadoc/everything/processing/app/Editor.html |
---|
1098 | :info:fetch A processing-1.2.1/build/javadoc/everything/processing/app/macosx |
---|
1099 | :info:fetch A processing-1.2.1/build/javadoc/everything/processing/app/macosx/package-frame.html |
---|
1100 | :info:fetch A processing-1.2.1/build/javadoc/everything/processing/app/macosx/ThinkDifferent.html |
---|
1101 | :info:fetch A processing-1.2.1/build/javadoc/everything/processing/app/macosx/Platform.html |
---|
1102 | :info:fetch A processing-1.2.1/build/javadoc/everything/processing/app/macosx/package-summary.html |
---|
1103 | :info:fetch A processing-1.2.1/build/javadoc/everything/processing/app/macosx/package-tree.html |
---|
1104 | :info:fetch A processing-1.2.1/build/javadoc/everything/processing/app/Platform.CLibrary.html |
---|
1105 | :info:fetch A processing-1.2.1/build/javadoc/everything/processing/app/linux |
---|
1106 | :info:fetch A processing-1.2.1/build/javadoc/everything/processing/app/linux/package-frame.html |
---|
1107 | :info:fetch A processing-1.2.1/build/javadoc/everything/processing/app/linux/Platform.html |
---|
1108 | :info:fetch A processing-1.2.1/build/javadoc/everything/processing/app/linux/package-summary.html |
---|
1109 | :info:fetch A processing-1.2.1/build/javadoc/everything/processing/app/linux/package-tree.html |
---|
1110 | :info:fetch A processing-1.2.1/build/javadoc/everything/processing/app/Theme.html |
---|
1111 | :info:fetch A processing-1.2.1/build/javadoc/everything/processing/app/StreamRedirectThread.html |
---|
1112 | :info:fetch A processing-1.2.1/build/javadoc/everything/processing/app/Commander.html |
---|
1113 | :info:fetch A processing-1.2.1/build/javadoc/everything/processing/app/EditorToolbar.html |
---|
1114 | :info:fetch A processing-1.2.1/build/javadoc/everything/processing/app/EditorConsole.html |
---|
1115 | :info:fetch A processing-1.2.1/build/javadoc/everything/processing/app/Base.html |
---|
1116 | :info:fetch A processing-1.2.1/build/javadoc/everything/processing/xml |
---|
1117 | :info:fetch A processing-1.2.1/build/javadoc/everything/processing/xml/XMLWriter.html |
---|
1118 | :info:fetch A processing-1.2.1/build/javadoc/everything/processing/xml/StdXMLReader.html |
---|
1119 | :info:fetch A processing-1.2.1/build/javadoc/everything/processing/xml/XMLException.html |
---|
1120 | :info:fetch A processing-1.2.1/build/javadoc/everything/processing/xml/XMLEntityResolver.html |
---|
1121 | :info:fetch A processing-1.2.1/build/javadoc/everything/processing/xml/StdXMLBuilder.html |
---|
1122 | :info:fetch A processing-1.2.1/build/javadoc/everything/processing/xml/package-frame.html |
---|
1123 | :info:fetch A processing-1.2.1/build/javadoc/everything/processing/xml/XMLValidator.html |
---|
1124 | :info:fetch A processing-1.2.1/build/javadoc/everything/processing/xml/package-summary.html |
---|
1125 | :info:fetch A processing-1.2.1/build/javadoc/everything/processing/xml/StdXMLParser.html |
---|
1126 | :info:fetch A processing-1.2.1/build/javadoc/everything/processing/xml/package-tree.html |
---|
1127 | :info:fetch A processing-1.2.1/build/javadoc/everything/processing/xml/XMLParseException.html |
---|
1128 | :info:fetch A processing-1.2.1/build/javadoc/everything/processing/xml/XMLValidationException.html |
---|
1129 | :info:fetch A processing-1.2.1/build/javadoc/everything/processing/xml/XMLElement.html |
---|
1130 | :info:fetch A processing-1.2.1/build/javadoc/everything/processing/dxf |
---|
1131 | :info:fetch A processing-1.2.1/build/javadoc/everything/processing/dxf/package-frame.html |
---|
1132 | :info:fetch A processing-1.2.1/build/javadoc/everything/processing/dxf/package-summary.html |
---|
1133 | :info:fetch A processing-1.2.1/build/javadoc/everything/processing/dxf/package-tree.html |
---|
1134 | :info:fetch A processing-1.2.1/build/javadoc/everything/processing/dxf/RawDXF.html |
---|
1135 | :info:fetch A processing-1.2.1/build/javadoc/everything/processing/opengl |
---|
1136 | :info:fetch A processing-1.2.1/build/javadoc/everything/processing/opengl/PGraphicsOpenGL.TessCallback.html |
---|
1137 | :info:fetch A processing-1.2.1/build/javadoc/everything/processing/opengl/package-frame.html |
---|
1138 | :info:fetch A processing-1.2.1/build/javadoc/everything/processing/opengl/PGraphicsOpenGL.html |
---|
1139 | :info:fetch A processing-1.2.1/build/javadoc/everything/processing/opengl/package-summary.html |
---|
1140 | :info:fetch A processing-1.2.1/build/javadoc/everything/processing/opengl/package-tree.html |
---|
1141 | :info:fetch A processing-1.2.1/build/javadoc/everything/processing/net |
---|
1142 | :info:fetch A processing-1.2.1/build/javadoc/everything/processing/net/Client.html |
---|
1143 | :info:fetch A processing-1.2.1/build/javadoc/everything/processing/net/package-frame.html |
---|
1144 | :info:fetch A processing-1.2.1/build/javadoc/everything/processing/net/Server.html |
---|
1145 | :info:fetch A processing-1.2.1/build/javadoc/everything/processing/net/package-summary.html |
---|
1146 | :info:fetch A processing-1.2.1/build/javadoc/everything/processing/net/package-tree.html |
---|
1147 | :info:fetch A processing-1.2.1/build/javadoc/everything/processing/video |
---|
1148 | :info:fetch A processing-1.2.1/build/javadoc/everything/processing/video/MovieMaker.html |
---|
1149 | :info:fetch A processing-1.2.1/build/javadoc/everything/processing/video/Movie.html |
---|
1150 | :info:fetch A processing-1.2.1/build/javadoc/everything/processing/video/Capture.html |
---|
1151 | :info:fetch A processing-1.2.1/build/javadoc/everything/processing/video/package-frame.html |
---|
1152 | :info:fetch A processing-1.2.1/build/javadoc/everything/processing/video/package-summary.html |
---|
1153 | :info:fetch A processing-1.2.1/build/javadoc/everything/processing/video/package-tree.html |
---|
1154 | :info:fetch A processing-1.2.1/build/javadoc/everything/processing/core |
---|
1155 | :info:fetch A processing-1.2.1/build/javadoc/everything/processing/core/PSmoothTriangle.html |
---|
1156 | :info:fetch A processing-1.2.1/build/javadoc/everything/processing/core/PShape.html |
---|
1157 | :info:fetch A processing-1.2.1/build/javadoc/everything/processing/core/PStyle.html |
---|
1158 | :info:fetch A processing-1.2.1/build/javadoc/everything/processing/core/PGraphics.html |
---|
1159 | :info:fetch A processing-1.2.1/build/javadoc/everything/processing/core/PVector.html |
---|
1160 | :info:fetch A processing-1.2.1/build/javadoc/everything/processing/core/package-frame.html |
---|
1161 | :info:fetch A processing-1.2.1/build/javadoc/everything/processing/core/PMatrix.html |
---|
1162 | :info:fetch A processing-1.2.1/build/javadoc/everything/processing/core/PApplet.RegisteredMethods.html |
---|
1163 | :info:fetch A processing-1.2.1/build/javadoc/everything/processing/core/PTriangle.html |
---|
1164 | :info:fetch A processing-1.2.1/build/javadoc/everything/processing/core/package-summary.html |
---|
1165 | :info:fetch A processing-1.2.1/build/javadoc/everything/processing/core/PFont.html |
---|
1166 | :info:fetch A processing-1.2.1/build/javadoc/everything/processing/core/package-tree.html |
---|
1167 | :info:fetch A processing-1.2.1/build/javadoc/everything/processing/core/PConstants.html |
---|
1168 | :info:fetch A processing-1.2.1/build/javadoc/everything/processing/core/PApplet.RendererChangeException.html |
---|
1169 | :info:fetch A processing-1.2.1/build/javadoc/everything/processing/core/PShapeSVG.html |
---|
1170 | :info:fetch A processing-1.2.1/build/javadoc/everything/processing/core/PImage.html |
---|
1171 | :info:fetch A processing-1.2.1/build/javadoc/everything/processing/core/PApplet.html |
---|
1172 | :info:fetch A processing-1.2.1/build/javadoc/everything/processing/core/PGraphics2D.html |
---|
1173 | :info:fetch A processing-1.2.1/build/javadoc/everything/processing/core/PLine.html |
---|
1174 | :info:fetch A processing-1.2.1/build/javadoc/everything/processing/core/PPolygon.html |
---|
1175 | :info:fetch A processing-1.2.1/build/javadoc/everything/processing/core/PGraphics3D.html |
---|
1176 | :info:fetch A processing-1.2.1/build/javadoc/everything/processing/core/PGraphicsJava2D.html |
---|
1177 | :info:fetch A processing-1.2.1/build/javadoc/everything/processing/core/PFont.Glyph.html |
---|
1178 | :info:fetch A processing-1.2.1/build/javadoc/everything/processing/core/PMatrix2D.html |
---|
1179 | :info:fetch A processing-1.2.1/build/javadoc/everything/processing/core/PMatrix3D.html |
---|
1180 | :info:fetch A processing-1.2.1/build/javadoc/everything/processing/pdf |
---|
1181 | :info:fetch A processing-1.2.1/build/javadoc/everything/processing/pdf/package-frame.html |
---|
1182 | :info:fetch A processing-1.2.1/build/javadoc/everything/processing/pdf/package-summary.html |
---|
1183 | :info:fetch A processing-1.2.1/build/javadoc/everything/processing/pdf/package-tree.html |
---|
1184 | :info:fetch A processing-1.2.1/build/javadoc/everything/processing/pdf/PGraphicsPDF.html |
---|
1185 | :info:fetch A processing-1.2.1/build/javadoc/everything/deprecated-list.html |
---|
1186 | :info:fetch A processing-1.2.1/build/javadoc/everything/allclasses-noframe.html |
---|
1187 | :info:fetch A processing-1.2.1/build/javadoc/make.sh |
---|
1188 | :info:fetch A processing-1.2.1/build/javadoc/core |
---|
1189 | :info:fetch A processing-1.2.1/build/javadoc/core/serialized-form.html |
---|
1190 | :info:fetch A processing-1.2.1/build/javadoc/core/index-all.html |
---|
1191 | :info:fetch A processing-1.2.1/build/javadoc/core/stylesheet.css |
---|
1192 | :info:fetch A processing-1.2.1/build/javadoc/core/allclasses-frame.html |
---|
1193 | :info:fetch A processing-1.2.1/build/javadoc/core/overview-frame.html |
---|
1194 | :info:fetch A processing-1.2.1/build/javadoc/core/overview-summary.html |
---|
1195 | :info:fetch A processing-1.2.1/build/javadoc/core/package-list |
---|
1196 | :info:fetch A processing-1.2.1/build/javadoc/core/overview-tree.html |
---|
1197 | :info:fetch A processing-1.2.1/build/javadoc/core/constant-values.html |
---|
1198 | :info:fetch A processing-1.2.1/build/javadoc/core/resources |
---|
1199 | :info:fetch A processing-1.2.1/build/javadoc/core/resources/inherit.gif |
---|
1200 | :info:fetch A processing-1.2.1/build/javadoc/core/index.html |
---|
1201 | :info:fetch A processing-1.2.1/build/javadoc/core/deprecated-list.html |
---|
1202 | :info:fetch A processing-1.2.1/build/javadoc/core/processing |
---|
1203 | :info:fetch A processing-1.2.1/build/javadoc/core/processing/xml |
---|
1204 | :info:fetch A processing-1.2.1/build/javadoc/core/processing/xml/XMLWriter.html |
---|
1205 | :info:fetch A processing-1.2.1/build/javadoc/core/processing/xml/StdXMLReader.html |
---|
1206 | :info:fetch A processing-1.2.1/build/javadoc/core/processing/xml/XMLException.html |
---|
1207 | :info:fetch A processing-1.2.1/build/javadoc/core/processing/xml/XMLEntityResolver.html |
---|
1208 | :info:fetch A processing-1.2.1/build/javadoc/core/processing/xml/StdXMLBuilder.html |
---|
1209 | :info:fetch A processing-1.2.1/build/javadoc/core/processing/xml/package-frame.html |
---|
1210 | :info:fetch A processing-1.2.1/build/javadoc/core/processing/xml/XMLValidator.html |
---|
1211 | :info:fetch A processing-1.2.1/build/javadoc/core/processing/xml/package-summary.html |
---|
1212 | :info:fetch A processing-1.2.1/build/javadoc/core/processing/xml/StdXMLParser.html |
---|
1213 | :info:fetch A processing-1.2.1/build/javadoc/core/processing/xml/package-tree.html |
---|
1214 | :info:fetch A processing-1.2.1/build/javadoc/core/processing/xml/XMLParseException.html |
---|
1215 | :info:fetch A processing-1.2.1/build/javadoc/core/processing/xml/XMLValidationException.html |
---|
1216 | :info:fetch A processing-1.2.1/build/javadoc/core/processing/xml/XMLElement.html |
---|
1217 | :info:fetch A processing-1.2.1/build/javadoc/core/processing/core |
---|
1218 | :info:fetch A processing-1.2.1/build/javadoc/core/processing/core/PMaterial.html |
---|
1219 | :info:fetch A processing-1.2.1/build/javadoc/core/processing/core/PSmoothTriangle.html |
---|
1220 | :info:fetch A processing-1.2.1/build/javadoc/core/processing/core/PShape.html |
---|
1221 | :info:fetch A processing-1.2.1/build/javadoc/core/processing/core/PStyle.html |
---|
1222 | :info:fetch A processing-1.2.1/build/javadoc/core/processing/core/PGraphics.html |
---|
1223 | :info:fetch A processing-1.2.1/build/javadoc/core/processing/core/PVector.html |
---|
1224 | :info:fetch A processing-1.2.1/build/javadoc/core/processing/core/package-frame.html |
---|
1225 | :info:fetch A processing-1.2.1/build/javadoc/core/processing/core/PMatrix.html |
---|
1226 | :info:fetch A processing-1.2.1/build/javadoc/core/processing/core/PApplet.RegisteredMethods.html |
---|
1227 | :info:fetch A processing-1.2.1/build/javadoc/core/processing/core/PTriangle.html |
---|
1228 | :info:fetch A processing-1.2.1/build/javadoc/core/processing/core/package-summary.html |
---|
1229 | :info:fetch A processing-1.2.1/build/javadoc/core/processing/core/PFont.html |
---|
1230 | :info:fetch A processing-1.2.1/build/javadoc/core/processing/core/package-tree.html |
---|
1231 | :info:fetch A processing-1.2.1/build/javadoc/core/processing/core/PConstants.html |
---|
1232 | :info:fetch A processing-1.2.1/build/javadoc/core/processing/core/PApplet.RendererChangeException.html |
---|
1233 | :info:fetch A processing-1.2.1/build/javadoc/core/processing/core/PShapeSVG.html |
---|
1234 | :info:fetch A processing-1.2.1/build/javadoc/core/processing/core/PImage.html |
---|
1235 | :info:fetch A processing-1.2.1/build/javadoc/core/processing/core/PApplet.html |
---|
1236 | :info:fetch A processing-1.2.1/build/javadoc/core/processing/core/PGraphics2D.html |
---|
1237 | :info:fetch A processing-1.2.1/build/javadoc/core/processing/core/PLine.html |
---|
1238 | :info:fetch A processing-1.2.1/build/javadoc/core/processing/core/PPolygon.html |
---|
1239 | :info:fetch A processing-1.2.1/build/javadoc/core/processing/core/PGraphics3D.html |
---|
1240 | :info:fetch A processing-1.2.1/build/javadoc/core/processing/core/PGraphicsJava2D.html |
---|
1241 | :info:fetch A processing-1.2.1/build/javadoc/core/processing/core/PFont.Glyph.html |
---|
1242 | :info:fetch A processing-1.2.1/build/javadoc/core/processing/core/PMatrix2D.html |
---|
1243 | :info:fetch A processing-1.2.1/build/javadoc/core/processing/core/PMatrix3D.html |
---|
1244 | :info:fetch A processing-1.2.1/build/javadoc/core/help-doc.html |
---|
1245 | :info:fetch A processing-1.2.1/build/javadoc/core/allclasses-noframe.html |
---|
1246 | :info:fetch A processing-1.2.1/build/javadoc/index.html |
---|
1247 | :info:fetch A processing-1.2.1/build/javadoc/upload.sh |
---|
1248 | :info:fetch A processing-1.2.1/build/macosx |
---|
1249 | :info:fetch A processing-1.2.1/build/macosx/template.dmg.gz |
---|
1250 | :info:fetch A processing-1.2.1/build/macosx/template.app |
---|
1251 | :info:fetch A processing-1.2.1/build/macosx/template.app/Contents |
---|
1252 | :info:fetch A processing-1.2.1/build/macosx/template.app/Contents/MacOS |
---|
1253 | :info:fetch A processing-1.2.1/build/macosx/template.app/Contents/MacOS/JavaApplicationStub |
---|
1254 | :info:fetch A processing-1.2.1/build/macosx/template.app/Contents/Info.plist |
---|
1255 | :info:fetch A processing-1.2.1/build/macosx/template.app/Contents/Resources |
---|
1256 | :info:fetch A processing-1.2.1/build/macosx/template.app/Contents/Resources/Java |
---|
1257 | :info:fetch A processing-1.2.1/build/macosx/template.app/Contents/Resources/Java/libquaqua64.jnilib |
---|
1258 | :info:fetch A processing-1.2.1/build/macosx/template.app/Contents/Resources/Java/quaqua.jar |
---|
1259 | :info:fetch A processing-1.2.1/build/macosx/template.app/Contents/Resources/Java/libquaqua.jnilib |
---|
1260 | :info:fetch A processing-1.2.1/build/macosx/template.app/Contents/Resources/pde.icns |
---|
1261 | :info:fetch A processing-1.2.1/build/macosx/template.app/Contents/Resources/processing.icns |
---|
1262 | :info:fetch A processing-1.2.1/build/macosx/template.app/Contents/PkgInfo |
---|
1263 | :info:fetch A processing-1.2.1/build/windows |
---|
1264 | :info:fetch A processing-1.2.1/build/windows/export |
---|
1265 | :info:fetch A processing-1.2.1/build/windows/export/launcher.cpp |
---|
1266 | :info:fetch A processing-1.2.1/build/windows/export/application.exe |
---|
1267 | :info:fetch A processing-1.2.1/build/windows/export/Makefile |
---|
1268 | :info:fetch A processing-1.2.1/build/windows/launcher |
---|
1269 | :info:fetch A processing-1.2.1/build/windows/launcher/config.xml |
---|
1270 | :info:fetch A processing-1.2.1/build/windows/launcher/about.bmp |
---|
1271 | :info:fetch A processing-1.2.1/build/windows/launcher/launch4j |
---|
1272 | :info:fetch A processing-1.2.1/build/windows/launcher/launch4j/launch4j.jar |
---|
1273 | :info:fetch A processing-1.2.1/build/windows/launcher/launch4j/.project |
---|
1274 | :info:fetch A processing-1.2.1/build/windows/launcher/launch4j/demo |
---|
1275 | :info:fetch A processing-1.2.1/build/windows/launcher/launch4j/demo/LICENSE.txt |
---|
1276 | :info:fetch A processing-1.2.1/build/windows/launcher/launch4j/demo/ConsoleApp |
---|
1277 | :info:fetch A processing-1.2.1/build/windows/launcher/launch4j/demo/ConsoleApp/ConsoleApp.exe |
---|
1278 | :info:fetch A processing-1.2.1/build/windows/launcher/launch4j/demo/ConsoleApp/build.bat |
---|
1279 | :info:fetch A processing-1.2.1/build/windows/launcher/launch4j/demo/ConsoleApp/lib |
---|
1280 | :info:fetch A processing-1.2.1/build/windows/launcher/launch4j/demo/ConsoleApp/lib/readme.txt |
---|
1281 | :info:fetch A processing-1.2.1/build/windows/launcher/launch4j/demo/ConsoleApp/src |
---|
1282 | :info:fetch A processing-1.2.1/build/windows/launcher/launch4j/demo/ConsoleApp/src/net |
---|
1283 | :info:fetch A processing-1.2.1/build/windows/launcher/launch4j/demo/ConsoleApp/src/net/sf |
---|
1284 | :info:fetch A processing-1.2.1/build/windows/launcher/launch4j/demo/ConsoleApp/src/net/sf/launch4j |
---|
1285 | :info:fetch A processing-1.2.1/build/windows/launcher/launch4j/demo/ConsoleApp/src/net/sf/launch4j/example |
---|
1286 | :info:fetch A processing-1.2.1/build/windows/launcher/launch4j/demo/ConsoleApp/src/net/sf/launch4j/example/ConsoleApp.java |
---|
1287 | :info:fetch A processing-1.2.1/build/windows/launcher/launch4j/demo/ConsoleApp/l4j |
---|
1288 | :info:fetch A processing-1.2.1/build/windows/launcher/launch4j/demo/ConsoleApp/l4j/ConsoleApp.ico |
---|
1289 | :info:fetch A processing-1.2.1/build/windows/launcher/launch4j/demo/ConsoleApp/readme.txt |
---|
1290 | :info:fetch A processing-1.2.1/build/windows/launcher/launch4j/demo/ConsoleApp/ConsoleApp.jar |
---|
1291 | :info:fetch A processing-1.2.1/build/windows/launcher/launch4j/demo/ConsoleApp/build.xml |
---|
1292 | :info:fetch A processing-1.2.1/build/windows/launcher/launch4j/demo/SimpleApp |
---|
1293 | :info:fetch A processing-1.2.1/build/windows/launcher/launch4j/demo/SimpleApp/build.bat |
---|
1294 | :info:fetch A processing-1.2.1/build/windows/launcher/launch4j/demo/SimpleApp/SimpleApp.jar |
---|
1295 | :info:fetch A processing-1.2.1/build/windows/launcher/launch4j/demo/SimpleApp/lib |
---|
1296 | :info:fetch A processing-1.2.1/build/windows/launcher/launch4j/demo/SimpleApp/lib/readme.txt |
---|
1297 | :info:fetch A processing-1.2.1/build/windows/launcher/launch4j/demo/SimpleApp/src |
---|
1298 | :info:fetch A processing-1.2.1/build/windows/launcher/launch4j/demo/SimpleApp/src/net |
---|
1299 | :info:fetch A processing-1.2.1/build/windows/launcher/launch4j/demo/SimpleApp/src/net/sf |
---|
1300 | :info:fetch A processing-1.2.1/build/windows/launcher/launch4j/demo/SimpleApp/src/net/sf/launch4j |
---|
1301 | :info:fetch A processing-1.2.1/build/windows/launcher/launch4j/demo/SimpleApp/src/net/sf/launch4j/example |
---|
1302 | :info:fetch A processing-1.2.1/build/windows/launcher/launch4j/demo/SimpleApp/src/net/sf/launch4j/example/SimpleApp.java |
---|
1303 | :info:fetch A processing-1.2.1/build/windows/launcher/launch4j/demo/SimpleApp/l4j |
---|
1304 | :info:fetch A processing-1.2.1/build/windows/launcher/launch4j/demo/SimpleApp/l4j/SimpleApp.ico |
---|
1305 | :info:fetch A processing-1.2.1/build/windows/launcher/launch4j/demo/SimpleApp/l4j/splash.bmp |
---|
1306 | :info:fetch A processing-1.2.1/build/windows/launcher/launch4j/demo/SimpleApp/l4j/SimpleApp.xml |
---|
1307 | :info:fetch A processing-1.2.1/build/windows/launcher/launch4j/demo/SimpleApp/SimpleApp.exe |
---|
1308 | :info:fetch A processing-1.2.1/build/windows/launcher/launch4j/demo/SimpleApp/readme.txt |
---|
1309 | :info:fetch A processing-1.2.1/build/windows/launcher/launch4j/demo/SimpleApp/build.xml |
---|
1310 | :info:fetch A processing-1.2.1/build/windows/launcher/launch4j/demo/readme.txt |
---|
1311 | :info:fetch A processing-1.2.1/build/windows/launcher/launch4j/src |
---|
1312 | :info:fetch A processing-1.2.1/build/windows/launcher/launch4j/src/launch4j.properties |
---|
1313 | :info:fetch A processing-1.2.1/build/windows/launcher/launch4j/src/images |
---|
1314 | :info:fetch A processing-1.2.1/build/windows/launcher/launch4j/src/images/cancel16.png |
---|
1315 | :info:fetch A processing-1.2.1/build/windows/launcher/launch4j/src/images/asterix-o.gif |
---|
1316 | :info:fetch A processing-1.2.1/build/windows/launcher/launch4j/src/images/save.png |
---|
1317 | :info:fetch A processing-1.2.1/build/windows/launcher/launch4j/src/images/build.png |
---|
1318 | :info:fetch A processing-1.2.1/build/windows/launcher/launch4j/src/images/new16.png |
---|
1319 | :info:fetch A processing-1.2.1/build/windows/launcher/launch4j/src/images/asterix.gif |
---|
1320 | :info:fetch A processing-1.2.1/build/windows/launcher/launch4j/src/images/open.png |
---|
1321 | :info:fetch A processing-1.2.1/build/windows/launcher/launch4j/src/images/run.png |
---|
1322 | :info:fetch A processing-1.2.1/build/windows/launcher/launch4j/src/images/button_ok.png |
---|
1323 | :info:fetch A processing-1.2.1/build/windows/launcher/launch4j/src/images/edit_add16.png |
---|
1324 | :info:fetch A processing-1.2.1/build/windows/launcher/launch4j/src/images/open16.png |
---|
1325 | :info:fetch A processing-1.2.1/build/windows/launcher/launch4j/src/images/down16.png |
---|
1326 | :info:fetch A processing-1.2.1/build/windows/launcher/launch4j/src/images/ok16.png |
---|
1327 | :info:fetch A processing-1.2.1/build/windows/launcher/launch4j/src/images/new.png |
---|
1328 | :info:fetch A processing-1.2.1/build/windows/launcher/launch4j/src/images/info.png |
---|
1329 | :info:fetch A processing-1.2.1/build/windows/launcher/launch4j/src/images/up16.png |
---|
1330 | :info:fetch A processing-1.2.1/build/windows/launcher/launch4j/src/net |
---|
1331 | :info:fetch A processing-1.2.1/build/windows/launcher/launch4j/src/net/sf |
---|
1332 | :info:fetch A processing-1.2.1/build/windows/launcher/launch4j/src/net/sf/launch4j |
---|
1333 | :info:fetch A processing-1.2.1/build/windows/launcher/launch4j/src/net/sf/launch4j/ant |
---|
1334 | :info:fetch A processing-1.2.1/build/windows/launcher/launch4j/src/net/sf/launch4j/ant/messages.properties |
---|
1335 | :info:fetch A processing-1.2.1/build/windows/launcher/launch4j/src/net/sf/launch4j/ant/AntJre.java |
---|
1336 | :info:fetch A processing-1.2.1/build/windows/launcher/launch4j/src/net/sf/launch4j/ant/AntClassPath.java |
---|
1337 | :info:fetch A processing-1.2.1/build/windows/launcher/launch4j/src/net/sf/launch4j/ant/StringWrapper.java |
---|
1338 | :info:fetch A processing-1.2.1/build/windows/launcher/launch4j/src/net/sf/launch4j/ant/Messages.java |
---|
1339 | :info:fetch A processing-1.2.1/build/windows/launcher/launch4j/src/net/sf/launch4j/ant/AntConfig.java |
---|
1340 | :info:fetch A processing-1.2.1/build/windows/launcher/launch4j/src/net/sf/launch4j/ant/messages_es.properties |
---|
1341 | :info:fetch A processing-1.2.1/build/windows/launcher/launch4j/src/net/sf/launch4j/ant/Launch4jTask.java |
---|
1342 | :info:fetch A processing-1.2.1/build/windows/launcher/launch4j/src/net/sf/launch4j/ExecException.java |
---|
1343 | :info:fetch A processing-1.2.1/build/windows/launcher/launch4j/src/net/sf/launch4j/formimpl |
---|
1344 | :info:fetch A processing-1.2.1/build/windows/launcher/launch4j/src/net/sf/launch4j/formimpl/MainFrame.java |
---|
1345 | :info:fetch A processing-1.2.1/build/windows/launcher/launch4j/src/net/sf/launch4j/formimpl/SplashFormImpl.java |
---|
1346 | :info:fetch A processing-1.2.1/build/windows/launcher/launch4j/src/net/sf/launch4j/formimpl/FileChooser.java |
---|
1347 | :info:fetch A processing-1.2.1/build/windows/launcher/launch4j/src/net/sf/launch4j/formimpl/BrowseActionListener.java |
---|
1348 | :info:fetch A processing-1.2.1/build/windows/launcher/launch4j/src/net/sf/launch4j/formimpl/EnvironmentVarsFormImpl.java |
---|
1349 | :info:fetch A processing-1.2.1/build/windows/launcher/launch4j/src/net/sf/launch4j/formimpl/Messages.java |
---|
1350 | :info:fetch A processing-1.2.1/build/windows/launcher/launch4j/src/net/sf/launch4j/formimpl/VersionInfoFormImpl.java |
---|
1351 | :info:fetch A processing-1.2.1/build/windows/launcher/launch4j/src/net/sf/launch4j/formimpl/messages_es.properties |
---|
1352 | :info:fetch A processing-1.2.1/build/windows/launcher/launch4j/src/net/sf/launch4j/formimpl/ConfigFormImpl.java |
---|
1353 | :info:fetch A processing-1.2.1/build/windows/launcher/launch4j/src/net/sf/launch4j/formimpl/SingleInstanceFormImpl.java |
---|
1354 | :info:fetch A processing-1.2.1/build/windows/launcher/launch4j/src/net/sf/launch4j/formimpl/GlassPane.java |
---|
1355 | :info:fetch A processing-1.2.1/build/windows/launcher/launch4j/src/net/sf/launch4j/formimpl/MessagesFormImpl.java |
---|
1356 | :info:fetch A processing-1.2.1/build/windows/launcher/launch4j/src/net/sf/launch4j/formimpl/messages.properties |
---|
1357 | :info:fetch A processing-1.2.1/build/windows/launcher/launch4j/src/net/sf/launch4j/formimpl/JreFormImpl.java |
---|
1358 | :info:fetch A processing-1.2.1/build/windows/launcher/launch4j/src/net/sf/launch4j/formimpl/BasicFormImpl.java |
---|
1359 | :info:fetch A processing-1.2.1/build/windows/launcher/launch4j/src/net/sf/launch4j/formimpl/ClassPathFormImpl.java |
---|
1360 | :info:fetch A processing-1.2.1/build/windows/launcher/launch4j/src/net/sf/launch4j/formimpl/AbstractAcceptListener.java |
---|
1361 | :info:fetch A processing-1.2.1/build/windows/launcher/launch4j/src/net/sf/launch4j/formimpl/HeaderFormImpl.java |
---|
1362 | :info:fetch A processing-1.2.1/build/windows/launcher/launch4j/src/net/sf/launch4j/BuilderException.java |
---|
1363 | :info:fetch A processing-1.2.1/build/windows/launcher/launch4j/src/net/sf/launch4j/Messages.java |
---|
1364 | :info:fetch A processing-1.2.1/build/windows/launcher/launch4j/src/net/sf/launch4j/FileChooserFilter.java |
---|
1365 | :info:fetch A processing-1.2.1/build/windows/launcher/launch4j/src/net/sf/launch4j/messages_es.properties |
---|
1366 | :info:fetch A processing-1.2.1/build/windows/launcher/launch4j/src/net/sf/launch4j/RcBuilder.java |
---|
1367 | :info:fetch A processing-1.2.1/build/windows/launcher/launch4j/src/net/sf/launch4j/Util.java |
---|
1368 | :info:fetch A processing-1.2.1/build/windows/launcher/launch4j/src/net/sf/launch4j/Log.java |
---|
1369 | :info:fetch A processing-1.2.1/build/windows/launcher/launch4j/src/net/sf/launch4j/messages.properties |
---|
1370 | :info:fetch A processing-1.2.1/build/windows/launcher/launch4j/src/net/sf/launch4j/form |
---|
1371 | :info:fetch A processing-1.2.1/build/windows/launcher/launch4j/src/net/sf/launch4j/form/EnvironmentVarsForm.jfrm |
---|
1372 | :info:fetch A processing-1.2.1/build/windows/launcher/launch4j/src/net/sf/launch4j/form/VersionInfoForm.jfrm |
---|
1373 | :info:fetch A processing-1.2.1/build/windows/launcher/launch4j/src/net/sf/launch4j/form/JreForm.java |
---|
1374 | :info:fetch A processing-1.2.1/build/windows/launcher/launch4j/src/net/sf/launch4j/form/BasicForm.java |
---|
1375 | :info:fetch A processing-1.2.1/build/windows/launcher/launch4j/src/net/sf/launch4j/form/ConfigForm.jfrm |
---|
1376 | :info:fetch A processing-1.2.1/build/windows/launcher/launch4j/src/net/sf/launch4j/form/ClassPathForm.java |
---|
1377 | :info:fetch A processing-1.2.1/build/windows/launcher/launch4j/src/net/sf/launch4j/form/SingleInstanceForm.jfrm |
---|
1378 | :info:fetch A processing-1.2.1/build/windows/launcher/launch4j/src/net/sf/launch4j/form/Messages.java |
---|
1379 | :info:fetch A processing-1.2.1/build/windows/launcher/launch4j/src/net/sf/launch4j/form/MessagesForm.jfrm |
---|
1380 | :info:fetch A processing-1.2.1/build/windows/launcher/launch4j/src/net/sf/launch4j/form/messages_es.properties |
---|
1381 | :info:fetch A processing-1.2.1/build/windows/launcher/launch4j/src/net/sf/launch4j/form/HeaderForm.java |
---|
1382 | :info:fetch A processing-1.2.1/build/windows/launcher/launch4j/src/net/sf/launch4j/form/SplashForm.java |
---|
1383 | :info:fetch A processing-1.2.1/build/windows/launcher/launch4j/src/net/sf/launch4j/form/JreForm.jfrm |
---|
1384 | :info:fetch A processing-1.2.1/build/windows/launcher/launch4j/src/net/sf/launch4j/form/messages.properties |
---|
1385 | :info:fetch A processing-1.2.1/build/windows/launcher/launch4j/src/net/sf/launch4j/form/BasicForm.jfrm |
---|
1386 | :info:fetch A processing-1.2.1/build/windows/launcher/launch4j/src/net/sf/launch4j/form/ClassPathForm.jfrm |
---|
1387 | :info:fetch A processing-1.2.1/build/windows/launcher/launch4j/src/net/sf/launch4j/form/EnvironmentVarsForm.java |
---|
1388 | :info:fetch A processing-1.2.1/build/windows/launcher/launch4j/src/net/sf/launch4j/form/VersionInfoForm.java |
---|
1389 | :info:fetch A processing-1.2.1/build/windows/launcher/launch4j/src/net/sf/launch4j/form/HeaderForm.jfrm |
---|
1390 | :info:fetch A processing-1.2.1/build/windows/launcher/launch4j/src/net/sf/launch4j/form/ConfigForm.java |
---|
1391 | :info:fetch A processing-1.2.1/build/windows/launcher/launch4j/src/net/sf/launch4j/form/SingleInstanceForm.java |
---|
1392 | :info:fetch A processing-1.2.1/build/windows/launcher/launch4j/src/net/sf/launch4j/form/SplashForm.jfrm |
---|
1393 | :info:fetch A processing-1.2.1/build/windows/launcher/launch4j/src/net/sf/launch4j/form/MessagesForm.java |
---|
1394 | :info:fetch A processing-1.2.1/build/windows/launcher/launch4j/src/net/sf/launch4j/Main.java |
---|
1395 | :info:fetch A processing-1.2.1/build/windows/launcher/launch4j/src/net/sf/launch4j/config |
---|
1396 | :info:fetch A processing-1.2.1/build/windows/launcher/launch4j/src/net/sf/launch4j/config/Jre.java |
---|
1397 | :info:fetch A processing-1.2.1/build/windows/launcher/launch4j/src/net/sf/launch4j/config/VersionInfo.java |
---|
1398 | :info:fetch A processing-1.2.1/build/windows/launcher/launch4j/src/net/sf/launch4j/config/ClassPath.java |
---|
1399 | :info:fetch A processing-1.2.1/build/windows/launcher/launch4j/src/net/sf/launch4j/config/messages.properties |
---|
1400 | :info:fetch A processing-1.2.1/build/windows/launcher/launch4j/src/net/sf/launch4j/config/ConfigPersisterException.java |
---|
1401 | :info:fetch A processing-1.2.1/build/windows/launcher/launch4j/src/net/sf/launch4j/config/Config.java |
---|
1402 | :info:fetch A processing-1.2.1/build/windows/launcher/launch4j/src/net/sf/launch4j/config/SingleInstance.java |
---|
1403 | :info:fetch A processing-1.2.1/build/windows/launcher/launch4j/src/net/sf/launch4j/config/ConfigPersister.java |
---|
1404 | :info:fetch A processing-1.2.1/build/windows/launcher/launch4j/src/net/sf/launch4j/config/Msg.java |
---|
1405 | :info:fetch A processing-1.2.1/build/windows/launcher/launch4j/src/net/sf/launch4j/config/LdDefaults.java |
---|
1406 | :info:fetch A processing-1.2.1/build/windows/launcher/launch4j/src/net/sf/launch4j/config/Messages.java |
---|
1407 | :info:fetch A processing-1.2.1/build/windows/launcher/launch4j/src/net/sf/launch4j/config/messages_es.properties |
---|
1408 | :info:fetch A processing-1.2.1/build/windows/launcher/launch4j/src/net/sf/launch4j/config/Splash.java |
---|
1409 | :info:fetch A processing-1.2.1/build/windows/launcher/launch4j/src/net/sf/launch4j/OptionParser.java |
---|
1410 | :info:fetch A processing-1.2.1/build/windows/launcher/launch4j/src/net/sf/launch4j/Builder.java |
---|
1411 | :info:fetch A processing-1.2.1/build/windows/launcher/launch4j/src/net/sf/launch4j/binding |
---|
1412 | :info:fetch A processing-1.2.1/build/windows/launcher/launch4j/src/net/sf/launch4j/binding/JRadioButtonBinding.java |
---|
1413 | :info:fetch A processing-1.2.1/build/windows/launcher/launch4j/src/net/sf/launch4j/binding/InvariantViolationException.java |
---|
1414 | :info:fetch A processing-1.2.1/build/windows/launcher/launch4j/src/net/sf/launch4j/binding/OptJTextAreaBinding.java |
---|
1415 | :info:fetch A processing-1.2.1/build/windows/launcher/launch4j/src/net/sf/launch4j/binding/Messages.java |
---|
1416 | :info:fetch A processing-1.2.1/build/windows/launcher/launch4j/src/net/sf/launch4j/binding/messages_es.properties |
---|
1417 | :info:fetch A processing-1.2.1/build/windows/launcher/launch4j/src/net/sf/launch4j/binding/Binding.java |
---|
1418 | :info:fetch A processing-1.2.1/build/windows/launcher/launch4j/src/net/sf/launch4j/binding/JTextComponentBinding.java |
---|
1419 | :info:fetch A processing-1.2.1/build/windows/launcher/launch4j/src/net/sf/launch4j/binding/JComboBoxBinding.java |
---|
1420 | :info:fetch A processing-1.2.1/build/windows/launcher/launch4j/src/net/sf/launch4j/binding/OptComponentBinding.java |
---|
1421 | :info:fetch A processing-1.2.1/build/windows/launcher/launch4j/src/net/sf/launch4j/binding/JListBinding.java |
---|
1422 | :info:fetch A processing-1.2.1/build/windows/launcher/launch4j/src/net/sf/launch4j/binding/IValidatable.java |
---|
1423 | :info:fetch A processing-1.2.1/build/windows/launcher/launch4j/src/net/sf/launch4j/binding/JToggleButtonBinding.java |
---|
1424 | :info:fetch A processing-1.2.1/build/windows/launcher/launch4j/src/net/sf/launch4j/binding/messages.properties |
---|
1425 | :info:fetch A processing-1.2.1/build/windows/launcher/launch4j/src/net/sf/launch4j/binding/JTextAreaBinding.java |
---|
1426 | :info:fetch A processing-1.2.1/build/windows/launcher/launch4j/src/net/sf/launch4j/binding/Validator.java |
---|
1427 | :info:fetch A processing-1.2.1/build/windows/launcher/launch4j/src/net/sf/launch4j/binding/BindingException.java |
---|
1428 | :info:fetch A processing-1.2.1/build/windows/launcher/launch4j/src/net/sf/launch4j/binding/Bindings.java |
---|
1429 | :info:fetch A processing-1.2.1/build/windows/launcher/launch4j/launch4j.exe |
---|
1430 | :info:fetch A processing-1.2.1/build/windows/launcher/launch4j/launch4jc.exe |
---|
1431 | :info:fetch A processing-1.2.1/build/windows/launcher/launch4j/build.xml |
---|
1432 | :info:fetch A processing-1.2.1/build/windows/launcher/launch4j/LICENSE.txt |
---|
1433 | :info:fetch A processing-1.2.1/build/windows/launcher/launch4j/.classpath |
---|
1434 | :info:fetch A processing-1.2.1/build/windows/launcher/launch4j/head |
---|
1435 | :info:fetch A processing-1.2.1/build/windows/launcher/launch4j/head/LICENSE.txt |
---|
1436 | :info:fetch A processing-1.2.1/build/windows/launcher/launch4j/head/consolehead.o |
---|
1437 | :info:fetch A processing-1.2.1/build/windows/launcher/launch4j/head/guihead.o |
---|
1438 | :info:fetch A processing-1.2.1/build/windows/launcher/launch4j/head/head.o |
---|
1439 | :info:fetch A processing-1.2.1/build/windows/launcher/launch4j/w32api |
---|
1440 | :info:fetch A processing-1.2.1/build/windows/launcher/launch4j/w32api/libadvapi32.a |
---|
1441 | :info:fetch A processing-1.2.1/build/windows/launcher/launch4j/w32api/MinGW.LICENSE.txt |
---|
1442 | :info:fetch A processing-1.2.1/build/windows/launcher/launch4j/w32api/libgcc.a |
---|
1443 | :info:fetch A processing-1.2.1/build/windows/launcher/launch4j/w32api/libshell32.a |
---|
1444 | :info:fetch A processing-1.2.1/build/windows/launcher/launch4j/w32api/libmsvcrt.a |
---|
1445 | :info:fetch A processing-1.2.1/build/windows/launcher/launch4j/w32api/crt2.o |
---|
1446 | :info:fetch A processing-1.2.1/build/windows/launcher/launch4j/w32api/libuser32.a |
---|
1447 | :info:fetch A processing-1.2.1/build/windows/launcher/launch4j/w32api/libkernel32.a |
---|
1448 | :info:fetch A processing-1.2.1/build/windows/launcher/launch4j/w32api/libmingw32.a |
---|
1449 | :info:fetch A processing-1.2.1/build/windows/launcher/launch4j/manifest |
---|
1450 | :info:fetch A processing-1.2.1/build/windows/launcher/launch4j/manifest/xp-themes.exe.manifest |
---|
1451 | :info:fetch A processing-1.2.1/build/windows/launcher/launch4j/manifest/uac.exe.manifest |
---|
1452 | :info:fetch A processing-1.2.1/build/windows/launcher/launch4j/lib |
---|
1453 | :info:fetch A processing-1.2.1/build/windows/launcher/launch4j/lib/foxtrot.jar |
---|
1454 | :info:fetch A processing-1.2.1/build/windows/launcher/launch4j/lib/forms.jar |
---|
1455 | :info:fetch A processing-1.2.1/build/windows/launcher/launch4j/lib/XStream.LICENSE.txt |
---|
1456 | :info:fetch A processing-1.2.1/build/windows/launcher/launch4j/lib/looks.jar |
---|
1457 | :info:fetch A processing-1.2.1/build/windows/launcher/launch4j/lib/foxtrot.LICENSE.txt |
---|
1458 | :info:fetch A processing-1.2.1/build/windows/launcher/launch4j/lib/JGoodies.Forms.LICENSE.txt |
---|
1459 | :info:fetch A processing-1.2.1/build/windows/launcher/launch4j/lib/formsrt.jar |
---|
1460 | :info:fetch A processing-1.2.1/build/windows/launcher/launch4j/lib/JGoodies.Looks.LICENSE.txt |
---|
1461 | :info:fetch A processing-1.2.1/build/windows/launcher/launch4j/lib/commons-logging.jar |
---|
1462 | :info:fetch A processing-1.2.1/build/windows/launcher/launch4j/lib/commons-beanutils.jar |
---|
1463 | :info:fetch A processing-1.2.1/build/windows/launcher/launch4j/lib/commons.LICENSE.txt |
---|
1464 | :info:fetch A processing-1.2.1/build/windows/launcher/launch4j/lib/Nuvola.Icon.Theme.LICENSE.txt |
---|
1465 | :info:fetch A processing-1.2.1/build/windows/launcher/launch4j/lib/xstream.jar |
---|
1466 | :info:fetch A processing-1.2.1/build/windows/launcher/launch4j/launch4j.jfpr |
---|
1467 | :info:fetch A processing-1.2.1/build/windows/launcher/launch4j/head_src |
---|
1468 | :info:fetch A processing-1.2.1/build/windows/launcher/launch4j/head_src/LICENSE.txt |
---|
1469 | :info:fetch A processing-1.2.1/build/windows/launcher/launch4j/head_src/head.c |
---|
1470 | :info:fetch A processing-1.2.1/build/windows/launcher/launch4j/head_src/consolehead |
---|
1471 | :info:fetch A processing-1.2.1/build/windows/launcher/launch4j/head_src/consolehead/consolehead.dev |
---|
1472 | :info:fetch A processing-1.2.1/build/windows/launcher/launch4j/head_src/consolehead/consolehead.c |
---|
1473 | :info:fetch A processing-1.2.1/build/windows/launcher/launch4j/head_src/consolehead/Makefile.win |
---|
1474 | :info:fetch A processing-1.2.1/build/windows/launcher/launch4j/head_src/guihead |
---|
1475 | :info:fetch A processing-1.2.1/build/windows/launcher/launch4j/head_src/guihead/guihead.dev |
---|
1476 | :info:fetch A processing-1.2.1/build/windows/launcher/launch4j/head_src/guihead/guihead.c |
---|
1477 | :info:fetch A processing-1.2.1/build/windows/launcher/launch4j/head_src/guihead/Makefile.win |
---|
1478 | :info:fetch A processing-1.2.1/build/windows/launcher/launch4j/head_src/guihead/guihead.h |
---|
1479 | :info:fetch A processing-1.2.1/build/windows/launcher/launch4j/head_src/head.h |
---|
1480 | :info:fetch A processing-1.2.1/build/windows/launcher/launch4j/head_src/resource.h |
---|
1481 | :info:fetch A processing-1.2.1/build/windows/launcher/launch4j/bin |
---|
1482 | :info:fetch A processing-1.2.1/build/windows/launcher/launch4j/bin/ld.exe |
---|
1483 | :info:fetch A processing-1.2.1/build/windows/launcher/launch4j/bin/COPYING |
---|
1484 | :info:fetch A processing-1.2.1/build/windows/launcher/launch4j/bin/windres.exe |
---|
1485 | :info:fetch A processing-1.2.1/build/windows/launcher/launch4j/web |
---|
1486 | :info:fetch A processing-1.2.1/build/windows/launcher/launch4j/web/links.html |
---|
1487 | :info:fetch A processing-1.2.1/build/windows/launcher/launch4j/web/launch4j-use.gif |
---|
1488 | :info:fetch A processing-1.2.1/build/windows/launcher/launch4j/web/style.css |
---|
1489 | :info:fetch A processing-1.2.1/build/windows/launcher/launch4j/web/changelog.html |
---|
1490 | :info:fetch A processing-1.2.1/build/windows/launcher/launch4j/web/index.html |
---|
1491 | :info:fetch A processing-1.2.1/build/windows/launcher/launch4j/web/docs.html |
---|
1492 | :info:fetch A processing-1.2.1/build/windows/launcher/launch4j/web/bullet.gif |
---|
1493 | :info:fetch A processing-1.2.1/build/windows/launcher/launch4j/web/launch4j.gif |
---|
1494 | :info:fetch A processing-1.2.1/build/windows/launcher/launch4j/.settings |
---|
1495 | :info:fetch A processing-1.2.1/build/windows/launcher/launch4j/.settings/org.eclipse.jdt.core.prefs |
---|
1496 | :info:fetch A processing-1.2.1/build/windows/launcher/processing.exe |
---|
1497 | :info:fetch A processing-1.2.1/build/windows/launcher/application.ico |
---|
1498 | :info:fetch A processing-1.2.1/build/howto.txt |
---|
1499 | :info:fetch A processing-1.2.1/build/build.xml |
---|
1500 | :info:fetch A processing-1.2.1/license.txt |
---|
1501 | :info:fetch A processing-1.2.1/.classpath |
---|
1502 | :info:fetch A processing-1.2.1/done.txt |
---|
1503 | :info:fetch A processing-1.2.1/video |
---|
1504 | :info:fetch A processing-1.2.1/video/.classpath |
---|
1505 | :info:fetch A processing-1.2.1/video/library |
---|
1506 | :info:fetch A processing-1.2.1/video/library/export.txt |
---|
1507 | :info:fetch A processing-1.2.1/video/library/.cvsignore |
---|
1508 | :info:fetch A processing-1.2.1/video/.project |
---|
1509 | :info:fetch A processing-1.2.1/video/QTJava.zip |
---|
1510 | :info:fetch A processing-1.2.1/video/src |
---|
1511 | :info:fetch A processing-1.2.1/video/src/processing |
---|
1512 | :info:fetch A processing-1.2.1/video/src/processing/video |
---|
1513 | :info:fetch A processing-1.2.1/video/src/processing/video/Movie.java |
---|
1514 | :info:fetch A processing-1.2.1/video/src/processing/video/MovieMaker.java |
---|
1515 | :info:fetch A processing-1.2.1/video/src/processing/video/Capture.java |
---|
1516 | :info:fetch A processing-1.2.1/video/build.xml |
---|
1517 | :info:fetch A processing-1.2.1/video/.settings |
---|
1518 | :info:fetch A processing-1.2.1/video/.settings/org.eclipse.jdt.core.prefs |
---|
1519 | :info:fetch A processing-1.2.1/video/.settings/org.eclipse.jdt.ui.prefs |
---|
1520 | :info:fetch A processing-1.2.1/pdf |
---|
1521 | :info:fetch A processing-1.2.1/pdf/.classpath |
---|
1522 | :info:fetch A processing-1.2.1/pdf/itext-src.zip |
---|
1523 | :info:fetch A processing-1.2.1/pdf/library |
---|
1524 | :info:fetch A processing-1.2.1/pdf/library/export.txt |
---|
1525 | :info:fetch A processing-1.2.1/pdf/library/itext.jar |
---|
1526 | :info:fetch A processing-1.2.1/pdf/library/.cvsignore |
---|
1527 | :info:fetch A processing-1.2.1/pdf/.project |
---|
1528 | :info:fetch A processing-1.2.1/pdf/src |
---|
1529 | :info:fetch A processing-1.2.1/pdf/src/processing |
---|
1530 | :info:fetch A processing-1.2.1/pdf/src/processing/pdf |
---|
1531 | :info:fetch A processing-1.2.1/pdf/src/processing/pdf/PGraphicsPDF.java |
---|
1532 | :info:fetch A processing-1.2.1/pdf/build.xml |
---|
1533 | :info:fetch A processing-1.2.1/pdf/.settings |
---|
1534 | :info:fetch A processing-1.2.1/pdf/.settings/org.eclipse.jdt.core.prefs |
---|
1535 | :info:fetch A processing-1.2.1/pdf/.settings/org.eclipse.jdt.ui.prefs |
---|
1536 | :info:fetch A processing-1.2.1/misc.txt |
---|
1537 | :info:fetch A processing-1.2.1/.settings |
---|
1538 | :info:fetch A processing-1.2.1/.settings/org.eclipse.jdt.core.prefs |
---|
1539 | :info:fetch A processing-1.2.1/.settings/org.eclipse.jdt.ui.prefs |
---|
1540 | :info:fetch Exported revision 10844. |
---|
1541 | :debug:fetch Privilege de-escalation not attempted as not running as root. |
---|
1542 | :debug:checksum checksum phase started at Tue Dec 29 22:08:04 CST 2015 |
---|
1543 | :notice:checksum ---> Verifying checksums for processing |
---|
1544 | :debug:checksum Executing org.macports.checksum (processing) |
---|
1545 | :debug:checksum Privilege de-escalation not attempted as not running as root. |
---|
1546 | :debug:extract extract phase started at Tue Dec 29 22:08:04 CST 2015 |
---|
1547 | :notice:extract ---> Extracting processing |
---|
1548 | :debug:extract Executing org.macports.extract (processing) |
---|
1549 | :debug:extract Privilege de-escalation not attempted as not running as root. |
---|
1550 | :debug:patch patch phase started at Tue Dec 29 22:08:04 CST 2015 |
---|
1551 | :debug:patch Executing org.macports.patch (processing) |
---|
1552 | :debug:patch Privilege de-escalation not attempted as not running as root. |
---|
1553 | :debug:configure configure phase started at Tue Dec 29 22:08:04 CST 2015 |
---|
1554 | :notice:configure ---> Configuring processing |
---|
1555 | :debug:configure Using compiler 'Xcode Clang' |
---|
1556 | :debug:configure Executing org.macports.configure (processing) |
---|
1557 | :debug:configure Privilege de-escalation not attempted as not running as root. |
---|
1558 | :debug:build build phase started at Tue Dec 29 22:08:04 CST 2015 |
---|
1559 | :notice:build ---> Building processing |
---|
1560 | :debug:build Executing org.macports.build (processing) |
---|
1561 | :debug:build Environment: |
---|
1562 | CC_PRINT_OPTIONS='YES' |
---|
1563 | CC_PRINT_OPTIONS_FILE='/opt/local/var/macports/build/_opt_local_var_macports_sources_rsync.macports.org_release_tarballs_ports_lang_processing/processing/work/.CC_PRINT_OPTIONS' |
---|
1564 | CPATH='/opt/local/include' |
---|
1565 | LIBRARY_PATH='/opt/local/lib' |
---|
1566 | MACOSX_DEPLOYMENT_TARGET='10.11' |
---|
1567 | :debug:build Assembled command: 'cd "/opt/local/var/macports/build/_opt_local_var_macports_sources_rsync.macports.org_release_tarballs_ports_lang_processing/processing/work/processing-1.2.1/build" && /opt/local/bin/ant macosx-build' |
---|
1568 | :debug:build Executing command line: cd "/opt/local/var/macports/build/_opt_local_var_macports_sources_rsync.macports.org_release_tarballs_ports_lang_processing/processing/work/processing-1.2.1/build" && /opt/local/bin/ant macosx-build |
---|
1569 | :info:build Buildfile: /opt/local/var/macports/build/_opt_local_var_macports_sources_rsync.macports.org_release_tarballs_ports_lang_processing/processing/work/processing-1.2.1/build/build.xml |
---|
1570 | :info:build |
---|
1571 | :info:build revision-check: |
---|
1572 | :info:build |
---|
1573 | :info:build macosx-checkos: |
---|
1574 | :info:build |
---|
1575 | :info:build subprojects-build: |
---|
1576 | :info:build |
---|
1577 | :info:build compile: |
---|
1578 | :info:build [methods] No changes to PApplet API. |
---|
1579 | :info:build [mkdir] Created dir: /opt/local/var/macports/build/_opt_local_var_macports_sources_rsync.macports.org_release_tarballs_ports_lang_processing/processing/work/processing-1.2.1/core/bin |
---|
1580 | :info:build [javac] Compiling 34 source files to /opt/local/var/macports/build/_opt_local_var_macports_sources_rsync.macports.org_release_tarballs_ports_lang_processing/processing/work/processing-1.2.1/core/bin |
---|
1581 | :info:build [javac] |
---|
1582 | :info:build [javac] WARNING |
---|
1583 | :info:build [javac] |
---|
1584 | :info:build [javac] The -source switch defaults to 1.8 in JDK 1.8. |
---|
1585 | :info:build [javac] If you specify -target 1.5 you now must also specify -source 1.5. |
---|
1586 | :info:build [javac] Ant will implicitly add -source 1.5 for you. Please change your build file. |
---|
1587 | :info:build [javac] warning: [options] bootstrap class path not set in conjunction with -source 1.5 |
---|
1588 | :info:build [javac] warning: [options] source value 1.5 is obsolete and will be removed in a future release |
---|
1589 | :info:build [javac] warning: [options] target value 1.5 is obsolete and will be removed in a future release |
---|
1590 | :info:build [javac] warning: [options] To suppress warnings about obsolete options, use -Xlint:-options. |
---|
1591 | :info:build [javac] 4 warnings |
---|
1592 | :info:build |
---|
1593 | :info:build build: |
---|
1594 | :info:build [jar] Building jar: /opt/local/var/macports/build/_opt_local_var_macports_sources_rsync.macports.org_release_tarballs_ports_lang_processing/processing/work/processing-1.2.1/core/core.jar |
---|
1595 | :info:build |
---|
1596 | :info:build preproc: |
---|
1597 | :info:build [antlr] ANTLR Parser Generator Version 2.7.7 (2006-11-01) 1989-2005 |
---|
1598 | :info:build [antlr] /opt/local/var/macports/build/_opt_local_var_macports_sources_rsync.macports.org_release_tarballs_ports_lang_processing/processing/work/processing-1.2.1/app/grammars/java15.g:941: warning:Syntactic predicate superfluous for single alternative |
---|
1599 | :info:build [antlr] /opt/local/var/macports/build/_opt_local_var_macports_sources_rsync.macports.org_release_tarballs_ports_lang_processing/processing/work/processing-1.2.1/app/grammars/java15.g:1397: warning:empty alternative makes no sense in (...)* or (...)+ |
---|
1600 | :info:build [antlr] ANTLR Parser Generator Version 2.7.7 (2006-11-01) 1989-2005 |
---|
1601 | :info:build [antlr] /opt/local/var/macports/build/_opt_local_var_macports_sources_rsync.macports.org_release_tarballs_ports_lang_processing/processing/work/processing-1.2.1/app/generated/processing/app/antlr/expandedpde.g:1155: warning:empty alternative makes no sense in (...)* or (...)+ |
---|
1602 | :info:build [antlr] /opt/local/var/macports/build/_opt_local_var_macports_sources_rsync.macports.org_release_tarballs_ports_lang_processing/processing/work/processing-1.2.1/app/generated/processing/app/antlr/expandedpde.g:804: warning:Syntactic predicate superfluous for single alternative |
---|
1603 | :info:build |
---|
1604 | :info:build compile: |
---|
1605 | :info:build [mkdir] Created dir: /opt/local/var/macports/build/_opt_local_var_macports_sources_rsync.macports.org_release_tarballs_ports_lang_processing/processing/work/processing-1.2.1/app/bin |
---|
1606 | :info:build [javac] Compiling 86 source files to /opt/local/var/macports/build/_opt_local_var_macports_sources_rsync.macports.org_release_tarballs_ports_lang_processing/processing/work/processing-1.2.1/app/bin |
---|
1607 | :info:build [javac] |
---|
1608 | :info:build [javac] WARNING |
---|
1609 | :info:build [javac] |
---|
1610 | :info:build [javac] The -source switch defaults to 1.8 in JDK 1.8. |
---|
1611 | :info:build [javac] If you specify -target 1.5 you now must also specify -source 1.5. |
---|
1612 | :info:build [javac] Ant will implicitly add -source 1.5 for you. Please change your build file. |
---|
1613 | :info:build [javac] warning: [options] bootstrap class path not set in conjunction with -source 1.5 |
---|
1614 | :info:build [javac] warning: [options] source value 1.5 is obsolete and will be removed in a future release |
---|
1615 | :info:build [javac] warning: [options] target value 1.5 is obsolete and will be removed in a future release |
---|
1616 | :info:build [javac] warning: [options] To suppress warnings about obsolete options, use -Xlint:-options. |
---|
1617 | :info:build [javac] /opt/local/var/macports/build/_opt_local_var_macports_sources_rsync.macports.org_release_tarballs_ports_lang_processing/processing/work/processing-1.2.1/app/src/processing/app/debug/Runner.java:33: error: package com.sun.jdi does not exist |
---|
1618 | :info:build [javac] import com.sun.jdi.*; |
---|
1619 | :info:build [javac] ^ |
---|
1620 | :info:build [javac] /opt/local/var/macports/build/_opt_local_var_macports_sources_rsync.macports.org_release_tarballs_ports_lang_processing/processing/work/processing-1.2.1/app/src/processing/app/debug/Runner.java:34: error: package com.sun.jdi.connect does not exist |
---|
1621 | :info:build [javac] import com.sun.jdi.connect.*; |
---|
1622 | :info:build [javac] ^ |
---|
1623 | :info:build [javac] /opt/local/var/macports/build/_opt_local_var_macports_sources_rsync.macports.org_release_tarballs_ports_lang_processing/processing/work/processing-1.2.1/app/src/processing/app/debug/Runner.java:35: error: package com.sun.jdi.event does not exist |
---|
1624 | :info:build [javac] import com.sun.jdi.event.ExceptionEvent; |
---|
1625 | :info:build [javac] ^ |
---|
1626 | :info:build [javac] /opt/local/var/macports/build/_opt_local_var_macports_sources_rsync.macports.org_release_tarballs_ports_lang_processing/processing/work/processing-1.2.1/app/src/processing/app/debug/Runner.java:55: error: cannot find symbol |
---|
1627 | :info:build [javac] protected VirtualMachine vm; |
---|
1628 | :info:build [javac] ^ |
---|
1629 | :info:build [javac] symbol: class VirtualMachine |
---|
1630 | :info:build [javac] location: class Runner |
---|
1631 | :info:build [javac] /opt/local/var/macports/build/_opt_local_var_macports_sources_rsync.macports.org_release_tarballs_ports_lang_processing/processing/work/processing-1.2.1/app/src/processing/app/debug/Runner.java:256: error: cannot find symbol |
---|
1632 | :info:build [javac] protected VirtualMachine launchVirtualMachine(String[] vmParams, |
---|
1633 | :info:build [javac] ^ |
---|
1634 | :info:build [javac] symbol: class VirtualMachine |
---|
1635 | :info:build [javac] location: class Runner |
---|
1636 | :info:build [javac] /opt/local/var/macports/build/_opt_local_var_macports_sources_rsync.macports.org_release_tarballs_ports_lang_processing/processing/work/processing-1.2.1/app/src/processing/app/debug/Runner.java:450: error: cannot find symbol |
---|
1637 | :info:build [javac] protected Connector findConnector(String connectorName) { |
---|
1638 | :info:build [javac] ^ |
---|
1639 | :info:build [javac] symbol: class Connector |
---|
1640 | :info:build [javac] location: class Runner |
---|
1641 | :info:build [javac] /opt/local/var/macports/build/_opt_local_var_macports_sources_rsync.macports.org_release_tarballs_ports_lang_processing/processing/work/processing-1.2.1/app/src/processing/app/debug/Runner.java:471: error: cannot find symbol |
---|
1642 | :info:build [javac] public void exception(ExceptionEvent event) { |
---|
1643 | :info:build [javac] ^ |
---|
1644 | :info:build [javac] symbol: class ExceptionEvent |
---|
1645 | :info:build [javac] location: class Runner |
---|
1646 | :info:build [javac] /opt/local/var/macports/build/_opt_local_var_macports_sources_rsync.macports.org_release_tarballs_ports_lang_processing/processing/work/processing-1.2.1/app/src/processing/app/debug/Runner.java:557: error: cannot find symbol |
---|
1647 | :info:build [javac] protected void reportException(String message, ThreadReference thread) { |
---|
1648 | :info:build [javac] ^ |
---|
1649 | :info:build [javac] symbol: class ThreadReference |
---|
1650 | :info:build [javac] location: class Runner |
---|
1651 | :info:build [javac] /opt/local/var/macports/build/_opt_local_var_macports_sources_rsync.macports.org_release_tarballs_ports_lang_processing/processing/work/processing-1.2.1/app/src/processing/app/debug/Runner.java:568: error: cannot find symbol |
---|
1652 | :info:build [javac] RunnerException findException(String message, ThreadReference thread) { |
---|
1653 | :info:build [javac] ^ |
---|
1654 | :info:build [javac] symbol: class ThreadReference |
---|
1655 | :info:build [javac] location: class Runner |
---|
1656 | :info:build [javac] /opt/local/var/macports/build/_opt_local_var_macports_sources_rsync.macports.org_release_tarballs_ports_lang_processing/processing/work/processing-1.2.1/app/src/processing/app/debug/EventThread.java:43: error: package com.sun.jdi does not exist |
---|
1657 | :info:build [javac] import com.sun.jdi.*; |
---|
1658 | :info:build [javac] ^ |
---|
1659 | :info:build [javac] /opt/local/var/macports/build/_opt_local_var_macports_sources_rsync.macports.org_release_tarballs_ports_lang_processing/processing/work/processing-1.2.1/app/src/processing/app/debug/EventThread.java:44: error: package com.sun.jdi.event does not exist |
---|
1660 | :info:build [javac] import com.sun.jdi.event.*; |
---|
1661 | :info:build [javac] ^ |
---|
1662 | :info:build [javac] /opt/local/var/macports/build/_opt_local_var_macports_sources_rsync.macports.org_release_tarballs_ports_lang_processing/processing/work/processing-1.2.1/app/src/processing/app/debug/EventThread.java:45: error: package com.sun.jdi.request does not exist |
---|
1663 | :info:build [javac] import com.sun.jdi.request.*; |
---|
1664 | :info:build [javac] ^ |
---|
1665 | :info:build [javac] /opt/local/var/macports/build/_opt_local_var_macports_sources_rsync.macports.org_release_tarballs_ports_lang_processing/processing/work/processing-1.2.1/app/src/processing/app/debug/EventThread.java:56: error: cannot find symbol |
---|
1666 | :info:build [javac] private final VirtualMachine vm; // Running VM |
---|
1667 | :info:build [javac] ^ |
---|
1668 | :info:build [javac] symbol: class VirtualMachine |
---|
1669 | :info:build [javac] location: class EventThread |
---|
1670 | :info:build [javac] /opt/local/var/macports/build/_opt_local_var_macports_sources_rsync.macports.org_release_tarballs_ports_lang_processing/processing/work/processing-1.2.1/app/src/processing/app/debug/EventThread.java:69: error: cannot find symbol |
---|
1671 | :info:build [javac] public EventThread(Runner parent, VirtualMachine vm, String[] excludes, PrintWriter writer) { |
---|
1672 | :info:build [javac] ^ |
---|
1673 | :info:build [javac] symbol: class VirtualMachine |
---|
1674 | :info:build [javac] location: class EventThread |
---|
1675 | :info:build [javac] /opt/local/var/macports/build/_opt_local_var_macports_sources_rsync.macports.org_release_tarballs_ports_lang_processing/processing/work/processing-1.2.1/app/src/processing/app/debug/EventThread.java:241: error: cannot find symbol |
---|
1676 | :info:build [javac] ThreadTrace threadTrace(ThreadReference thread) { |
---|
1677 | :info:build [javac] ^ |
---|
1678 | :info:build [javac] symbol: class ThreadReference |
---|
1679 | :info:build [javac] location: class EventThread |
---|
1680 | :info:build [javac] /opt/local/var/macports/build/_opt_local_var_macports_sources_rsync.macports.org_release_tarballs_ports_lang_processing/processing/work/processing-1.2.1/app/src/processing/app/debug/EventThread.java:253: error: cannot find symbol |
---|
1681 | :info:build [javac] private void handleEvent(Event event) { |
---|
1682 | :info:build [javac] ^ |
---|
1683 | :info:build [javac] symbol: class Event |
---|
1684 | :info:build [javac] location: class EventThread |
---|
1685 | :info:build [javac] /opt/local/var/macports/build/_opt_local_var_macports_sources_rsync.macports.org_release_tarballs_ports_lang_processing/processing/work/processing-1.2.1/app/src/processing/app/debug/EventThread.java:306: error: cannot find symbol |
---|
1686 | :info:build [javac] private void vmStartEvent(VMStartEvent event) { |
---|
1687 | :info:build [javac] ^ |
---|
1688 | :info:build [javac] symbol: class VMStartEvent |
---|
1689 | :info:build [javac] location: class EventThread |
---|
1690 | :info:build [javac] /opt/local/var/macports/build/_opt_local_var_macports_sources_rsync.macports.org_release_tarballs_ports_lang_processing/processing/work/processing-1.2.1/app/src/processing/app/debug/EventThread.java:311: error: cannot find symbol |
---|
1691 | :info:build [javac] private void methodEntryEvent(MethodEntryEvent event) { |
---|
1692 | :info:build [javac] ^ |
---|
1693 | :info:build [javac] symbol: class MethodEntryEvent |
---|
1694 | :info:build [javac] location: class EventThread |
---|
1695 | :info:build [javac] /opt/local/var/macports/build/_opt_local_var_macports_sources_rsync.macports.org_release_tarballs_ports_lang_processing/processing/work/processing-1.2.1/app/src/processing/app/debug/EventThread.java:316: error: cannot find symbol |
---|
1696 | :info:build [javac] private void methodExitEvent(MethodExitEvent event) { |
---|
1697 | :info:build [javac] ^ |
---|
1698 | :info:build [javac] symbol: class MethodExitEvent |
---|
1699 | :info:build [javac] location: class EventThread |
---|
1700 | :info:build [javac] /opt/local/var/macports/build/_opt_local_var_macports_sources_rsync.macports.org_release_tarballs_ports_lang_processing/processing/work/processing-1.2.1/app/src/processing/app/debug/EventThread.java:321: error: cannot find symbol |
---|
1701 | :info:build [javac] private void stepEvent(StepEvent event) { |
---|
1702 | :info:build [javac] ^ |
---|
1703 | :info:build [javac] symbol: class StepEvent |
---|
1704 | :info:build [javac] location: class EventThread |
---|
1705 | :info:build [javac] /opt/local/var/macports/build/_opt_local_var_macports_sources_rsync.macports.org_release_tarballs_ports_lang_processing/processing/work/processing-1.2.1/app/src/processing/app/debug/EventThread.java:326: error: cannot find symbol |
---|
1706 | :info:build [javac] private void fieldWatchEvent(ModificationWatchpointEvent event) { |
---|
1707 | :info:build [javac] ^ |
---|
1708 | :info:build [javac] symbol: class ModificationWatchpointEvent |
---|
1709 | :info:build [javac] location: class EventThread |
---|
1710 | :info:build [javac] /opt/local/var/macports/build/_opt_local_var_macports_sources_rsync.macports.org_release_tarballs_ports_lang_processing/processing/work/processing-1.2.1/app/src/processing/app/debug/EventThread.java:330: error: cannot find symbol |
---|
1711 | :info:build [javac] void threadDeathEvent(ThreadDeathEvent event) { |
---|
1712 | :info:build [javac] ^ |
---|
1713 | :info:build [javac] symbol: class ThreadDeathEvent |
---|
1714 | :info:build [javac] location: class EventThread |
---|
1715 | :info:build [javac] /opt/local/var/macports/build/_opt_local_var_macports_sources_rsync.macports.org_release_tarballs_ports_lang_processing/processing/work/processing-1.2.1/app/src/processing/app/debug/EventThread.java:341: error: cannot find symbol |
---|
1716 | :info:build [javac] private void classPrepareEvent(ClassPrepareEvent event) { |
---|
1717 | :info:build [javac] ^ |
---|
1718 | :info:build [javac] symbol: class ClassPrepareEvent |
---|
1719 | :info:build [javac] location: class EventThread |
---|
1720 | :info:build [javac] /opt/local/var/macports/build/_opt_local_var_macports_sources_rsync.macports.org_release_tarballs_ports_lang_processing/processing/work/processing-1.2.1/app/src/processing/app/debug/EventThread.java:362: error: cannot find symbol |
---|
1721 | :info:build [javac] private void exceptionEvent(ExceptionEvent event) { |
---|
1722 | :info:build [javac] ^ |
---|
1723 | :info:build [javac] symbol: class ExceptionEvent |
---|
1724 | :info:build [javac] location: class EventThread |
---|
1725 | :info:build [javac] /opt/local/var/macports/build/_opt_local_var_macports_sources_rsync.macports.org_release_tarballs_ports_lang_processing/processing/work/processing-1.2.1/app/src/processing/app/debug/EventThread.java:388: error: cannot find symbol |
---|
1726 | :info:build [javac] public void vmDeathEvent(VMDeathEvent event) { |
---|
1727 | :info:build [javac] ^ |
---|
1728 | :info:build [javac] symbol: class VMDeathEvent |
---|
1729 | :info:build [javac] location: class EventThread |
---|
1730 | :info:build [javac] /opt/local/var/macports/build/_opt_local_var_macports_sources_rsync.macports.org_release_tarballs_ports_lang_processing/processing/work/processing-1.2.1/app/src/processing/app/debug/EventThread.java:396: error: cannot find symbol |
---|
1731 | :info:build [javac] public void vmDisconnectEvent(VMDisconnectEvent event) { |
---|
1732 | :info:build [javac] ^ |
---|
1733 | :info:build [javac] symbol: class VMDisconnectEvent |
---|
1734 | :info:build [javac] location: class EventThread |
---|
1735 | :info:build [javac] /opt/local/var/macports/build/_opt_local_var_macports_sources_rsync.macports.org_release_tarballs_ports_lang_processing/processing/work/processing-1.2.1/app/src/processing/app/debug/EventThread.java:161: error: cannot find symbol |
---|
1736 | :info:build [javac] final ThreadReference thread; |
---|
1737 | :info:build [javac] ^ |
---|
1738 | :info:build [javac] symbol: class ThreadReference |
---|
1739 | :info:build [javac] location: class EventThread.ThreadTrace |
---|
1740 | :info:build [javac] /opt/local/var/macports/build/_opt_local_var_macports_sources_rsync.macports.org_release_tarballs_ports_lang_processing/processing/work/processing-1.2.1/app/src/processing/app/debug/EventThread.java:166: error: cannot find symbol |
---|
1741 | :info:build [javac] ThreadTrace(ThreadReference thread) { |
---|
1742 | :info:build [javac] ^ |
---|
1743 | :info:build [javac] symbol: class ThreadReference |
---|
1744 | :info:build [javac] location: class EventThread.ThreadTrace |
---|
1745 | :info:build [javac] /opt/local/var/macports/build/_opt_local_var_macports_sources_rsync.macports.org_release_tarballs_ports_lang_processing/processing/work/processing-1.2.1/app/src/processing/app/debug/EventThread.java:182: error: cannot find symbol |
---|
1746 | :info:build [javac] void methodEntryEvent(MethodEntryEvent event) { |
---|
1747 | :info:build [javac] ^ |
---|
1748 | :info:build [javac] symbol: class MethodEntryEvent |
---|
1749 | :info:build [javac] location: class EventThread.ThreadTrace |
---|
1750 | :info:build [javac] /opt/local/var/macports/build/_opt_local_var_macports_sources_rsync.macports.org_release_tarballs_ports_lang_processing/processing/work/processing-1.2.1/app/src/processing/app/debug/EventThread.java:188: error: cannot find symbol |
---|
1751 | :info:build [javac] void methodExitEvent(MethodExitEvent event) { |
---|
1752 | :info:build [javac] ^ |
---|
1753 | :info:build [javac] symbol: class MethodExitEvent |
---|
1754 | :info:build [javac] location: class EventThread.ThreadTrace |
---|
1755 | :info:build [javac] /opt/local/var/macports/build/_opt_local_var_macports_sources_rsync.macports.org_release_tarballs_ports_lang_processing/processing/work/processing-1.2.1/app/src/processing/app/debug/EventThread.java:192: error: cannot find symbol |
---|
1756 | :info:build [javac] void fieldWatchEvent(ModificationWatchpointEvent event) { |
---|
1757 | :info:build [javac] ^ |
---|
1758 | :info:build [javac] symbol: class ModificationWatchpointEvent |
---|
1759 | :info:build [javac] location: class EventThread.ThreadTrace |
---|
1760 | :info:build [javac] /opt/local/var/macports/build/_opt_local_var_macports_sources_rsync.macports.org_release_tarballs_ports_lang_processing/processing/work/processing-1.2.1/app/src/processing/app/debug/EventThread.java:198: error: cannot find symbol |
---|
1761 | :info:build [javac] void exceptionEvent(ExceptionEvent event) { |
---|
1762 | :info:build [javac] ^ |
---|
1763 | :info:build [javac] symbol: class ExceptionEvent |
---|
1764 | :info:build [javac] location: class EventThread.ThreadTrace |
---|
1765 | :info:build [javac] /opt/local/var/macports/build/_opt_local_var_macports_sources_rsync.macports.org_release_tarballs_ports_lang_processing/processing/work/processing-1.2.1/app/src/processing/app/debug/EventThread.java:215: error: cannot find symbol |
---|
1766 | :info:build [javac] void stepEvent(StepEvent event) { |
---|
1767 | :info:build [javac] ^ |
---|
1768 | :info:build [javac] symbol: class StepEvent |
---|
1769 | :info:build [javac] location: class EventThread.ThreadTrace |
---|
1770 | :info:build [javac] /opt/local/var/macports/build/_opt_local_var_macports_sources_rsync.macports.org_release_tarballs_ports_lang_processing/processing/work/processing-1.2.1/app/src/processing/app/debug/EventThread.java:231: error: cannot find symbol |
---|
1771 | :info:build [javac] void threadDeathEvent(ThreadDeathEvent event) { |
---|
1772 | :info:build [javac] ^ |
---|
1773 | :info:build [javac] symbol: class ThreadDeathEvent |
---|
1774 | :info:build [javac] location: class EventThread.ThreadTrace |
---|
1775 | :info:build [javac] /opt/local/var/macports/build/_opt_local_var_macports_sources_rsync.macports.org_release_tarballs_ports_lang_processing/processing/work/processing-1.2.1/app/src/processing/app/debug/Runner.java:259: error: cannot find symbol |
---|
1776 | :info:build [javac] LaunchingConnector connector = (LaunchingConnector) |
---|
1777 | :info:build [javac] ^ |
---|
1778 | :info:build [javac] symbol: class LaunchingConnector |
---|
1779 | :info:build [javac] location: class Runner |
---|
1780 | :info:build [javac] /opt/local/var/macports/build/_opt_local_var_macports_sources_rsync.macports.org_release_tarballs_ports_lang_processing/processing/work/processing-1.2.1/app/src/processing/app/debug/Runner.java:259: error: cannot find symbol |
---|
1781 | :info:build [javac] LaunchingConnector connector = (LaunchingConnector) |
---|
1782 | :info:build [javac] ^ |
---|
1783 | :info:build [javac] symbol: class LaunchingConnector |
---|
1784 | :info:build [javac] location: class Runner |
---|
1785 | :info:build [javac] /opt/local/var/macports/build/_opt_local_var_macports_sources_rsync.macports.org_release_tarballs_ports_lang_processing/processing/work/processing-1.2.1/app/src/processing/app/debug/Runner.java:266: error: package Connector does not exist |
---|
1786 | :info:build [javac] Connector.Argument commandArg = |
---|
1787 | :info:build [javac] ^ |
---|
1788 | :info:build [javac] /opt/local/var/macports/build/_opt_local_var_macports_sources_rsync.macports.org_release_tarballs_ports_lang_processing/processing/work/processing-1.2.1/app/src/processing/app/debug/Runner.java:267: error: package Connector does not exist |
---|
1789 | :info:build [javac] (Connector.Argument)arguments.get("command"); |
---|
1790 | :info:build [javac] ^ |
---|
1791 | :info:build [javac] /opt/local/var/macports/build/_opt_local_var_macports_sources_rsync.macports.org_release_tarballs_ports_lang_processing/processing/work/processing-1.2.1/app/src/processing/app/debug/Runner.java:301: error: package Connector does not exist |
---|
1792 | :info:build [javac] Connector.Argument addressArg = |
---|
1793 | :info:build [javac] ^ |
---|
1794 | :info:build [javac] /opt/local/var/macports/build/_opt_local_var_macports_sources_rsync.macports.org_release_tarballs_ports_lang_processing/processing/work/processing-1.2.1/app/src/processing/app/debug/Runner.java:302: error: package Connector does not exist |
---|
1795 | :info:build [javac] (Connector.Argument)arguments.get("address"); |
---|
1796 | :info:build [javac] ^ |
---|
1797 | :info:build [javac] /opt/local/var/macports/build/_opt_local_var_macports_sources_rsync.macports.org_release_tarballs_ports_lang_processing/processing/work/processing-1.2.1/app/src/processing/app/debug/Runner.java:315: error: cannot find symbol |
---|
1798 | :info:build [javac] } catch (IllegalConnectorArgumentsException exc) { |
---|
1799 | :info:build [javac] ^ |
---|
1800 | :info:build [javac] symbol: class IllegalConnectorArgumentsException |
---|
1801 | :info:build [javac] location: class Runner |
---|
1802 | :info:build [javac] /opt/local/var/macports/build/_opt_local_var_macports_sources_rsync.macports.org_release_tarballs_ports_lang_processing/processing/work/processing-1.2.1/app/src/processing/app/debug/Runner.java:317: error: cannot find symbol |
---|
1803 | :info:build [javac] } catch (VMStartException exc) { |
---|
1804 | :info:build [javac] ^ |
---|
1805 | :info:build [javac] symbol: class VMStartException |
---|
1806 | :info:build [javac] location: class Runner |
---|
1807 | :info:build [javac] /opt/local/var/macports/build/_opt_local_var_macports_sources_rsync.macports.org_release_tarballs_ports_lang_processing/processing/work/processing-1.2.1/app/src/processing/app/debug/Runner.java:451: error: cannot find symbol |
---|
1808 | :info:build [javac] List connectors = Bootstrap.virtualMachineManager().allConnectors(); |
---|
1809 | :info:build [javac] ^ |
---|
1810 | :info:build [javac] symbol: variable Bootstrap |
---|
1811 | :info:build [javac] location: class Runner |
---|
1812 | :info:build [javac] /opt/local/var/macports/build/_opt_local_var_macports_sources_rsync.macports.org_release_tarballs_ports_lang_processing/processing/work/processing-1.2.1/app/src/processing/app/debug/Runner.java:462: error: cannot find symbol |
---|
1813 | :info:build [javac] Connector connector = (Connector)iter.next(); |
---|
1814 | :info:build [javac] ^ |
---|
1815 | :info:build [javac] symbol: class Connector |
---|
1816 | :info:build [javac] location: class Runner |
---|
1817 | :info:build [javac] /opt/local/var/macports/build/_opt_local_var_macports_sources_rsync.macports.org_release_tarballs_ports_lang_processing/processing/work/processing-1.2.1/app/src/processing/app/debug/Runner.java:462: error: cannot find symbol |
---|
1818 | :info:build [javac] Connector connector = (Connector)iter.next(); |
---|
1819 | :info:build [javac] ^ |
---|
1820 | :info:build [javac] symbol: class Connector |
---|
1821 | :info:build [javac] location: class Runner |
---|
1822 | :info:build [javac] /opt/local/var/macports/build/_opt_local_var_macports_sources_rsync.macports.org_release_tarballs_ports_lang_processing/processing/work/processing-1.2.1/app/src/processing/app/debug/Runner.java:473: error: cannot find symbol |
---|
1823 | :info:build [javac] ObjectReference or = event.exception(); |
---|
1824 | :info:build [javac] ^ |
---|
1825 | :info:build [javac] symbol: class ObjectReference |
---|
1826 | :info:build [javac] location: class Runner |
---|
1827 | :info:build [javac] /opt/local/var/macports/build/_opt_local_var_macports_sources_rsync.macports.org_release_tarballs_ports_lang_processing/processing/work/processing-1.2.1/app/src/processing/app/debug/Runner.java:474: error: cannot find symbol |
---|
1828 | :info:build [javac] ReferenceType rt = or.referenceType(); |
---|
1829 | :info:build [javac] ^ |
---|
1830 | :info:build [javac] symbol: class ReferenceType |
---|
1831 | :info:build [javac] location: class Runner |
---|
1832 | :info:build [javac] /opt/local/var/macports/build/_opt_local_var_macports_sources_rsync.macports.org_release_tarballs_ports_lang_processing/processing/work/processing-1.2.1/app/src/processing/app/debug/Runner.java:477: error: cannot find symbol |
---|
1833 | :info:build [javac] Field messageField = rt.fieldByName("detailMessage"); |
---|
1834 | :info:build [javac] ^ |
---|
1835 | :info:build [javac] symbol: class Field |
---|
1836 | :info:build [javac] location: class Runner |
---|
1837 | :info:build [javac] /opt/local/var/macports/build/_opt_local_var_macports_sources_rsync.macports.org_release_tarballs_ports_lang_processing/processing/work/processing-1.2.1/app/src/processing/app/debug/Runner.java:479: error: cannot find symbol |
---|
1838 | :info:build [javac] Value messageValue = or.getValue(messageField); |
---|
1839 | :info:build [javac] ^ |
---|
1840 | :info:build [javac] symbol: class Value |
---|
1841 | :info:build [javac] location: class Runner |
---|
1842 | :info:build [javac] /opt/local/var/macports/build/_opt_local_var_macports_sources_rsync.macports.org_release_tarballs_ports_lang_processing/processing/work/processing-1.2.1/app/src/processing/app/debug/Runner.java:575: error: cannot find symbol |
---|
1843 | :info:build [javac] List<StackFrame> frames = thread.frames(); |
---|
1844 | :info:build [javac] ^ |
---|
1845 | :info:build [javac] symbol: class StackFrame |
---|
1846 | :info:build [javac] location: class Runner |
---|
1847 | :info:build [javac] /opt/local/var/macports/build/_opt_local_var_macports_sources_rsync.macports.org_release_tarballs_ports_lang_processing/processing/work/processing-1.2.1/app/src/processing/app/debug/Runner.java:576: error: cannot find symbol |
---|
1848 | :info:build [javac] for (StackFrame frame : frames) { |
---|
1849 | :info:build [javac] ^ |
---|
1850 | :info:build [javac] symbol: class StackFrame |
---|
1851 | :info:build [javac] location: class Runner |
---|
1852 | :info:build [javac] /opt/local/var/macports/build/_opt_local_var_macports_sources_rsync.macports.org_release_tarballs_ports_lang_processing/processing/work/processing-1.2.1/app/src/processing/app/debug/Runner.java:578: error: cannot find symbol |
---|
1853 | :info:build [javac] Location location = frame.location(); |
---|
1854 | :info:build [javac] ^ |
---|
1855 | :info:build [javac] symbol: class Location |
---|
1856 | :info:build [javac] location: class Runner |
---|
1857 | :info:build [javac] /opt/local/var/macports/build/_opt_local_var_macports_sources_rsync.macports.org_release_tarballs_ports_lang_processing/processing/work/processing-1.2.1/app/src/processing/app/debug/Runner.java:587: error: cannot find symbol |
---|
1858 | :info:build [javac] } catch (AbsentInformationException e) { |
---|
1859 | :info:build [javac] ^ |
---|
1860 | :info:build [javac] symbol: class AbsentInformationException |
---|
1861 | :info:build [javac] location: class Runner |
---|
1862 | :info:build [javac] /opt/local/var/macports/build/_opt_local_var_macports_sources_rsync.macports.org_release_tarballs_ports_lang_processing/processing/work/processing-1.2.1/app/src/processing/app/debug/Runner.java:597: error: cannot find symbol |
---|
1863 | :info:build [javac] } catch (IncompatibleThreadStateException e) { |
---|
1864 | :info:build [javac] ^ |
---|
1865 | :info:build [javac] symbol: class IncompatibleThreadStateException |
---|
1866 | :info:build [javac] location: class Runner |
---|
1867 | :info:build [javac] /opt/local/var/macports/build/_opt_local_var_macports_sources_rsync.macports.org_release_tarballs_ports_lang_processing/processing/work/processing-1.2.1/app/src/processing/app/debug/Runner.java:618: error: package com.sun.jdi does not exist |
---|
1868 | :info:build [javac] } catch (com.sun.jdi.VMDisconnectedException vmde) { |
---|
1869 | :info:build [javac] ^ |
---|
1870 | :info:build [javac] /opt/local/var/macports/build/_opt_local_var_macports_sources_rsync.macports.org_release_tarballs_ports_lang_processing/processing/work/processing-1.2.1/app/src/processing/app/debug/EventThread.java:83: error: cannot find symbol |
---|
1871 | :info:build [javac] EventQueue queue = vm.eventQueue(); |
---|
1872 | :info:build [javac] ^ |
---|
1873 | :info:build [javac] symbol: class EventQueue |
---|
1874 | :info:build [javac] location: class EventThread |
---|
1875 | :info:build [javac] /opt/local/var/macports/build/_opt_local_var_macports_sources_rsync.macports.org_release_tarballs_ports_lang_processing/processing/work/processing-1.2.1/app/src/processing/app/debug/EventThread.java:86: error: cannot find symbol |
---|
1876 | :info:build [javac] EventSet eventSet = queue.remove(); |
---|
1877 | :info:build [javac] ^ |
---|
1878 | :info:build [javac] symbol: class EventSet |
---|
1879 | :info:build [javac] location: class EventThread |
---|
1880 | :info:build [javac] /opt/local/var/macports/build/_opt_local_var_macports_sources_rsync.macports.org_release_tarballs_ports_lang_processing/processing/work/processing-1.2.1/app/src/processing/app/debug/EventThread.java:87: error: cannot find symbol |
---|
1881 | :info:build [javac] EventIterator it = eventSet.eventIterator(); |
---|
1882 | :info:build [javac] ^ |
---|
1883 | :info:build [javac] symbol: class EventIterator |
---|
1884 | :info:build [javac] location: class EventThread |
---|
1885 | :info:build [javac] /opt/local/var/macports/build/_opt_local_var_macports_sources_rsync.macports.org_release_tarballs_ports_lang_processing/processing/work/processing-1.2.1/app/src/processing/app/debug/EventThread.java:94: error: cannot find symbol |
---|
1886 | :info:build [javac] } catch (VMDisconnectedException discExc) { |
---|
1887 | :info:build [javac] ^ |
---|
1888 | :info:build [javac] symbol: class VMDisconnectedException |
---|
1889 | :info:build [javac] location: class EventThread |
---|
1890 | :info:build [javac] /opt/local/var/macports/build/_opt_local_var_macports_sources_rsync.macports.org_release_tarballs_ports_lang_processing/processing/work/processing-1.2.1/app/src/processing/app/debug/EventThread.java:108: error: cannot find symbol |
---|
1891 | :info:build [javac] EventRequestManager mgr = vm.eventRequestManager(); |
---|
1892 | :info:build [javac] ^ |
---|
1893 | :info:build [javac] symbol: class EventRequestManager |
---|
1894 | :info:build [javac] location: class EventThread |
---|
1895 | :info:build [javac] /opt/local/var/macports/build/_opt_local_var_macports_sources_rsync.macports.org_release_tarballs_ports_lang_processing/processing/work/processing-1.2.1/app/src/processing/app/debug/EventThread.java:115: error: cannot find symbol |
---|
1896 | :info:build [javac] ExceptionRequest excReq = mgr.createExceptionRequest(null, false, true); |
---|
1897 | :info:build [javac] ^ |
---|
1898 | :info:build [javac] symbol: class ExceptionRequest |
---|
1899 | :info:build [javac] location: class EventThread |
---|
1900 | :info:build [javac] /opt/local/var/macports/build/_opt_local_var_macports_sources_rsync.macports.org_release_tarballs_ports_lang_processing/processing/work/processing-1.2.1/app/src/processing/app/debug/EventThread.java:119: error: cannot find symbol |
---|
1901 | :info:build [javac] excReq.setSuspendPolicy(EventRequest.SUSPEND_ALL); |
---|
1902 | :info:build [javac] ^ |
---|
1903 | :info:build [javac] symbol: variable EventRequest |
---|
1904 | :info:build [javac] location: class EventThread |
---|
1905 | :info:build [javac] /opt/local/var/macports/build/_opt_local_var_macports_sources_rsync.macports.org_release_tarballs_ports_lang_processing/processing/work/processing-1.2.1/app/src/processing/app/debug/EventThread.java:193: error: cannot find symbol |
---|
1906 | :info:build [javac] Field field = event.field(); |
---|
1907 | :info:build [javac] ^ |
---|
1908 | :info:build [javac] symbol: class Field |
---|
1909 | :info:build [javac] location: class EventThread.ThreadTrace |
---|
1910 | :info:build [javac] /opt/local/var/macports/build/_opt_local_var_macports_sources_rsync.macports.org_release_tarballs_ports_lang_processing/processing/work/processing-1.2.1/app/src/processing/app/debug/EventThread.java:194: error: cannot find symbol |
---|
1911 | :info:build [javac] Value value = event.valueToBe(); |
---|
1912 | :info:build [javac] ^ |
---|
1913 | :info:build [javac] symbol: class Value |
---|
1914 | :info:build [javac] location: class EventThread.ThreadTrace |
---|
1915 | :info:build [javac] /opt/local/var/macports/build/_opt_local_var_macports_sources_rsync.macports.org_release_tarballs_ports_lang_processing/processing/work/processing-1.2.1/app/src/processing/app/debug/EventThread.java:205: error: cannot find symbol |
---|
1916 | :info:build [javac] EventRequestManager mgr = vm.eventRequestManager(); |
---|
1917 | :info:build [javac] ^ |
---|
1918 | :info:build [javac] symbol: class EventRequestManager |
---|
1919 | :info:build [javac] location: class EventThread.ThreadTrace |
---|
1920 | :info:build [javac] /opt/local/var/macports/build/_opt_local_var_macports_sources_rsync.macports.org_release_tarballs_ports_lang_processing/processing/work/processing-1.2.1/app/src/processing/app/debug/EventThread.java:206: error: cannot find symbol |
---|
1921 | :info:build [javac] StepRequest req = mgr.createStepRequest(thread, |
---|
1922 | :info:build [javac] ^ |
---|
1923 | :info:build [javac] symbol: class StepRequest |
---|
1924 | :info:build [javac] location: class EventThread.ThreadTrace |
---|
1925 | :info:build [javac] /opt/local/var/macports/build/_opt_local_var_macports_sources_rsync.macports.org_release_tarballs_ports_lang_processing/processing/work/processing-1.2.1/app/src/processing/app/debug/EventThread.java:207: error: cannot find symbol |
---|
1926 | :info:build [javac] StepRequest.STEP_MIN, |
---|
1927 | :info:build [javac] ^ |
---|
1928 | :info:build [javac] symbol: variable StepRequest |
---|
1929 | :info:build [javac] location: class EventThread.ThreadTrace |
---|
1930 | :info:build [javac] /opt/local/var/macports/build/_opt_local_var_macports_sources_rsync.macports.org_release_tarballs_ports_lang_processing/processing/work/processing-1.2.1/app/src/processing/app/debug/EventThread.java:208: error: cannot find symbol |
---|
1931 | :info:build [javac] StepRequest.STEP_INTO); |
---|
1932 | :info:build [javac] ^ |
---|
1933 | :info:build [javac] symbol: variable StepRequest |
---|
1934 | :info:build [javac] location: class EventThread.ThreadTrace |
---|
1935 | :info:build [javac] /opt/local/var/macports/build/_opt_local_var_macports_sources_rsync.macports.org_release_tarballs_ports_lang_processing/processing/work/processing-1.2.1/app/src/processing/app/debug/EventThread.java:210: error: cannot find symbol |
---|
1936 | :info:build [javac] req.setSuspendPolicy(EventRequest.SUSPEND_ALL); |
---|
1937 | :info:build [javac] ^ |
---|
1938 | :info:build [javac] symbol: variable EventRequest |
---|
1939 | :info:build [javac] location: class EventThread.ThreadTrace |
---|
1940 | :info:build [javac] /opt/local/var/macports/build/_opt_local_var_macports_sources_rsync.macports.org_release_tarballs_ports_lang_processing/processing/work/processing-1.2.1/app/src/processing/app/debug/EventThread.java:221: error: cannot find symbol |
---|
1941 | :info:build [javac] } catch (IncompatibleThreadStateException exc) { |
---|
1942 | :info:build [javac] ^ |
---|
1943 | :info:build [javac] symbol: class IncompatibleThreadStateException |
---|
1944 | :info:build [javac] location: class EventThread.ThreadTrace |
---|
1945 | :info:build [javac] /opt/local/var/macports/build/_opt_local_var_macports_sources_rsync.macports.org_release_tarballs_ports_lang_processing/processing/work/processing-1.2.1/app/src/processing/app/debug/EventThread.java:227: error: cannot find symbol |
---|
1946 | :info:build [javac] EventRequestManager mgr = vm.eventRequestManager(); |
---|
1947 | :info:build [javac] ^ |
---|
1948 | :info:build [javac] symbol: class EventRequestManager |
---|
1949 | :info:build [javac] location: class EventThread.ThreadTrace |
---|
1950 | :info:build [javac] /opt/local/var/macports/build/_opt_local_var_macports_sources_rsync.macports.org_release_tarballs_ports_lang_processing/processing/work/processing-1.2.1/app/src/processing/app/debug/EventThread.java:254: error: cannot find symbol |
---|
1951 | :info:build [javac] if (event instanceof ExceptionEvent) { |
---|
1952 | :info:build [javac] ^ |
---|
1953 | :info:build [javac] symbol: class ExceptionEvent |
---|
1954 | :info:build [javac] location: class EventThread |
---|
1955 | :info:build [javac] /opt/local/var/macports/build/_opt_local_var_macports_sources_rsync.macports.org_release_tarballs_ports_lang_processing/processing/work/processing-1.2.1/app/src/processing/app/debug/EventThread.java:255: error: cannot find symbol |
---|
1956 | :info:build [javac] exceptionEvent((ExceptionEvent)event); |
---|
1957 | :info:build [javac] ^ |
---|
1958 | :info:build [javac] symbol: class ExceptionEvent |
---|
1959 | :info:build [javac] location: class EventThread |
---|
1960 | :info:build [javac] /opt/local/var/macports/build/_opt_local_var_macports_sources_rsync.macports.org_release_tarballs_ports_lang_processing/processing/work/processing-1.2.1/app/src/processing/app/debug/EventThread.java:256: error: cannot find symbol |
---|
1961 | :info:build [javac] } else if (event instanceof ModificationWatchpointEvent) { |
---|
1962 | :info:build [javac] ^ |
---|
1963 | :info:build [javac] symbol: class ModificationWatchpointEvent |
---|
1964 | :info:build [javac] location: class EventThread |
---|
1965 | :info:build [javac] /opt/local/var/macports/build/_opt_local_var_macports_sources_rsync.macports.org_release_tarballs_ports_lang_processing/processing/work/processing-1.2.1/app/src/processing/app/debug/EventThread.java:257: error: cannot find symbol |
---|
1966 | :info:build [javac] fieldWatchEvent((ModificationWatchpointEvent)event); |
---|
1967 | :info:build [javac] ^ |
---|
1968 | :info:build [javac] symbol: class ModificationWatchpointEvent |
---|
1969 | :info:build [javac] location: class EventThread |
---|
1970 | :info:build [javac] /opt/local/var/macports/build/_opt_local_var_macports_sources_rsync.macports.org_release_tarballs_ports_lang_processing/processing/work/processing-1.2.1/app/src/processing/app/debug/EventThread.java:258: error: cannot find symbol |
---|
1971 | :info:build [javac] } else if (event instanceof MethodEntryEvent) { |
---|
1972 | :info:build [javac] ^ |
---|
1973 | :info:build [javac] symbol: class MethodEntryEvent |
---|
1974 | :info:build [javac] location: class EventThread |
---|
1975 | :info:build [javac] /opt/local/var/macports/build/_opt_local_var_macports_sources_rsync.macports.org_release_tarballs_ports_lang_processing/processing/work/processing-1.2.1/app/src/processing/app/debug/EventThread.java:259: error: cannot find symbol |
---|
1976 | :info:build [javac] methodEntryEvent((MethodEntryEvent)event); |
---|
1977 | :info:build [javac] ^ |
---|
1978 | :info:build [javac] symbol: class MethodEntryEvent |
---|
1979 | :info:build [javac] location: class EventThread |
---|
1980 | :info:build [javac] /opt/local/var/macports/build/_opt_local_var_macports_sources_rsync.macports.org_release_tarballs_ports_lang_processing/processing/work/processing-1.2.1/app/src/processing/app/debug/EventThread.java:260: error: cannot find symbol |
---|
1981 | :info:build [javac] } else if (event instanceof MethodExitEvent) { |
---|
1982 | :info:build [javac] ^ |
---|
1983 | :info:build [javac] symbol: class MethodExitEvent |
---|
1984 | :info:build [javac] location: class EventThread |
---|
1985 | :info:build [javac] /opt/local/var/macports/build/_opt_local_var_macports_sources_rsync.macports.org_release_tarballs_ports_lang_processing/processing/work/processing-1.2.1/app/src/processing/app/debug/EventThread.java:261: error: cannot find symbol |
---|
1986 | :info:build [javac] methodExitEvent((MethodExitEvent)event); |
---|
1987 | :info:build [javac] ^ |
---|
1988 | :info:build [javac] symbol: class MethodExitEvent |
---|
1989 | :info:build [javac] location: class EventThread |
---|
1990 | :info:build [javac] /opt/local/var/macports/build/_opt_local_var_macports_sources_rsync.macports.org_release_tarballs_ports_lang_processing/processing/work/processing-1.2.1/app/src/processing/app/debug/EventThread.java:262: error: cannot find symbol |
---|
1991 | :info:build [javac] } else if (event instanceof StepEvent) { |
---|
1992 | :info:build [javac] ^ |
---|
1993 | :info:build [javac] symbol: class StepEvent |
---|
1994 | :info:build [javac] location: class EventThread |
---|
1995 | :info:build [javac] /opt/local/var/macports/build/_opt_local_var_macports_sources_rsync.macports.org_release_tarballs_ports_lang_processing/processing/work/processing-1.2.1/app/src/processing/app/debug/EventThread.java:263: error: cannot find symbol |
---|
1996 | :info:build [javac] stepEvent((StepEvent)event); |
---|
1997 | :info:build [javac] ^ |
---|
1998 | :info:build [javac] symbol: class StepEvent |
---|
1999 | :info:build [javac] location: class EventThread |
---|
2000 | :info:build [javac] /opt/local/var/macports/build/_opt_local_var_macports_sources_rsync.macports.org_release_tarballs_ports_lang_processing/processing/work/processing-1.2.1/app/src/processing/app/debug/EventThread.java:264: error: cannot find symbol |
---|
2001 | :info:build [javac] } else if (event instanceof ThreadDeathEvent) { |
---|
2002 | :info:build [javac] ^ |
---|
2003 | :info:build [javac] symbol: class ThreadDeathEvent |
---|
2004 | :info:build [javac] location: class EventThread |
---|
2005 | :info:build [javac] /opt/local/var/macports/build/_opt_local_var_macports_sources_rsync.macports.org_release_tarballs_ports_lang_processing/processing/work/processing-1.2.1/app/src/processing/app/debug/EventThread.java:265: error: cannot find symbol |
---|
2006 | :info:build [javac] threadDeathEvent((ThreadDeathEvent)event); |
---|
2007 | :info:build [javac] ^ |
---|
2008 | :info:build [javac] symbol: class ThreadDeathEvent |
---|
2009 | :info:build [javac] location: class EventThread |
---|
2010 | :info:build [javac] /opt/local/var/macports/build/_opt_local_var_macports_sources_rsync.macports.org_release_tarballs_ports_lang_processing/processing/work/processing-1.2.1/app/src/processing/app/debug/EventThread.java:266: error: cannot find symbol |
---|
2011 | :info:build [javac] } else if (event instanceof ClassPrepareEvent) { |
---|
2012 | :info:build [javac] ^ |
---|
2013 | :info:build [javac] symbol: class ClassPrepareEvent |
---|
2014 | :info:build [javac] location: class EventThread |
---|
2015 | :info:build [javac] /opt/local/var/macports/build/_opt_local_var_macports_sources_rsync.macports.org_release_tarballs_ports_lang_processing/processing/work/processing-1.2.1/app/src/processing/app/debug/EventThread.java:267: error: cannot find symbol |
---|
2016 | :info:build [javac] classPrepareEvent((ClassPrepareEvent)event); |
---|
2017 | :info:build [javac] ^ |
---|
2018 | :info:build [javac] symbol: class ClassPrepareEvent |
---|
2019 | :info:build [javac] location: class EventThread |
---|
2020 | :info:build [javac] /opt/local/var/macports/build/_opt_local_var_macports_sources_rsync.macports.org_release_tarballs_ports_lang_processing/processing/work/processing-1.2.1/app/src/processing/app/debug/EventThread.java:268: error: cannot find symbol |
---|
2021 | :info:build [javac] } else if (event instanceof VMStartEvent) { |
---|
2022 | :info:build [javac] ^ |
---|
2023 | :info:build [javac] symbol: class VMStartEvent |
---|
2024 | :info:build [javac] location: class EventThread |
---|
2025 | :info:build [javac] /opt/local/var/macports/build/_opt_local_var_macports_sources_rsync.macports.org_release_tarballs_ports_lang_processing/processing/work/processing-1.2.1/app/src/processing/app/debug/EventThread.java:269: error: cannot find symbol |
---|
2026 | :info:build [javac] vmStartEvent((VMStartEvent)event); |
---|
2027 | :info:build [javac] ^ |
---|
2028 | :info:build [javac] symbol: class VMStartEvent |
---|
2029 | :info:build [javac] location: class EventThread |
---|
2030 | :info:build [javac] /opt/local/var/macports/build/_opt_local_var_macports_sources_rsync.macports.org_release_tarballs_ports_lang_processing/processing/work/processing-1.2.1/app/src/processing/app/debug/EventThread.java:270: error: cannot find symbol |
---|
2031 | :info:build [javac] } else if (event instanceof VMDeathEvent) { |
---|
2032 | :info:build [javac] ^ |
---|
2033 | :info:build [javac] symbol: class VMDeathEvent |
---|
2034 | :info:build [javac] location: class EventThread |
---|
2035 | :info:build [javac] /opt/local/var/macports/build/_opt_local_var_macports_sources_rsync.macports.org_release_tarballs_ports_lang_processing/processing/work/processing-1.2.1/app/src/processing/app/debug/EventThread.java:271: error: cannot find symbol |
---|
2036 | :info:build [javac] vmDeathEvent((VMDeathEvent)event); |
---|
2037 | :info:build [javac] ^ |
---|
2038 | :info:build [javac] symbol: class VMDeathEvent |
---|
2039 | :info:build [javac] location: class EventThread |
---|
2040 | :info:build [javac] /opt/local/var/macports/build/_opt_local_var_macports_sources_rsync.macports.org_release_tarballs_ports_lang_processing/processing/work/processing-1.2.1/app/src/processing/app/debug/EventThread.java:272: error: cannot find symbol |
---|
2041 | :info:build [javac] } else if (event instanceof VMDisconnectEvent) { |
---|
2042 | :info:build [javac] ^ |
---|
2043 | :info:build [javac] symbol: class VMDisconnectEvent |
---|
2044 | :info:build [javac] location: class EventThread |
---|
2045 | :info:build [javac] /opt/local/var/macports/build/_opt_local_var_macports_sources_rsync.macports.org_release_tarballs_ports_lang_processing/processing/work/processing-1.2.1/app/src/processing/app/debug/EventThread.java:273: error: cannot find symbol |
---|
2046 | :info:build [javac] vmDisconnectEvent((VMDisconnectEvent)event); |
---|
2047 | :info:build [javac] ^ |
---|
2048 | :info:build [javac] symbol: class VMDisconnectEvent |
---|
2049 | :info:build [javac] location: class EventThread |
---|
2050 | :info:build [javac] /opt/local/var/macports/build/_opt_local_var_macports_sources_rsync.macports.org_release_tarballs_ports_lang_processing/processing/work/processing-1.2.1/app/src/processing/app/debug/EventThread.java:286: error: cannot find symbol |
---|
2051 | :info:build [javac] EventQueue queue = vm.eventQueue(); |
---|
2052 | :info:build [javac] ^ |
---|
2053 | :info:build [javac] symbol: class EventQueue |
---|
2054 | :info:build [javac] location: class EventThread |
---|
2055 | :info:build [javac] /opt/local/var/macports/build/_opt_local_var_macports_sources_rsync.macports.org_release_tarballs_ports_lang_processing/processing/work/processing-1.2.1/app/src/processing/app/debug/EventThread.java:289: error: cannot find symbol |
---|
2056 | :info:build [javac] EventSet eventSet = queue.remove(); |
---|
2057 | :info:build [javac] ^ |
---|
2058 | :info:build [javac] symbol: class EventSet |
---|
2059 | :info:build [javac] location: class EventThread |
---|
2060 | :info:build [javac] /opt/local/var/macports/build/_opt_local_var_macports_sources_rsync.macports.org_release_tarballs_ports_lang_processing/processing/work/processing-1.2.1/app/src/processing/app/debug/EventThread.java:290: error: cannot find symbol |
---|
2061 | :info:build [javac] EventIterator iter = eventSet.eventIterator(); |
---|
2062 | :info:build [javac] ^ |
---|
2063 | :info:build [javac] symbol: class EventIterator |
---|
2064 | :info:build [javac] location: class EventThread |
---|
2065 | :info:build [javac] /opt/local/var/macports/build/_opt_local_var_macports_sources_rsync.macports.org_release_tarballs_ports_lang_processing/processing/work/processing-1.2.1/app/src/processing/app/debug/EventThread.java:292: error: cannot find symbol |
---|
2066 | :info:build [javac] Event event = iter.nextEvent(); |
---|
2067 | :info:build [javac] ^ |
---|
2068 | :info:build [javac] symbol: class Event |
---|
2069 | :info:build [javac] location: class EventThread |
---|
2070 | :info:build [javac] /opt/local/var/macports/build/_opt_local_var_macports_sources_rsync.macports.org_release_tarballs_ports_lang_processing/processing/work/processing-1.2.1/app/src/processing/app/debug/EventThread.java:293: error: cannot find symbol |
---|
2071 | :info:build [javac] if (event instanceof VMDeathEvent) { |
---|
2072 | :info:build [javac] ^ |
---|
2073 | :info:build [javac] symbol: class VMDeathEvent |
---|
2074 | :info:build [javac] location: class EventThread |
---|
2075 | :info:build [javac] /opt/local/var/macports/build/_opt_local_var_macports_sources_rsync.macports.org_release_tarballs_ports_lang_processing/processing/work/processing-1.2.1/app/src/processing/app/debug/EventThread.java:294: error: cannot find symbol |
---|
2076 | :info:build [javac] vmDeathEvent((VMDeathEvent)event); |
---|
2077 | :info:build [javac] ^ |
---|
2078 | :info:build [javac] symbol: class VMDeathEvent |
---|
2079 | :info:build [javac] location: class EventThread |
---|
2080 | :info:build [javac] /opt/local/var/macports/build/_opt_local_var_macports_sources_rsync.macports.org_release_tarballs_ports_lang_processing/processing/work/processing-1.2.1/app/src/processing/app/debug/EventThread.java:295: error: cannot find symbol |
---|
2081 | :info:build [javac] } else if (event instanceof VMDisconnectEvent) { |
---|
2082 | :info:build [javac] ^ |
---|
2083 | :info:build [javac] symbol: class VMDisconnectEvent |
---|
2084 | :info:build [javac] location: class EventThread |
---|
2085 | :info:build [javac] /opt/local/var/macports/build/_opt_local_var_macports_sources_rsync.macports.org_release_tarballs_ports_lang_processing/processing/work/processing-1.2.1/app/src/processing/app/debug/EventThread.java:296: error: cannot find symbol |
---|
2086 | :info:build [javac] vmDisconnectEvent((VMDisconnectEvent)event); |
---|
2087 | :info:build [javac] ^ |
---|
2088 | :info:build [javac] symbol: class VMDisconnectEvent |
---|
2089 | :info:build [javac] location: class EventThread |
---|
2090 | :info:build [javac] /opt/local/var/macports/build/_opt_local_var_macports_sources_rsync.macports.org_release_tarballs_ports_lang_processing/processing/work/processing-1.2.1/app/src/processing/app/debug/EventThread.java:348: error: cannot find symbol |
---|
2091 | :info:build [javac] EventRequestManager mgr = vm.eventRequestManager(); |
---|
2092 | :info:build [javac] ^ |
---|
2093 | :info:build [javac] symbol: class EventRequestManager |
---|
2094 | :info:build [javac] location: class EventThread |
---|
2095 | :info:build [javac] Note: Some input files use unchecked or unsafe operations. |
---|
2096 | :info:build [javac] Note: Recompile with -Xlint:unchecked for details. |
---|
2097 | :info:build [javac] 100 errors |
---|
2098 | :info:build [javac] 4 warnings |
---|
2099 | :info:build |
---|
2100 | :info:build BUILD FAILED |
---|
2101 | :info:build /opt/local/var/macports/build/_opt_local_var_macports_sources_rsync.macports.org_release_tarballs_ports_lang_processing/processing/work/processing-1.2.1/build/build.xml:68: The following error occurred while executing this line: |
---|
2102 | :info:build /opt/local/var/macports/build/_opt_local_var_macports_sources_rsync.macports.org_release_tarballs_ports_lang_processing/processing/work/processing-1.2.1/app/build.xml:104: Compile failed; see the compiler error output for details. |
---|
2103 | :info:build |
---|
2104 | :info:build Total time: 24 seconds |
---|
2105 | :info:build Command failed: cd "/opt/local/var/macports/build/_opt_local_var_macports_sources_rsync.macports.org_release_tarballs_ports_lang_processing/processing/work/processing-1.2.1/build" && /opt/local/bin/ant macosx-build |
---|
2106 | :info:build Exit code: 1 |
---|
2107 | :error:build org.macports.build for port processing returned: command execution failed |
---|
2108 | :debug:build Error code: CHILDSTATUS 7541 1 |
---|
2109 | :debug:build Backtrace: command execution failed |
---|
2110 | while executing |
---|
2111 | "system -nice 0 $fullcmdstring" |
---|
2112 | ("eval" body line 1) |
---|
2113 | invoked from within |
---|
2114 | "eval system $notty $nice \$fullcmdstring" |
---|
2115 | invoked from within |
---|
2116 | "command_exec build" |
---|
2117 | (procedure "portbuild::build_main" line 8) |
---|
2118 | invoked from within |
---|
2119 | "portbuild::build_main org.macports.build" |
---|
2120 | ("eval" body line 1) |
---|
2121 | invoked from within |
---|
2122 | "eval $procedure $targetname" |
---|
2123 | :info:build Warning: targets not executed for processing: org.macports.activate org.macports.build org.macports.destroot org.macports.install |
---|
2124 | :notice:build Please see the log file for port processing for details: |
---|
2125 | /opt/local/var/macports/logs/_opt_local_var_macports_sources_rsync.macports.org_release_tarballs_ports_lang_processing/processing/main.log |
---|