1 | version:1 |
---|
2 | :debug:sysinfo macOS 11.0 (darwin/20.1.0) arch i386 |
---|
3 | :debug:sysinfo MacPorts 2.6.4 |
---|
4 | :debug:sysinfo Xcode 12.2 |
---|
5 | :debug:sysinfo SDK 11.0 |
---|
6 | :debug:sysinfo MACOSX_DEPLOYMENT_TARGET: 11.0 |
---|
7 | :debug:main Attempting ln -sf /opt/local/var/macports/build/_opt_local_var_macports_sources_rsync.macports.org_macports_release_tarballs_ports_net_gupnp-igd/gupnp-igd/work /opt/local/var/macports/sources/rsync.macports.org/macports/release/tarballs/ports/net/gupnp-igd/work |
---|
8 | :debug:main dropping privileges: euid changed to 503, egid changed to 501. |
---|
9 | :debug:main Executing org.macports.main (gupnp-igd) |
---|
10 | :debug:main Privilege de-escalation not attempted as not running as root. |
---|
11 | :debug:archivefetch archivefetch phase started at Mon Nov 30 13:19:53 PST 2020 |
---|
12 | :debug:archivefetch Executing org.macports.archivefetch (gupnp-igd) |
---|
13 | :debug:archivefetch Privilege de-escalation not attempted as not running as root. |
---|
14 | :debug:fetch fetch phase started at Mon Nov 30 13:19:53 PST 2020 |
---|
15 | :notice:fetch ---> Fetching distfiles for gupnp-igd |
---|
16 | :debug:fetch Executing org.macports.fetch (gupnp-igd) |
---|
17 | :debug:fetch Privilege de-escalation not attempted as not running as root. |
---|
18 | :debug:checksum checksum phase started at Mon Nov 30 13:19:53 PST 2020 |
---|
19 | :notice:checksum ---> Verifying checksums for gupnp-igd |
---|
20 | :debug:checksum Executing org.macports.checksum (gupnp-igd) |
---|
21 | :info:checksum ---> Checksumming gupnp-igd-0.2.5.tar.xz |
---|
22 | :debug:checksum Calculated (rmd160) is 5c4ac056b1ddbcc0a2c831c99d2f9b7d410fc3ba |
---|
23 | :debug:checksum Correct (rmd160) checksum for gupnp-igd-0.2.5.tar.xz |
---|
24 | :debug:checksum Calculated (sha256) is 8b4a1aa38bacbcac2c1755153147ead7ee9af7d4d1f544b6577cfc35e10e3b20 |
---|
25 | :debug:checksum Correct (sha256) checksum for gupnp-igd-0.2.5.tar.xz |
---|
26 | :debug:checksum Privilege de-escalation not attempted as not running as root. |
---|
27 | :debug:extract extract phase started at Mon Nov 30 13:19:53 PST 2020 |
---|
28 | :notice:extract ---> Extracting gupnp-igd |
---|
29 | :debug:extract setting option extract.cmd to /opt/local/bin/xz |
---|
30 | :debug:extract Executing org.macports.extract (gupnp-igd) |
---|
31 | :info:extract ---> Extracting gupnp-igd-0.2.5.tar.xz |
---|
32 | :debug:extract setting option extract.args to '/opt/local/var/macports/distfiles/gupnp-igd/gupnp-igd-0.2.5.tar.xz' |
---|
33 | :debug:extract Environment: |
---|
34 | :debug:extract CC_PRINT_OPTIONS='YES' |
---|
35 | :debug:extract CC_PRINT_OPTIONS_FILE='/opt/local/var/macports/build/_opt_local_var_macports_sources_rsync.macports.org_macports_release_tarballs_ports_net_gupnp-igd/gupnp-igd/work/.CC_PRINT_OPTIONS' |
---|
36 | :debug:extract CPATH='/opt/local/include' |
---|
37 | :debug:extract DEVELOPER_DIR='/Applications/Xcode.app/Contents/Developer' |
---|
38 | :debug:extract LIBRARY_PATH='/opt/local/lib' |
---|
39 | :debug:extract MACOSX_DEPLOYMENT_TARGET='11.0' |
---|
40 | :debug:extract SDKROOT='/Applications/Xcode.app/Contents/Developer/Platforms/MacOSX.platform/Developer/SDKs/MacOSX11.0.sdk' |
---|
41 | :info:extract Executing: cd "/opt/local/var/macports/build/_opt_local_var_macports_sources_rsync.macports.org_macports_release_tarballs_ports_net_gupnp-igd/gupnp-igd/work" && /opt/local/bin/xz -dc '/opt/local/var/macports/distfiles/gupnp-igd/gupnp-igd-0.2.5.tar.xz' | /usr/bin/tar -xf - |
---|
42 | :debug:extract system: cd "/opt/local/var/macports/build/_opt_local_var_macports_sources_rsync.macports.org_macports_release_tarballs_ports_net_gupnp-igd/gupnp-igd/work" && /opt/local/bin/xz -dc '/opt/local/var/macports/distfiles/gupnp-igd/gupnp-igd-0.2.5.tar.xz' | /usr/bin/tar -xf - |
---|
43 | :debug:extract euid/egid changed to: 0/0 |
---|
44 | :debug:extract chowned /opt/local/var/macports/build/_opt_local_var_macports_sources_rsync.macports.org_macports_release_tarballs_ports_net_gupnp-igd/gupnp-igd/work to macports |
---|
45 | :debug:extract euid/egid changed to: 503/501 |
---|
46 | :debug:extract Privilege de-escalation not attempted as not running as root. |
---|
47 | :debug:patch patch phase started at Mon Nov 30 13:19:53 PST 2020 |
---|
48 | :debug:patch Executing org.macports.patch (gupnp-igd) |
---|
49 | :notice:patch ---> Applying patches to gupnp-igd |
---|
50 | :info:patch ---> Applying patch-configure.diff |
---|
51 | :debug:patch Environment: |
---|
52 | :debug:patch CC_PRINT_OPTIONS='YES' |
---|
53 | :debug:patch CC_PRINT_OPTIONS_FILE='/opt/local/var/macports/build/_opt_local_var_macports_sources_rsync.macports.org_macports_release_tarballs_ports_net_gupnp-igd/gupnp-igd/work/.CC_PRINT_OPTIONS' |
---|
54 | :debug:patch CPATH='/opt/local/include' |
---|
55 | :debug:patch DEVELOPER_DIR='/Applications/Xcode.app/Contents/Developer' |
---|
56 | :debug:patch LIBRARY_PATH='/opt/local/lib' |
---|
57 | :debug:patch MACOSX_DEPLOYMENT_TARGET='11.0' |
---|
58 | :debug:patch SDKROOT='/Applications/Xcode.app/Contents/Developer/Platforms/MacOSX.platform/Developer/SDKs/MacOSX11.0.sdk' |
---|
59 | :info:patch Executing: cd "/opt/local/var/macports/build/_opt_local_var_macports_sources_rsync.macports.org_macports_release_tarballs_ports_net_gupnp-igd/gupnp-igd/work/gupnp-igd-0.2.5" && /usr/bin/patch -p0 < '/opt/local/var/macports/sources/rsync.macports.org/macports/release/tarballs/ports/net/gupnp-igd/files/patch-configure.diff' |
---|
60 | :debug:patch system: cd "/opt/local/var/macports/build/_opt_local_var_macports_sources_rsync.macports.org_macports_release_tarballs_ports_net_gupnp-igd/gupnp-igd/work/gupnp-igd-0.2.5" && /usr/bin/patch -p0 < '/opt/local/var/macports/sources/rsync.macports.org/macports/release/tarballs/ports/net/gupnp-igd/files/patch-configure.diff' |
---|
61 | :info:patch patching file configure |
---|
62 | :info:patch ---> Applying patch-python-pygupnp-igd-module.c.diff |
---|
63 | :debug:patch Environment: |
---|
64 | :debug:patch CC_PRINT_OPTIONS='YES' |
---|
65 | :debug:patch CC_PRINT_OPTIONS_FILE='/opt/local/var/macports/build/_opt_local_var_macports_sources_rsync.macports.org_macports_release_tarballs_ports_net_gupnp-igd/gupnp-igd/work/.CC_PRINT_OPTIONS' |
---|
66 | :debug:patch CPATH='/opt/local/include' |
---|
67 | :debug:patch DEVELOPER_DIR='/Applications/Xcode.app/Contents/Developer' |
---|
68 | :debug:patch LIBRARY_PATH='/opt/local/lib' |
---|
69 | :debug:patch MACOSX_DEPLOYMENT_TARGET='11.0' |
---|
70 | :debug:patch SDKROOT='/Applications/Xcode.app/Contents/Developer/Platforms/MacOSX.platform/Developer/SDKs/MacOSX11.0.sdk' |
---|
71 | :info:patch Executing: cd "/opt/local/var/macports/build/_opt_local_var_macports_sources_rsync.macports.org_macports_release_tarballs_ports_net_gupnp-igd/gupnp-igd/work/gupnp-igd-0.2.5" && /usr/bin/patch -p0 < '/opt/local/var/macports/sources/rsync.macports.org/macports/release/tarballs/ports/net/gupnp-igd/files/patch-python-pygupnp-igd-module.c.diff' |
---|
72 | :debug:patch system: cd "/opt/local/var/macports/build/_opt_local_var_macports_sources_rsync.macports.org_macports_release_tarballs_ports_net_gupnp-igd/gupnp-igd/work/gupnp-igd-0.2.5" && /usr/bin/patch -p0 < '/opt/local/var/macports/sources/rsync.macports.org/macports/release/tarballs/ports/net/gupnp-igd/files/patch-python-pygupnp-igd-module.c.diff' |
---|
73 | :info:patch patching file python/pygupnp-igd-module.c |
---|
74 | :debug:patch Privilege de-escalation not attempted as not running as root. |
---|
75 | :debug:configure configure phase started at Mon Nov 30 13:19:53 PST 2020 |
---|
76 | :notice:configure ---> Configuring gupnp-igd |
---|
77 | :debug:configure Preferred compilers: clang macports-clang-9.0 macports-clang-8.0 macports-clang-7.0 macports-clang-6.0 macports-clang-5.0 |
---|
78 | :debug:configure Using compiler 'Xcode Clang' |
---|
79 | :debug:configure Executing proc-pre-org.macports.configure-configure-0 |
---|
80 | :debug:configure Executing org.macports.configure (gupnp-igd) |
---|
81 | :debug:configure Environment: |
---|
82 | :debug:configure CC='/usr/bin/clang' |
---|
83 | :debug:configure CC_PRINT_OPTIONS='YES' |
---|
84 | :debug:configure CC_PRINT_OPTIONS_FILE='/opt/local/var/macports/build/_opt_local_var_macports_sources_rsync.macports.org_macports_release_tarballs_ports_net_gupnp-igd/gupnp-igd/work/.CC_PRINT_OPTIONS' |
---|
85 | :debug:configure CFLAGS='-pipe -Os -isysroot/Applications/Xcode.app/Contents/Developer/Platforms/MacOSX.platform/Developer/SDKs/MacOSX11.0.sdk -arch x86_64' |
---|
86 | :debug:configure CPATH='/opt/local/include' |
---|
87 | :debug:configure CPPFLAGS='-I/opt/local/include -isysroot/Applications/Xcode.app/Contents/Developer/Platforms/MacOSX.platform/Developer/SDKs/MacOSX11.0.sdk' |
---|
88 | :debug:configure CXX='/usr/bin/clang++' |
---|
89 | :debug:configure CXXFLAGS='-pipe -Os -stdlib=libc++ -isysroot/Applications/Xcode.app/Contents/Developer/Platforms/MacOSX.platform/Developer/SDKs/MacOSX11.0.sdk -arch x86_64' |
---|
90 | :debug:configure DEVELOPER_DIR='/Applications/Xcode.app/Contents/Developer' |
---|
91 | :debug:configure F90FLAGS='-pipe -Os -m64' |
---|
92 | :debug:configure FCFLAGS='-pipe -Os -m64' |
---|
93 | :debug:configure FFLAGS='-pipe -Os -m64' |
---|
94 | :debug:configure INSTALL='/usr/bin/install -c' |
---|
95 | :debug:configure LDFLAGS='-L/opt/local/lib -Wl,-headerpad_max_install_names -Wl,-syslibroot,/Applications/Xcode.app/Contents/Developer/Platforms/MacOSX.platform/Developer/SDKs/MacOSX11.0.sdk -arch x86_64' |
---|
96 | :debug:configure LIBRARY_PATH='/opt/local/lib' |
---|
97 | :debug:configure MACOSX_DEPLOYMENT_TARGET='11.0' |
---|
98 | :debug:configure OBJC='/usr/bin/clang' |
---|
99 | :debug:configure OBJCFLAGS='-pipe -Os -isysroot/Applications/Xcode.app/Contents/Developer/Platforms/MacOSX.platform/Developer/SDKs/MacOSX11.0.sdk -arch x86_64' |
---|
100 | :debug:configure OBJCXX='/usr/bin/clang++' |
---|
101 | :debug:configure OBJCXXFLAGS='-pipe -Os -stdlib=libc++ -isysroot/Applications/Xcode.app/Contents/Developer/Platforms/MacOSX.platform/Developer/SDKs/MacOSX11.0.sdk -arch x86_64' |
---|
102 | :debug:configure PKG_CONFIG_PATH='/opt/local/Library/Frameworks/Python.framework/Versions/2.7/lib/pkgconfig' |
---|
103 | :debug:configure PYTHON='/opt/local/bin/python2.7' |
---|
104 | :debug:configure SDKROOT='/Applications/Xcode.app/Contents/Developer/Platforms/MacOSX.platform/Developer/SDKs/MacOSX11.0.sdk' |
---|
105 | :info:configure Executing: cd "/opt/local/var/macports/build/_opt_local_var_macports_sources_rsync.macports.org_macports_release_tarballs_ports_net_gupnp-igd/gupnp-igd/work/gupnp-igd-0.2.5" && ./configure --prefix=/opt/local --disable-silent-rules --enable-python --enable-introspection |
---|
106 | :debug:configure system: cd "/opt/local/var/macports/build/_opt_local_var_macports_sources_rsync.macports.org_macports_release_tarballs_ports_net_gupnp-igd/gupnp-igd/work/gupnp-igd-0.2.5" && ./configure --prefix=/opt/local --disable-silent-rules --enable-python --enable-introspection |
---|
107 | :info:configure checking for a BSD-compatible install... /usr/bin/install -c |
---|
108 | :info:configure checking whether build environment is sane... yes |
---|
109 | :info:configure checking for a thread-safe mkdir -p... /opt/local/bin/gmkdir -p |
---|
110 | :info:configure checking for gawk... gawk |
---|
111 | :info:configure checking whether make sets $(MAKE)... yes |
---|
112 | :info:configure checking whether make supports nested variables... yes |
---|
113 | :info:configure checking for style of include used by make... GNU |
---|
114 | :info:configure checking for gcc... /usr/bin/clang |
---|
115 | :info:configure checking whether the C compiler works... yes |
---|
116 | :info:configure checking for C compiler default output file name... a.out |
---|
117 | :info:configure checking for suffix of executables... |
---|
118 | :info:configure checking whether we are cross compiling... no |
---|
119 | :info:configure checking for suffix of object files... o |
---|
120 | :info:configure checking whether we are using the GNU C compiler... yes |
---|
121 | :info:configure checking whether /usr/bin/clang accepts -g... yes |
---|
122 | :info:configure checking for /usr/bin/clang option to accept ISO C89... none needed |
---|
123 | :info:configure checking whether /usr/bin/clang understands -c and -o together... yes |
---|
124 | :info:configure checking dependency style of /usr/bin/clang... gcc3 |
---|
125 | :info:configure checking for library containing strerror... none required |
---|
126 | :info:configure checking for gcc... (cached) /usr/bin/clang |
---|
127 | :info:configure checking whether we are using the GNU C compiler... (cached) yes |
---|
128 | :info:configure checking whether /usr/bin/clang accepts -g... (cached) yes |
---|
129 | :info:configure checking for /usr/bin/clang option to accept ISO C89... (cached) none needed |
---|
130 | :info:configure checking whether /usr/bin/clang understands -c and -o together... (cached) yes |
---|
131 | :info:configure checking dependency style of /usr/bin/clang... (cached) gcc3 |
---|
132 | :info:configure checking how to run the C preprocessor... /usr/bin/clang -E |
---|
133 | :info:configure checking for grep that handles long lines and -e... /opt/local/bin/ggrep |
---|
134 | :info:configure checking for egrep... /opt/local/bin/ggrep -E |
---|
135 | :info:configure checking for ANSI C header files... yes |
---|
136 | :info:configure checking build system type... x86_64-apple-darwin20.1.0 |
---|
137 | :info:configure checking host system type... x86_64-apple-darwin20.1.0 |
---|
138 | :info:configure checking how to print strings... printf |
---|
139 | :info:configure checking for a sed that does not truncate output... /opt/local/bin/gsed |
---|
140 | :info:configure checking for fgrep... /opt/local/bin/ggrep -F |
---|
141 | :info:configure checking for ld used by /usr/bin/clang... /Applications/Xcode.app/Contents/Developer/Toolchains/XcodeDefault.xctoolchain/usr/bin/ld |
---|
142 | :info:configure checking if the linker (/Applications/Xcode.app/Contents/Developer/Toolchains/XcodeDefault.xctoolchain/usr/bin/ld) is GNU ld... no |
---|
143 | :info:configure checking for BSD- or MS-compatible name lister (nm)... /opt/local/bin/nm -B |
---|
144 | :info:configure checking the name lister (/opt/local/bin/nm -B) interface... BSD nm |
---|
145 | :info:configure checking whether ln -s works... yes |
---|
146 | :info:configure checking the maximum length of command line arguments... 786432 |
---|
147 | :info:configure checking how to convert x86_64-apple-darwin20.1.0 file names to x86_64-apple-darwin20.1.0 format... func_convert_file_noop |
---|
148 | :info:configure checking how to convert x86_64-apple-darwin20.1.0 file names to toolchain format... func_convert_file_noop |
---|
149 | :info:configure checking for /Applications/Xcode.app/Contents/Developer/Toolchains/XcodeDefault.xctoolchain/usr/bin/ld option to reload object files... -r |
---|
150 | :info:configure checking for objdump... objdump |
---|
151 | :info:configure checking how to recognize dependent libraries... pass_all |
---|
152 | :info:configure checking for dlltool... no |
---|
153 | :info:configure checking how to associate runtime and link libraries... printf %s\n |
---|
154 | :info:configure checking for ar... ar |
---|
155 | :info:configure checking for archiver @FILE support... no |
---|
156 | :info:configure checking for strip... strip |
---|
157 | :info:configure checking for ranlib... ranlib |
---|
158 | :info:configure checking command to parse /opt/local/bin/nm -B output from /usr/bin/clang object... ok |
---|
159 | :info:configure checking for sysroot... no |
---|
160 | :info:configure checking for a working dd... /bin/dd |
---|
161 | :info:configure checking how to truncate binary pipes... /bin/dd bs=4096 count=1 |
---|
162 | :info:configure checking for mt... no |
---|
163 | :info:configure checking if : is a manifest tool... no |
---|
164 | :info:configure checking for dsymutil... dsymutil |
---|
165 | :info:configure checking for nmedit... nmedit |
---|
166 | :info:configure checking for lipo... lipo |
---|
167 | :info:configure checking for otool... otool |
---|
168 | :info:configure checking for otool64... no |
---|
169 | :info:configure checking for -single_module linker flag... yes |
---|
170 | :info:configure checking for -exported_symbols_list linker flag... yes |
---|
171 | :info:configure checking for -force_load linker flag... yes |
---|
172 | :info:configure checking for sys/types.h... yes |
---|
173 | :info:configure checking for sys/stat.h... yes |
---|
174 | :info:configure checking for stdlib.h... yes |
---|
175 | :info:configure checking for string.h... yes |
---|
176 | :info:configure checking for memory.h... yes |
---|
177 | :info:configure checking for strings.h... yes |
---|
178 | :info:configure checking for inttypes.h... yes |
---|
179 | :info:configure checking for stdint.h... yes |
---|
180 | :info:configure checking for unistd.h... yes |
---|
181 | :info:configure checking for dlfcn.h... yes |
---|
182 | :info:configure checking for objdir... .libs |
---|
183 | :info:configure checking if /usr/bin/clang supports -fno-rtti -fno-exceptions... yes |
---|
184 | :info:configure checking for /usr/bin/clang option to produce PIC... -fno-common -DPIC |
---|
185 | :info:configure checking if /usr/bin/clang PIC flag -fno-common -DPIC works... yes |
---|
186 | :info:configure checking if /usr/bin/clang static flag -static works... no |
---|
187 | :info:configure checking if /usr/bin/clang supports -c -o file.o... yes |
---|
188 | :info:configure checking if /usr/bin/clang supports -c -o file.o... (cached) yes |
---|
189 | :info:configure checking whether the /usr/bin/clang linker (/Applications/Xcode.app/Contents/Developer/Toolchains/XcodeDefault.xctoolchain/usr/bin/ld) supports shared libraries... yes |
---|
190 | :info:configure checking dynamic linker characteristics... darwin20.1.0 dyld |
---|
191 | :info:configure checking how to hardcode library paths into programs... immediate |
---|
192 | :info:configure checking whether stripping libraries is possible... yes |
---|
193 | :info:configure checking if libtool supports shared libraries... yes |
---|
194 | :info:configure checking whether to build shared libraries... yes |
---|
195 | :info:configure checking whether to build static libraries... yes |
---|
196 | :info:configure checking for stdlib.h... (cached) yes |
---|
197 | :info:configure checking for unistd.h... (cached) yes |
---|
198 | :info:configure checking for sys/param.h... yes |
---|
199 | :info:configure checking for getpagesize... yes |
---|
200 | :info:configure checking for working mmap... yes |
---|
201 | :info:configure checking for pkg-config... /opt/local/bin/pkg-config |
---|
202 | :info:configure checking pkg-config is at least version 0.9.0... yes |
---|
203 | :info:configure checking for LIBGUPNP... yes |
---|
204 | :info:configure checking whether make supports nested variables... (cached) yes |
---|
205 | :info:configure checking for gtk-doc... yes |
---|
206 | :info:configure checking for gtkdoc-check... gtkdoc-check.test |
---|
207 | :info:configure checking for gtkdoc-check... /opt/local/bin/gtkdoc-check |
---|
208 | :info:configure checking for gtkdoc-rebase... /opt/local/bin/gtkdoc-rebase |
---|
209 | :info:configure checking for gtkdoc-mkpdf... /opt/local/bin/gtkdoc-mkpdf |
---|
210 | :info:configure checking whether to build gtk-doc documentation... no |
---|
211 | :info:configure checking for GTKDOC_DEPS... yes |
---|
212 | :info:configure checking for gobject-introspection... yes |
---|
213 | :info:configure checking for python version... 2.7 |
---|
214 | :info:configure checking for python platform... darwin |
---|
215 | :info:configure checking for python script directory... /opt/local/Library/Frameworks/Python.framework/Versions/2.7/lib/python2.7/site-packages |
---|
216 | :info:configure checking for python extension module directory... /opt/local/Library/Frameworks/Python.framework/Versions/2.7/lib/python2.7/site-packages |
---|
217 | :info:configure checking for headers required to compile python extensions... found |
---|
218 | :info:configure checking for PYGUPNP_IGD... yes |
---|
219 | :info:configure checking for PYCODEGEN... yes |
---|
220 | :info:configure checking for python version... (cached) 2.7 |
---|
221 | :info:configure checking for python platform... (cached) darwin |
---|
222 | :info:configure checking for python script directory... (cached) /opt/local/Library/Frameworks/Python.framework/Versions/2.7/lib/python2.7/site-packages |
---|
223 | :info:configure checking for python extension module directory... (cached) /opt/local/Library/Frameworks/Python.framework/Versions/2.7/lib/python2.7/site-packages |
---|
224 | :info:configure checking that generated files are newer than configure... done |
---|
225 | :info:configure configure: creating ./config.status |
---|
226 | :info:configure config.status: creating Makefile |
---|
227 | :info:configure config.status: creating libgupnp-igd/Makefile |
---|
228 | :info:configure config.status: creating python/Makefile |
---|
229 | :info:configure config.status: creating tests/Makefile |
---|
230 | :info:configure config.status: creating tests/gtest/Makefile |
---|
231 | :info:configure config.status: creating tests/examples/Makefile |
---|
232 | :info:configure config.status: creating doc/Makefile |
---|
233 | :info:configure config.status: creating doc/version.xml |
---|
234 | :info:configure config.status: creating gupnp-igd-1.0.pc |
---|
235 | :info:configure config.status: creating gupnp-igd-1.0-uninstalled.pc |
---|
236 | :info:configure config.status: creating config.h |
---|
237 | :info:configure config.status: executing depfiles commands |
---|
238 | :info:configure config.status: executing libtool commands |
---|
239 | :debug:configure Privilege de-escalation not attempted as not running as root. |
---|
240 | :debug:build build phase started at Mon Nov 30 13:20:06 PST 2020 |
---|
241 | :notice:build ---> Building gupnp-igd |
---|
242 | :debug:build Executing proc-pre-org.macports.build-build-0 |
---|
243 | :debug:build Executing org.macports.build (gupnp-igd) |
---|
244 | :debug:build Environment: |
---|
245 | :debug:build CC_PRINT_OPTIONS='YES' |
---|
246 | :debug:build CC_PRINT_OPTIONS_FILE='/opt/local/var/macports/build/_opt_local_var_macports_sources_rsync.macports.org_macports_release_tarballs_ports_net_gupnp-igd/gupnp-igd/work/.CC_PRINT_OPTIONS' |
---|
247 | :debug:build CPATH='/opt/local/include' |
---|
248 | :debug:build DEVELOPER_DIR='/Applications/Xcode.app/Contents/Developer' |
---|
249 | :debug:build LIBRARY_PATH='/opt/local/lib' |
---|
250 | :debug:build MACOSX_DEPLOYMENT_TARGET='11.0' |
---|
251 | :debug:build PATH='/opt/local/Library/Frameworks/Python.framework/Versions/2.7/bin:/opt/local/bin:/opt/local/sbin:/bin:/sbin:/usr/bin:/usr/sbin' |
---|
252 | :debug:build SDKROOT='/Applications/Xcode.app/Contents/Developer/Platforms/MacOSX.platform/Developer/SDKs/MacOSX11.0.sdk' |
---|
253 | :info:build Executing: cd "/opt/local/var/macports/build/_opt_local_var_macports_sources_rsync.macports.org_macports_release_tarballs_ports_net_gupnp-igd/gupnp-igd/work/gupnp-igd-0.2.5" && /usr/bin/make -j8 -w all CC="/usr/bin/clang -arch x86_64" |
---|
254 | :debug:build system: cd "/opt/local/var/macports/build/_opt_local_var_macports_sources_rsync.macports.org_macports_release_tarballs_ports_net_gupnp-igd/gupnp-igd/work/gupnp-igd-0.2.5" && /usr/bin/make -j8 -w all CC="/usr/bin/clang -arch x86_64" |
---|
255 | :info:build make: Entering directory `/opt/local/var/macports/build/_opt_local_var_macports_sources_rsync.macports.org_macports_release_tarballs_ports_net_gupnp-igd/gupnp-igd/work/gupnp-igd-0.2.5' |
---|
256 | :info:build /Applications/Xcode.app/Contents/Developer/usr/bin/make all-recursive |
---|
257 | :info:build make[1]: Entering directory `/opt/local/var/macports/build/_opt_local_var_macports_sources_rsync.macports.org_macports_release_tarballs_ports_net_gupnp-igd/gupnp-igd/work/gupnp-igd-0.2.5' |
---|
258 | :info:build Making all in libgupnp-igd |
---|
259 | :info:build make[2]: Entering directory `/opt/local/var/macports/build/_opt_local_var_macports_sources_rsync.macports.org_macports_release_tarballs_ports_net_gupnp-igd/gupnp-igd/work/gupnp-igd-0.2.5/libgupnp-igd' |
---|
260 | :info:build echo "#include \"glib-object.h\"" > gupnp-simple-igd-marshal.c.tmp && \ |
---|
261 | :info:build echo "#include \"gupnp-simple-igd-marshal.h\"" >> gupnp-simple-igd-marshal.c.tmp && \ |
---|
262 | :info:build /opt/local/bin/glib-genmarshal --body --prefix=_gupnp_simple_igd_marshal gupnp-simple-igd-marshal.list >> gupnp-simple-igd-marshal.c.tmp && \ |
---|
263 | :info:build mv gupnp-simple-igd-marshal.c.tmp gupnp-simple-igd-marshal.c |
---|
264 | :info:build /opt/local/bin/glib-genmarshal --header --prefix=_gupnp_simple_igd_marshal gupnp-simple-igd-marshal.list > gupnp-simple-igd-marshal.h.tmp |
---|
265 | :info:build INFO: Reading gupnp-simple-igd-marshal.list... |
---|
266 | :info:build INFO: Reading gupnp-simple-igd-marshal.list... |
---|
267 | :info:build /Applications/Xcode.app/Contents/Developer/usr/bin/make all-am |
---|
268 | :info:build make[3]: Entering directory `/opt/local/var/macports/build/_opt_local_var_macports_sources_rsync.macports.org_macports_release_tarballs_ports_net_gupnp-igd/gupnp-igd/work/gupnp-igd-0.2.5/libgupnp-igd' |
---|
269 | :info:build /bin/sh ../libtool --tag=CC --mode=compile /usr/bin/clang -arch x86_64 -DHAVE_CONFIG_H -I. -I.. -I/opt/local/include -isysroot/Applications/Xcode.app/Contents/Developer/Platforms/MacOSX.platform/Developer/SDKs/MacOSX11.0.sdk -D_REENTRANT -I/opt/local/include/gupnp-1.0 -I/opt/local/include/gssdp-1.0 -I/opt/local/include/libsoup-2.4 -I/opt/local/include/libxml2 -I/opt/local/include/glib-2.0 -I/opt/local/lib/glib-2.0/include -I.. -pipe -Os -isysroot/Applications/Xcode.app/Contents/Developer/Platforms/MacOSX.platform/Developer/SDKs/MacOSX11.0.sdk -arch x86_64 -MT gupnp-simple-igd.lo -MD -MP -MF .deps/gupnp-simple-igd.Tpo -c -o gupnp-simple-igd.lo gupnp-simple-igd.c |
---|
270 | :info:build /bin/sh ../libtool --tag=CC --mode=compile /usr/bin/clang -arch x86_64 -DHAVE_CONFIG_H -I. -I.. -I/opt/local/include -isysroot/Applications/Xcode.app/Contents/Developer/Platforms/MacOSX.platform/Developer/SDKs/MacOSX11.0.sdk -D_REENTRANT -I/opt/local/include/gupnp-1.0 -I/opt/local/include/gssdp-1.0 -I/opt/local/include/libsoup-2.4 -I/opt/local/include/libxml2 -I/opt/local/include/glib-2.0 -I/opt/local/lib/glib-2.0/include -I.. -pipe -Os -isysroot/Applications/Xcode.app/Contents/Developer/Platforms/MacOSX.platform/Developer/SDKs/MacOSX11.0.sdk -arch x86_64 -MT gupnp-simple-igd-thread.lo -MD -MP -MF .deps/gupnp-simple-igd-thread.Tpo -c -o gupnp-simple-igd-thread.lo gupnp-simple-igd-thread.c |
---|
271 | :info:build /bin/sh ../libtool --tag=CC --mode=compile /usr/bin/clang -arch x86_64 -DHAVE_CONFIG_H -I. -I.. -I/opt/local/include -isysroot/Applications/Xcode.app/Contents/Developer/Platforms/MacOSX.platform/Developer/SDKs/MacOSX11.0.sdk -D_REENTRANT -I/opt/local/include/gupnp-1.0 -I/opt/local/include/gssdp-1.0 -I/opt/local/include/libsoup-2.4 -I/opt/local/include/libxml2 -I/opt/local/include/glib-2.0 -I/opt/local/lib/glib-2.0/include -I.. -pipe -Os -isysroot/Applications/Xcode.app/Contents/Developer/Platforms/MacOSX.platform/Developer/SDKs/MacOSX11.0.sdk -arch x86_64 -MT gupnp-enum-types.lo -MD -MP -MF .deps/gupnp-enum-types.Tpo -c -o gupnp-enum-types.lo gupnp-enum-types.c |
---|
272 | :info:build /bin/sh ../libtool --tag=CC --mode=compile /usr/bin/clang -arch x86_64 -DHAVE_CONFIG_H -I. -I.. -I/opt/local/include -isysroot/Applications/Xcode.app/Contents/Developer/Platforms/MacOSX.platform/Developer/SDKs/MacOSX11.0.sdk -D_REENTRANT -I/opt/local/include/gupnp-1.0 -I/opt/local/include/gssdp-1.0 -I/opt/local/include/libsoup-2.4 -I/opt/local/include/libxml2 -I/opt/local/include/glib-2.0 -I/opt/local/lib/glib-2.0/include -I.. -pipe -Os -isysroot/Applications/Xcode.app/Contents/Developer/Platforms/MacOSX.platform/Developer/SDKs/MacOSX11.0.sdk -arch x86_64 -MT gupnp-simple-igd-marshal.lo -MD -MP -MF .deps/gupnp-simple-igd-marshal.Tpo -c -o gupnp-simple-igd-marshal.lo gupnp-simple-igd-marshal.c |
---|
273 | :info:build libtool: compile: /usr/bin/clang -arch x86_64 -DHAVE_CONFIG_H -I. -I.. -I/opt/local/include -isysroot/Applications/Xcode.app/Contents/Developer/Platforms/MacOSX.platform/Developer/SDKs/MacOSX11.0.sdk -D_REENTRANT -I/opt/local/include/gupnp-1.0 -I/opt/local/include/gssdp-1.0 -I/opt/local/include/libsoup-2.4 -I/opt/local/include/libxml2 -I/opt/local/include/glib-2.0 -I/opt/local/lib/glib-2.0/include -I.. -pipe -Os -isysroot/Applications/Xcode.app/Contents/Developer/Platforms/MacOSX.platform/Developer/SDKs/MacOSX11.0.sdk -arch x86_64 -MT gupnp-simple-igd-marshal.lo -MD -MP -MF .deps/gupnp-simple-igd-marshal.Tpo -c gupnp-simple-igd-marshal.c -fno-common -DPIC -o .libs/gupnp-simple-igd-marshal.o |
---|
274 | :info:build libtool: compile: /usr/bin/clang -arch x86_64 -DHAVE_CONFIG_H -I. -I.. -I/opt/local/include -isysroot/Applications/Xcode.app/Contents/Developer/Platforms/MacOSX.platform/Developer/SDKs/MacOSX11.0.sdk -D_REENTRANT -I/opt/local/include/gupnp-1.0 -I/opt/local/include/gssdp-1.0 -I/opt/local/include/libsoup-2.4 -I/opt/local/include/libxml2 -I/opt/local/include/glib-2.0 -I/opt/local/lib/glib-2.0/include -I.. -pipe -Os -isysroot/Applications/Xcode.app/Contents/Developer/Platforms/MacOSX.platform/Developer/SDKs/MacOSX11.0.sdk -arch x86_64 -MT gupnp-simple-igd-thread.lo -MD -MP -MF .deps/gupnp-simple-igd-thread.Tpo -c gupnp-simple-igd-thread.c -fno-common -DPIC -o .libs/gupnp-simple-igd-thread.o |
---|
275 | :info:build libtool: compile: /usr/bin/clang -arch x86_64 -DHAVE_CONFIG_H -I. -I.. -I/opt/local/include -isysroot/Applications/Xcode.app/Contents/Developer/Platforms/MacOSX.platform/Developer/SDKs/MacOSX11.0.sdk -D_REENTRANT -I/opt/local/include/gupnp-1.0 -I/opt/local/include/gssdp-1.0 -I/opt/local/include/libsoup-2.4 -I/opt/local/include/libxml2 -I/opt/local/include/glib-2.0 -I/opt/local/lib/glib-2.0/include -I.. -pipe -Os -isysroot/Applications/Xcode.app/Contents/Developer/Platforms/MacOSX.platform/Developer/SDKs/MacOSX11.0.sdk -arch x86_64 -MT gupnp-enum-types.lo -MD -MP -MF .deps/gupnp-enum-types.Tpo -c gupnp-enum-types.c -fno-common -DPIC -o .libs/gupnp-enum-types.o |
---|
276 | :info:build libtool: compile: /usr/bin/clang -arch x86_64 -DHAVE_CONFIG_H -I. -I.. -I/opt/local/include -isysroot/Applications/Xcode.app/Contents/Developer/Platforms/MacOSX.platform/Developer/SDKs/MacOSX11.0.sdk -D_REENTRANT -I/opt/local/include/gupnp-1.0 -I/opt/local/include/gssdp-1.0 -I/opt/local/include/libsoup-2.4 -I/opt/local/include/libxml2 -I/opt/local/include/glib-2.0 -I/opt/local/lib/glib-2.0/include -I.. -pipe -Os -isysroot/Applications/Xcode.app/Contents/Developer/Platforms/MacOSX.platform/Developer/SDKs/MacOSX11.0.sdk -arch x86_64 -MT gupnp-simple-igd.lo -MD -MP -MF .deps/gupnp-simple-igd.Tpo -c gupnp-simple-igd.c -fno-common -DPIC -o .libs/gupnp-simple-igd.o |
---|
277 | :info:build libtool: compile: /usr/bin/clang -arch x86_64 -DHAVE_CONFIG_H -I. -I.. -I/opt/local/include -isysroot/Applications/Xcode.app/Contents/Developer/Platforms/MacOSX.platform/Developer/SDKs/MacOSX11.0.sdk -D_REENTRANT -I/opt/local/include/gupnp-1.0 -I/opt/local/include/gssdp-1.0 -I/opt/local/include/libsoup-2.4 -I/opt/local/include/libxml2 -I/opt/local/include/glib-2.0 -I/opt/local/lib/glib-2.0/include -I.. -pipe -Os -isysroot/Applications/Xcode.app/Contents/Developer/Platforms/MacOSX.platform/Developer/SDKs/MacOSX11.0.sdk -arch x86_64 -MT gupnp-enum-types.lo -MD -MP -MF .deps/gupnp-enum-types.Tpo -c gupnp-enum-types.c -o gupnp-enum-types.o >/dev/null 2>&1 |
---|
278 | :info:build libtool: compile: /usr/bin/clang -arch x86_64 -DHAVE_CONFIG_H -I. -I.. -I/opt/local/include -isysroot/Applications/Xcode.app/Contents/Developer/Platforms/MacOSX.platform/Developer/SDKs/MacOSX11.0.sdk -D_REENTRANT -I/opt/local/include/gupnp-1.0 -I/opt/local/include/gssdp-1.0 -I/opt/local/include/libsoup-2.4 -I/opt/local/include/libxml2 -I/opt/local/include/glib-2.0 -I/opt/local/lib/glib-2.0/include -I.. -pipe -Os -isysroot/Applications/Xcode.app/Contents/Developer/Platforms/MacOSX.platform/Developer/SDKs/MacOSX11.0.sdk -arch x86_64 -MT gupnp-simple-igd-marshal.lo -MD -MP -MF .deps/gupnp-simple-igd-marshal.Tpo -c gupnp-simple-igd-marshal.c -o gupnp-simple-igd-marshal.o >/dev/null 2>&1 |
---|
279 | :info:build libtool: compile: /usr/bin/clang -arch x86_64 -DHAVE_CONFIG_H -I. -I.. -I/opt/local/include -isysroot/Applications/Xcode.app/Contents/Developer/Platforms/MacOSX.platform/Developer/SDKs/MacOSX11.0.sdk -D_REENTRANT -I/opt/local/include/gupnp-1.0 -I/opt/local/include/gssdp-1.0 -I/opt/local/include/libsoup-2.4 -I/opt/local/include/libxml2 -I/opt/local/include/glib-2.0 -I/opt/local/lib/glib-2.0/include -I.. -pipe -Os -isysroot/Applications/Xcode.app/Contents/Developer/Platforms/MacOSX.platform/Developer/SDKs/MacOSX11.0.sdk -arch x86_64 -MT gupnp-simple-igd-thread.lo -MD -MP -MF .deps/gupnp-simple-igd-thread.Tpo -c gupnp-simple-igd-thread.c -o gupnp-simple-igd-thread.o >/dev/null 2>&1 |
---|
280 | :info:build mv -f .deps/gupnp-enum-types.Tpo .deps/gupnp-enum-types.Plo |
---|
281 | :info:build mv -f .deps/gupnp-simple-igd-marshal.Tpo .deps/gupnp-simple-igd-marshal.Plo |
---|
282 | :info:build mv -f .deps/gupnp-simple-igd-thread.Tpo .deps/gupnp-simple-igd-thread.Plo |
---|
283 | :info:build libtool: compile: /usr/bin/clang -arch x86_64 -DHAVE_CONFIG_H -I. -I.. -I/opt/local/include -isysroot/Applications/Xcode.app/Contents/Developer/Platforms/MacOSX.platform/Developer/SDKs/MacOSX11.0.sdk -D_REENTRANT -I/opt/local/include/gupnp-1.0 -I/opt/local/include/gssdp-1.0 -I/opt/local/include/libsoup-2.4 -I/opt/local/include/libxml2 -I/opt/local/include/glib-2.0 -I/opt/local/lib/glib-2.0/include -I.. -pipe -Os -isysroot/Applications/Xcode.app/Contents/Developer/Platforms/MacOSX.platform/Developer/SDKs/MacOSX11.0.sdk -arch x86_64 -MT gupnp-simple-igd.lo -MD -MP -MF .deps/gupnp-simple-igd.Tpo -c gupnp-simple-igd.c -o gupnp-simple-igd.o >/dev/null 2>&1 |
---|
284 | :info:build mv -f .deps/gupnp-simple-igd.Tpo .deps/gupnp-simple-igd.Plo |
---|
285 | :info:build /bin/sh ../libtool --tag=CC --mode=link /usr/bin/clang -arch x86_64 -D_REENTRANT -I/opt/local/include/gupnp-1.0 -I/opt/local/include/gssdp-1.0 -I/opt/local/include/libsoup-2.4 -I/opt/local/include/libxml2 -I/opt/local/include/glib-2.0 -I/opt/local/lib/glib-2.0/include -I.. -pipe -Os -isysroot/Applications/Xcode.app/Contents/Developer/Platforms/MacOSX.platform/Developer/SDKs/MacOSX11.0.sdk -arch x86_64 -version-info 6:0:2 -export-symbols-regex ^gupnp_ -L/opt/local/lib -Wl,-headerpad_max_install_names -Wl,-syslibroot,/Applications/Xcode.app/Contents/Developer/Platforms/MacOSX.platform/Developer/SDKs/MacOSX11.0.sdk -arch x86_64 -o libgupnp-igd-1.0.la -rpath /opt/local/lib gupnp-simple-igd.lo gupnp-simple-igd-thread.lo gupnp-enum-types.lo gupnp-simple-igd-marshal.lo -L/opt/local/lib -lgobject-2.0 -lgssdp-1.0 -lgupnp-1.0 -lgthread-2.0 -lglib-2.0 -lintl -Wl,-framework -Wl,CoreFoundation |
---|
286 | :info:build libtool: link: /opt/local/bin/nm -B .libs/gupnp-simple-igd.o .libs/gupnp-simple-igd-thread.o .libs/gupnp-enum-types.o .libs/gupnp-simple-igd-marshal.o | sed -n -e 's/^.*[ ]\([BCDEGRST][BCDEGRST]*\)[ ][ ]*_\([_A-Za-z][_A-Za-z0-9]*\)$/\1 _\2 \2/p' | sed '/ __gnu_lto/d' | /opt/local/bin/gsed 's/.* //' | sort | uniq > .libs/libgupnp-igd-1.0.exp |
---|
287 | :info:build libtool: link: /opt/local/bin/ggrep -E -e "^gupnp_" ".libs/libgupnp-igd-1.0.exp" > ".libs/libgupnp-igd-1.0.expT" |
---|
288 | :info:build libtool: link: mv -f ".libs/libgupnp-igd-1.0.expT" ".libs/libgupnp-igd-1.0.exp" |
---|
289 | :info:build libtool: link: sed 's|^|_|' < .libs/libgupnp-igd-1.0.exp > .libs/libgupnp-igd-1.0-symbols.expsym |
---|
290 | :info:build libtool: link: /usr/bin/clang -dynamiclib -o .libs/libgupnp-igd-1.0.4.dylib .libs/gupnp-simple-igd.o .libs/gupnp-simple-igd-thread.o .libs/gupnp-enum-types.o .libs/gupnp-simple-igd-marshal.o -L/opt/local/lib -lgobject-2.0 -lgssdp-1.0 -lgupnp-1.0 -lgthread-2.0 -lglib-2.0 -lintl -arch x86_64 -Os -arch x86_64 -Wl,-headerpad_max_install_names -Wl,-syslibroot -Wl,/Applications/Xcode.app/Contents/Developer/Platforms/MacOSX.platform/Developer/SDKs/MacOSX11.0.sdk -arch x86_64 -Wl,-framework -Wl,CoreFoundation -install_name /opt/local/lib/libgupnp-igd-1.0.4.dylib -compatibility_version 7 -current_version 7.0 -Wl,-single_module -Wl,-exported_symbols_list,.libs/libgupnp-igd-1.0-symbols.expsym |
---|
291 | :info:build libtool: link: (cd ".libs" && rm -f "libgupnp-igd-1.0.dylib" && ln -s "libgupnp-igd-1.0.4.dylib" "libgupnp-igd-1.0.dylib") |
---|
292 | :info:build libtool: link: ar cru .libs/libgupnp-igd-1.0.a gupnp-simple-igd.o gupnp-simple-igd-thread.o gupnp-enum-types.o gupnp-simple-igd-marshal.o |
---|
293 | :info:build libtool: link: ranlib .libs/libgupnp-igd-1.0.a |
---|
294 | :info:build libtool: link: ( cd ".libs" && rm -f "libgupnp-igd-1.0.la" && ln -s "../libgupnp-igd-1.0.la" "libgupnp-igd-1.0.la" ) |
---|
295 | :info:build CPPFLAGS="-I/opt/local/include -isysroot/Applications/Xcode.app/Contents/Developer/Platforms/MacOSX.platform/Developer/SDKs/MacOSX11.0.sdk" CFLAGS="-pipe -Os -isysroot/Applications/Xcode.app/Contents/Developer/Platforms/MacOSX.platform/Developer/SDKs/MacOSX11.0.sdk -arch x86_64" LDFLAGS="-L/opt/local/lib -Wl,-headerpad_max_install_names -Wl,-syslibroot,/Applications/Xcode.app/Contents/Developer/Platforms/MacOSX.platform/Developer/SDKs/MacOSX11.0.sdk -arch x86_64" CC="/usr/bin/clang -arch x86_64" PKG_CONFIG="/opt/local/bin/pkg-config" GI_HOST_OS="" DLLTOOL="false" /opt/local/bin/g-ir-scanner --identifier-prefix=gupnp --identifier-prefix=gupnp_igd --identifier-prefix=GUPnP --identifier-prefix=GUPnPIgd --namespace=GUPnPIgd --nsversion=1.0 --libtool="/bin/sh ../libtool" --pkg=gupnp-1.0 --include=GObject-2.0 --library=libgupnp-igd-1.0.la --cflags-begin -I. -I.. --cflags-end gupnp-simple-igd.c gupnp-simple-igd-thread.c gupnp-simple-igd-priv.h gupnp-enum-types.c gupnp-enum-types.h gupnp-simple-igd-marshal.c gupnp-simple-igd-marshal.h gupnp-simple-igd.h gupnp-simple-igd-thread.h libgupnp-igd-1.0.la --output GUPnPIgd-1.0.gir |
---|
296 | :info:build g-ir-scanner: link: /bin/sh ../libtool --mode=link --tag=CC /usr/bin/clang -arch x86_64 -o /opt/local/var/macports/build/_opt_local_var_macports_sources_rsync.macports.org_macports_release_tarballs_ports_net_gupnp-igd/gupnp-igd/work/gupnp-igd-0.2.5/libgupnp-igd/tmp-introspectldihg94h/GUPnPIgd-1.0 -export-dynamic -I/opt/local/include -isysroot/Applications/Xcode.app/Contents/Developer/Platforms/MacOSX.platform/Developer/SDKs/MacOSX11.0.sdk -pipe -Os -isysroot/Applications/Xcode.app/Contents/Developer/Platforms/MacOSX.platform/Developer/SDKs/MacOSX11.0.sdk -arch x86_64 /opt/local/var/macports/build/_opt_local_var_macports_sources_rsync.macports.org_macports_release_tarballs_ports_net_gupnp-igd/gupnp-igd/work/gupnp-igd-0.2.5/libgupnp-igd/tmp-introspectldihg94h/GUPnPIgd-1.0.o -L. libgupnp-igd-1.0.la -lgio-2.0 -lgobject-2.0 -lgmodule-2.0 -lglib-2.0 -lintl -Wl,-framework -Wl,CoreFoundation -lgupnp-1.0 -L/opt/local/lib -Wl,-headerpad_max_install_names -Wl,-syslibroot,/Applications/Xcode.app/Contents/Developer/Platforms/MacOSX.platform/Developer/SDKs/MacOSX11.0.sdk -arch x86_64 |
---|
297 | :info:build libtool: link: /usr/bin/clang -arch x86_64 -o /opt/local/var/macports/build/_opt_local_var_macports_sources_rsync.macports.org_macports_release_tarballs_ports_net_gupnp-igd/gupnp-igd/work/gupnp-igd-0.2.5/libgupnp-igd/tmp-introspectldihg94h/.libs/GUPnPIgd-1.0 -I/opt/local/include -isysroot/Applications/Xcode.app/Contents/Developer/Platforms/MacOSX.platform/Developer/SDKs/MacOSX11.0.sdk -pipe -Os -isysroot/Applications/Xcode.app/Contents/Developer/Platforms/MacOSX.platform/Developer/SDKs/MacOSX11.0.sdk -arch x86_64 /opt/local/var/macports/build/_opt_local_var_macports_sources_rsync.macports.org_macports_release_tarballs_ports_net_gupnp-igd/gupnp-igd/work/gupnp-igd-0.2.5/libgupnp-igd/tmp-introspectldihg94h/GUPnPIgd-1.0.o -Wl,-framework -Wl,CoreFoundation -Wl,-headerpad_max_install_names -Wl,-syslibroot -Wl,/Applications/Xcode.app/Contents/Developer/Platforms/MacOSX.platform/Developer/SDKs/MacOSX11.0.sdk -arch x86_64 -L. ./.libs/libgupnp-igd-1.0.dylib -L/opt/local/lib -lgssdp-1.0 -lgthread-2.0 -lgio-2.0 -lgobject-2.0 -lgmodule-2.0 -lglib-2.0 -lintl -lgupnp-1.0 |
---|
298 | :info:build g-ir-scanner: GUPnPIgd: warning: 1 warnings suppressed (use --warn-all to see them) |
---|
299 | :info:build /opt/local/bin/g-ir-compiler --includedir=. GUPnPIgd-1.0.gir -o GUPnPIgd-1.0.typelib |
---|
300 | :info:build make[3]: Leaving directory `/opt/local/var/macports/build/_opt_local_var_macports_sources_rsync.macports.org_macports_release_tarballs_ports_net_gupnp-igd/gupnp-igd/work/gupnp-igd-0.2.5/libgupnp-igd' |
---|
301 | :info:build make[2]: Leaving directory `/opt/local/var/macports/build/_opt_local_var_macports_sources_rsync.macports.org_macports_release_tarballs_ports_net_gupnp-igd/gupnp-igd/work/gupnp-igd-0.2.5/libgupnp-igd' |
---|
302 | :info:build Making all in python |
---|
303 | :info:build make[2]: Entering directory `/opt/local/var/macports/build/_opt_local_var_macports_sources_rsync.macports.org_macports_release_tarballs_ports_net_gupnp-igd/gupnp-igd/work/gupnp-igd-0.2.5/python' |
---|
304 | :info:build pygobject-codegen-2.0 \ |
---|
305 | :info:build --prefix igd \ |
---|
306 | :info:build --override ./pygupnp-igd.override \ |
---|
307 | :info:build ./pygupnp-igd.defs > pygupnp-igd.c |
---|
308 | :info:build Could not write function error_quark: No ArgType for GQuark |
---|
309 | :info:build ***INFO*** The coverage of global functions is 75.00% (3/4) |
---|
310 | :info:build ***INFO*** The coverage of methods is 100.00% (3/3) |
---|
311 | :info:build ***INFO*** There are no declared virtual proxies. |
---|
312 | :info:build ***INFO*** There are no declared virtual accessors. |
---|
313 | :info:build ***INFO*** There are no declared interface proxies. |
---|
314 | :info:build /Applications/Xcode.app/Contents/Developer/usr/bin/make all-am |
---|
315 | :info:build make[3]: Entering directory `/opt/local/var/macports/build/_opt_local_var_macports_sources_rsync.macports.org_macports_release_tarballs_ports_net_gupnp-igd/gupnp-igd/work/gupnp-igd-0.2.5/python' |
---|
316 | :info:build /bin/sh ../libtool --tag=CC --mode=compile /usr/bin/clang -arch x86_64 -DHAVE_CONFIG_H -I. -I.. -I. -I.. -DDATADIR=\""/opt/local/share"\" -I/opt/local/Library/Frameworks/Python.framework/Versions/2.7/include/pygtk-2.0 -I/opt/local/include/glib-2.0 -I/opt/local/lib/glib-2.0/include -I/opt/local/Library/Frameworks/Python.framework/Versions/2.7/include/python2.7 -I/opt/local/Library/Frameworks/Python.framework/Versions/2.7/include/python2.7 -D_REENTRANT -I/opt/local/include/gupnp-1.0 -I/opt/local/include/gssdp-1.0 -I/opt/local/include/libsoup-2.4 -I/opt/local/include/libxml2 -I/opt/local/include/glib-2.0 -I/opt/local/lib/glib-2.0/include -I/opt/local/include -isysroot/Applications/Xcode.app/Contents/Developer/Platforms/MacOSX.platform/Developer/SDKs/MacOSX11.0.sdk -pipe -Os -isysroot/Applications/Xcode.app/Contents/Developer/Platforms/MacOSX.platform/Developer/SDKs/MacOSX11.0.sdk -arch x86_64 -MT pygupnp-igd-module.lo -MD -MP -MF .deps/pygupnp-igd-module.Tpo -c -o pygupnp-igd-module.lo pygupnp-igd-module.c |
---|
317 | :info:build /bin/sh ../libtool --tag=CC --mode=compile /usr/bin/clang -arch x86_64 -DHAVE_CONFIG_H -I. -I.. -I. -I.. -DDATADIR=\""/opt/local/share"\" -I/opt/local/Library/Frameworks/Python.framework/Versions/2.7/include/pygtk-2.0 -I/opt/local/include/glib-2.0 -I/opt/local/lib/glib-2.0/include -I/opt/local/Library/Frameworks/Python.framework/Versions/2.7/include/python2.7 -I/opt/local/Library/Frameworks/Python.framework/Versions/2.7/include/python2.7 -D_REENTRANT -I/opt/local/include/gupnp-1.0 -I/opt/local/include/gssdp-1.0 -I/opt/local/include/libsoup-2.4 -I/opt/local/include/libxml2 -I/opt/local/include/glib-2.0 -I/opt/local/lib/glib-2.0/include -I/opt/local/include -isysroot/Applications/Xcode.app/Contents/Developer/Platforms/MacOSX.platform/Developer/SDKs/MacOSX11.0.sdk -pipe -Os -isysroot/Applications/Xcode.app/Contents/Developer/Platforms/MacOSX.platform/Developer/SDKs/MacOSX11.0.sdk -arch x86_64 -MT pygupnp-igd.lo -MD -MP -MF .deps/pygupnp-igd.Tpo -c -o pygupnp-igd.lo pygupnp-igd.c |
---|
318 | :info:build libtool: compile: /usr/bin/clang -arch x86_64 -DHAVE_CONFIG_H -I. -I.. -I. -I.. -DDATADIR=\"/opt/local/share\" -I/opt/local/Library/Frameworks/Python.framework/Versions/2.7/include/pygtk-2.0 -I/opt/local/include/glib-2.0 -I/opt/local/lib/glib-2.0/include -I/opt/local/Library/Frameworks/Python.framework/Versions/2.7/include/python2.7 -I/opt/local/Library/Frameworks/Python.framework/Versions/2.7/include/python2.7 -D_REENTRANT -I/opt/local/include/gupnp-1.0 -I/opt/local/include/gssdp-1.0 -I/opt/local/include/libsoup-2.4 -I/opt/local/include/libxml2 -I/opt/local/include/glib-2.0 -I/opt/local/lib/glib-2.0/include -I/opt/local/include -isysroot/Applications/Xcode.app/Contents/Developer/Platforms/MacOSX.platform/Developer/SDKs/MacOSX11.0.sdk -pipe -Os -isysroot/Applications/Xcode.app/Contents/Developer/Platforms/MacOSX.platform/Developer/SDKs/MacOSX11.0.sdk -arch x86_64 -MT pygupnp-igd.lo -MD -MP -MF .deps/pygupnp-igd.Tpo -c pygupnp-igd.c -fno-common -DPIC -o .libs/pygupnp-igd.o |
---|
319 | :info:build libtool: compile: /usr/bin/clang -arch x86_64 -DHAVE_CONFIG_H -I. -I.. -I. -I.. -DDATADIR=\"/opt/local/share\" -I/opt/local/Library/Frameworks/Python.framework/Versions/2.7/include/pygtk-2.0 -I/opt/local/include/glib-2.0 -I/opt/local/lib/glib-2.0/include -I/opt/local/Library/Frameworks/Python.framework/Versions/2.7/include/python2.7 -I/opt/local/Library/Frameworks/Python.framework/Versions/2.7/include/python2.7 -D_REENTRANT -I/opt/local/include/gupnp-1.0 -I/opt/local/include/gssdp-1.0 -I/opt/local/include/libsoup-2.4 -I/opt/local/include/libxml2 -I/opt/local/include/glib-2.0 -I/opt/local/lib/glib-2.0/include -I/opt/local/include -isysroot/Applications/Xcode.app/Contents/Developer/Platforms/MacOSX.platform/Developer/SDKs/MacOSX11.0.sdk -pipe -Os -isysroot/Applications/Xcode.app/Contents/Developer/Platforms/MacOSX.platform/Developer/SDKs/MacOSX11.0.sdk -arch x86_64 -MT pygupnp-igd-module.lo -MD -MP -MF .deps/pygupnp-igd-module.Tpo -c pygupnp-igd-module.c -fno-common -DPIC -o .libs/pygupnp-igd-module.o |
---|
320 | :info:build libtool: compile: /usr/bin/clang -arch x86_64 -DHAVE_CONFIG_H -I. -I.. -I. -I.. -DDATADIR=\"/opt/local/share\" -I/opt/local/Library/Frameworks/Python.framework/Versions/2.7/include/pygtk-2.0 -I/opt/local/include/glib-2.0 -I/opt/local/lib/glib-2.0/include -I/opt/local/Library/Frameworks/Python.framework/Versions/2.7/include/python2.7 -I/opt/local/Library/Frameworks/Python.framework/Versions/2.7/include/python2.7 -D_REENTRANT -I/opt/local/include/gupnp-1.0 -I/opt/local/include/gssdp-1.0 -I/opt/local/include/libsoup-2.4 -I/opt/local/include/libxml2 -I/opt/local/include/glib-2.0 -I/opt/local/lib/glib-2.0/include -I/opt/local/include -isysroot/Applications/Xcode.app/Contents/Developer/Platforms/MacOSX.platform/Developer/SDKs/MacOSX11.0.sdk -pipe -Os -isysroot/Applications/Xcode.app/Contents/Developer/Platforms/MacOSX.platform/Developer/SDKs/MacOSX11.0.sdk -arch x86_64 -MT pygupnp-igd-module.lo -MD -MP -MF .deps/pygupnp-igd-module.Tpo -c pygupnp-igd-module.c -o pygupnp-igd-module.o >/dev/null 2>&1 |
---|
321 | :info:build libtool: compile: /usr/bin/clang -arch x86_64 -DHAVE_CONFIG_H -I. -I.. -I. -I.. -DDATADIR=\"/opt/local/share\" -I/opt/local/Library/Frameworks/Python.framework/Versions/2.7/include/pygtk-2.0 -I/opt/local/include/glib-2.0 -I/opt/local/lib/glib-2.0/include -I/opt/local/Library/Frameworks/Python.framework/Versions/2.7/include/python2.7 -I/opt/local/Library/Frameworks/Python.framework/Versions/2.7/include/python2.7 -D_REENTRANT -I/opt/local/include/gupnp-1.0 -I/opt/local/include/gssdp-1.0 -I/opt/local/include/libsoup-2.4 -I/opt/local/include/libxml2 -I/opt/local/include/glib-2.0 -I/opt/local/lib/glib-2.0/include -I/opt/local/include -isysroot/Applications/Xcode.app/Contents/Developer/Platforms/MacOSX.platform/Developer/SDKs/MacOSX11.0.sdk -pipe -Os -isysroot/Applications/Xcode.app/Contents/Developer/Platforms/MacOSX.platform/Developer/SDKs/MacOSX11.0.sdk -arch x86_64 -MT pygupnp-igd.lo -MD -MP -MF .deps/pygupnp-igd.Tpo -c pygupnp-igd.c -o pygupnp-igd.o >/dev/null 2>&1 |
---|
322 | :info:build mv -f .deps/pygupnp-igd-module.Tpo .deps/pygupnp-igd-module.Plo |
---|
323 | :info:build mv -f .deps/pygupnp-igd.Tpo .deps/pygupnp-igd.Plo |
---|
324 | :info:build /bin/sh ../libtool --tag=CC --mode=link /usr/bin/clang -arch x86_64 -pipe -Os -isysroot/Applications/Xcode.app/Contents/Developer/Platforms/MacOSX.platform/Developer/SDKs/MacOSX11.0.sdk -arch x86_64 -module -avoid-version -L/opt/local/lib -Wl,-headerpad_max_install_names -Wl,-syslibroot,/Applications/Xcode.app/Contents/Developer/Platforms/MacOSX.platform/Developer/SDKs/MacOSX11.0.sdk -arch x86_64 -o igd.la -rpath /opt/local/Library/Frameworks/Python.framework/Versions/2.7/lib/python2.7/site-packages/gupnp pygupnp-igd-module.lo pygupnp-igd.lo -L/opt/local/lib -lgobject-2.0 -lglib-2.0 -lintl -Wl,-framework -Wl,CoreFoundation ../libgupnp-igd/libgupnp-igd-1.0.la |
---|
325 | :info:build libtool: link: /usr/bin/clang -o .libs/igd.so -bundle .libs/pygupnp-igd-module.o .libs/pygupnp-igd.o -L/opt/local/lib ../libgupnp-igd/.libs/libgupnp-igd-1.0.dylib -lgobject-2.0 -lgssdp-1.0 -lgupnp-1.0 -lgthread-2.0 -lglib-2.0 -lintl -arch x86_64 -Os -arch x86_64 -Wl,-headerpad_max_install_names -Wl,-syslibroot -Wl,/Applications/Xcode.app/Contents/Developer/Platforms/MacOSX.platform/Developer/SDKs/MacOSX11.0.sdk -arch x86_64 -Wl,-framework -Wl,CoreFoundation |
---|
326 | :info:build Undefined symbols for architecture x86_64: |
---|
327 | :info:build "_PyArg_ParseTupleAndKeywords", referenced from: |
---|
328 | :info:build __wrap_gupnp_simple_igd_add_port in pygupnp-igd.o |
---|
329 | :info:build __wrap_gupnp_simple_igd_remove_port in pygupnp-igd.o |
---|
330 | :info:build "_PyBool_FromLong", referenced from: |
---|
331 | :info:build __wrap_gupnp_simple_igd_delete_all_mappings in pygupnp-igd.o |
---|
332 | :info:build "_PyCObject_AsVoidPtr", referenced from: |
---|
333 | :info:build _initigd in pygupnp-igd-module.o |
---|
334 | :info:build "_PyCObject_Type", referenced from: |
---|
335 | :info:build _initigd in pygupnp-igd-module.o |
---|
336 | :info:build "_PyErr_Fetch", referenced from: |
---|
337 | :info:build _initigd in pygupnp-igd-module.o |
---|
338 | :info:build "_PyErr_Format", referenced from: |
---|
339 | :info:build _initigd in pygupnp-igd-module.o |
---|
340 | :info:build "_PyErr_Occurred", referenced from: |
---|
341 | :info:build _initigd in pygupnp-igd-module.o |
---|
342 | :info:build _igd_add_constants in pygupnp-igd.o |
---|
343 | :info:build __wrap_gupnp_simple_igd_remove_port in pygupnp-igd.o |
---|
344 | :info:build "_PyErr_Print", referenced from: |
---|
345 | :info:build _initigd in pygupnp-igd-module.o |
---|
346 | :info:build _igd_add_constants in pygupnp-igd.o |
---|
347 | :info:build "_PyErr_SetString", referenced from: |
---|
348 | :info:build _initigd in pygupnp-igd-module.o |
---|
349 | :info:build _igd_register_classes in pygupnp-igd.o |
---|
350 | :info:build __wrap_gupnp_simple_igd_add_port in pygupnp-igd.o |
---|
351 | :info:build __wrap_gupnp_simple_igd_remove_port in pygupnp-igd.o |
---|
352 | :info:build "_PyExc_ImportError", referenced from: |
---|
353 | :info:build _initigd in pygupnp-igd-module.o |
---|
354 | :info:build _igd_register_classes in pygupnp-igd.o |
---|
355 | :info:build "_PyExc_TypeError", referenced from: |
---|
356 | :info:build __wrap_gupnp_simple_igd_remove_port in pygupnp-igd.o |
---|
357 | :info:build "_PyExc_ValueError", referenced from: |
---|
358 | :info:build __wrap_gupnp_simple_igd_add_port in pygupnp-igd.o |
---|
359 | :info:build "_PyImport_ImportModule", referenced from: |
---|
360 | :info:build _initigd in pygupnp-igd-module.o |
---|
361 | :info:build _igd_register_classes in pygupnp-igd.o |
---|
362 | :info:build "_PyInt_AsLong", referenced from: |
---|
363 | :info:build __wrap_gupnp_simple_igd_remove_port in pygupnp-igd.o |
---|
364 | :info:build "_PyLong_AsUnsignedLong", referenced from: |
---|
365 | :info:build __wrap_gupnp_simple_igd_remove_port in pygupnp-igd.o |
---|
366 | :info:build "_PyModule_GetDict", referenced from: |
---|
367 | :info:build _initigd in pygupnp-igd-module.o |
---|
368 | :info:build "_PyObject_GetAttrString", referenced from: |
---|
369 | :info:build _initigd in pygupnp-igd-module.o |
---|
370 | :info:build _igd_register_classes in pygupnp-igd.o |
---|
371 | :info:build "_PyObject_Repr", referenced from: |
---|
372 | :info:build _initigd in pygupnp-igd-module.o |
---|
373 | :info:build "_PyString_AsString", referenced from: |
---|
374 | :info:build _initigd in pygupnp-igd-module.o |
---|
375 | :info:build "_Py_BuildValue", referenced from: |
---|
376 | :info:build _igd_register_classes in pygupnp-igd.o |
---|
377 | :info:build "_Py_FatalError", referenced from: |
---|
378 | :info:build _initigd in pygupnp-igd-module.o |
---|
379 | :info:build "_Py_InitModule4_64", referenced from: |
---|
380 | :info:build _initigd in pygupnp-igd-module.o |
---|
381 | :info:build "__Py_NoneStruct", referenced from: |
---|
382 | :info:build __wrap_gupnp_simple_igd_add_port in pygupnp-igd.o |
---|
383 | :info:build __wrap_gupnp_simple_igd_remove_port in pygupnp-igd.o |
---|
384 | :info:build ld: symbol(s) not found for architecture x86_64 |
---|
385 | :info:build clang: error: linker command failed with exit code 1 (use -v to see invocation) |
---|
386 | :info:build make[3]: *** [igd.la] Error 1 |
---|
387 | :info:build make[3]: Leaving directory `/opt/local/var/macports/build/_opt_local_var_macports_sources_rsync.macports.org_macports_release_tarballs_ports_net_gupnp-igd/gupnp-igd/work/gupnp-igd-0.2.5/python' |
---|
388 | :info:build make[2]: *** [all] Error 2 |
---|
389 | :info:build make[2]: Leaving directory `/opt/local/var/macports/build/_opt_local_var_macports_sources_rsync.macports.org_macports_release_tarballs_ports_net_gupnp-igd/gupnp-igd/work/gupnp-igd-0.2.5/python' |
---|
390 | :info:build make[1]: *** [all-recursive] Error 1 |
---|
391 | :info:build make[1]: Leaving directory `/opt/local/var/macports/build/_opt_local_var_macports_sources_rsync.macports.org_macports_release_tarballs_ports_net_gupnp-igd/gupnp-igd/work/gupnp-igd-0.2.5' |
---|
392 | :info:build make: *** [all] Error 2 |
---|
393 | :info:build make: Leaving directory `/opt/local/var/macports/build/_opt_local_var_macports_sources_rsync.macports.org_macports_release_tarballs_ports_net_gupnp-igd/gupnp-igd/work/gupnp-igd-0.2.5' |
---|
394 | :info:build Command failed: cd "/opt/local/var/macports/build/_opt_local_var_macports_sources_rsync.macports.org_macports_release_tarballs_ports_net_gupnp-igd/gupnp-igd/work/gupnp-igd-0.2.5" && /usr/bin/make -j8 -w all CC="/usr/bin/clang -arch x86_64" |
---|
395 | :info:build Exit code: 2 |
---|
396 | :error:build Failed to build gupnp-igd: command execution failed |
---|
397 | :debug:build Error code: CHILDSTATUS 18144 2 |
---|
398 | :debug:build Backtrace: command execution failed |
---|
399 | :debug:build while executing |
---|
400 | :debug:build "system {*}$notty {*}$nice $fullcmdstring" |
---|
401 | :debug:build invoked from within |
---|
402 | :debug:build "command_exec build" |
---|
403 | :debug:build (procedure "portbuild::build_main" line 8) |
---|
404 | :debug:build invoked from within |
---|
405 | :debug:build "$procedure $targetname" |
---|
406 | :error:build See /opt/local/var/macports/logs/_opt_local_var_macports_sources_rsync.macports.org_macports_release_tarballs_ports_net_gupnp-igd/gupnp-igd/main.log for details. |
---|