1 | version:1 |
---|
2 | :debug:sysinfo Mac OS X 10.5 (darwin/9.8.0) arch powerpc |
---|
3 | :debug:sysinfo MacPorts 2.6.4 |
---|
4 | :debug:sysinfo Xcode 3.1.4 |
---|
5 | :debug:sysinfo SDK 10.5 |
---|
6 | :debug:sysinfo MACOSX_DEPLOYMENT_TARGET: 10.5 |
---|
7 | :msg:main ---> Computing dependencies for libusb:debug:main Checking for conflicts against libusb |
---|
8 | :debug:main Searching for dependency: libusb-devel |
---|
9 | :debug:main Didn't find receipt, going to depspec regex for: libusb-devel |
---|
10 | :debug:main Searching for dependency: libtool |
---|
11 | :debug:main Found Dependency: receipt exists for libtool |
---|
12 | :debug:main Searching for dependency: automake |
---|
13 | :debug:main Found Dependency: receipt exists for automake |
---|
14 | :debug:main Searching for dependency: autoconf |
---|
15 | :debug:main Found Dependency: receipt exists for autoconf |
---|
16 | :debug:main Searching for dependency: gcc7 |
---|
17 | :debug:main Found Dependency: receipt exists for gcc7 |
---|
18 | :debug:main Searching for dependency: libgcc |
---|
19 | :debug:main Found Dependency: receipt exists for libgcc |
---|
20 | :debug:main Searching for dependency: libgcc7 |
---|
21 | :debug:main Found Dependency: receipt exists for libgcc7 |
---|
22 | :debug:main Executing org.macports.main (libusb) |
---|
23 | :debug:main dropping privileges: euid changed to 502, egid changed to 502. |
---|
24 | :debug:archivefetch archivefetch phase started at Sat Jan 23 17:34:45 CET 2021 |
---|
25 | :msg:archivefetch ---> Fetching archive for libusb |
---|
26 | :debug:archivefetch Executing org.macports.archivefetch (libusb) |
---|
27 | :debug:archivefetch euid/egid changed to: 0/0 |
---|
28 | :debug:archivefetch chowned /opt/local/var/macports/incoming to macports |
---|
29 | :debug:archivefetch euid/egid changed to: 502/502 |
---|
30 | :info:archivefetch ---> libusb-1.0.24_0.darwin_9.ppc.tbz2 doesn't seem to exist in /opt/local/var/macports/incoming/verified |
---|
31 | :msg:archivefetch ---> Attempting to fetch libusb-1.0.24_0.darwin_9.ppc.tbz2 from http://packages.macports.org/libusb |
---|
32 | :debug:archivefetch Fetching archive failed: The requested URL returned error: 404 |
---|
33 | :msg:archivefetch ---> Attempting to fetch libusb-1.0.24_0.darwin_9.ppc.tbz2 from http://lil.fr.packages.macports.org/libusb |
---|
34 | :debug:archivefetch Fetching archive failed: The requested URL returned error: 404 |
---|
35 | :msg:archivefetch ---> Attempting to fetch libusb-1.0.24_0.darwin_9.ppc.tbz2 from http://cph.dk.packages.macports.org/libusb |
---|
36 | :debug:archivefetch Fetching archive failed: The requested URL returned error: 404 |
---|
37 | :debug:archivefetch Privilege de-escalation not attempted as not running as root. |
---|
38 | :debug:fetch fetch phase started at Sat Jan 23 17:35:34 CET 2021 |
---|
39 | :notice:fetch ---> Fetching distfiles for libusb |
---|
40 | :debug:fetch Executing org.macports.fetch (libusb) |
---|
41 | :debug:fetch Privilege de-escalation not attempted as not running as root. |
---|
42 | :debug:checksum checksum phase started at Sat Jan 23 17:35:35 CET 2021 |
---|
43 | :notice:checksum ---> Verifying checksums for libusb |
---|
44 | :debug:checksum Executing org.macports.checksum (libusb) |
---|
45 | :info:checksum ---> Checksumming libusb-1.0.24.tar.gz |
---|
46 | :debug:checksum Calculated (rmd160) is b07846d6434872ac9f083c3e159edc419510d120 |
---|
47 | :debug:checksum Correct (rmd160) checksum for libusb-1.0.24.tar.gz |
---|
48 | :debug:checksum Calculated (sha256) is 82a06eead29d0eb63cca6ef453e0546e7c7fcd21d390072d0e30a4af2ce6e08b |
---|
49 | :debug:checksum Correct (sha256) checksum for libusb-1.0.24.tar.gz |
---|
50 | :debug:checksum Calculated (size) is 361098 |
---|
51 | :debug:checksum Correct (size) checksum for libusb-1.0.24.tar.gz |
---|
52 | :debug:checksum Privilege de-escalation not attempted as not running as root. |
---|
53 | :debug:extract extract phase started at Sat Jan 23 17:35:35 CET 2021 |
---|
54 | :notice:extract ---> Extracting libusb |
---|
55 | :debug:extract Executing org.macports.extract (libusb) |
---|
56 | :info:extract ---> Extracting libusb-1.0.24.tar.gz |
---|
57 | :debug:extract setting option extract.args to '/opt/local/var/macports/distfiles/libusb/libusb-1.0.24.tar.gz' |
---|
58 | :debug:extract Environment: |
---|
59 | :debug:extract CC_PRINT_OPTIONS='YES' |
---|
60 | :debug:extract CC_PRINT_OPTIONS_FILE='/opt/local/var/macports/build/_opt_local_var_macports_sources_nue.de.rsync.macports.org_macports_release_tarballs_ports_devel_libusb/libusb/work/.CC_PRINT_OPTIONS' |
---|
61 | :debug:extract CPATH='/opt/local/include' |
---|
62 | :debug:extract DEVELOPER_DIR='/Developer' |
---|
63 | :debug:extract LIBRARY_PATH='/opt/local/lib' |
---|
64 | :debug:extract MACOSX_DEPLOYMENT_TARGET='10.5' |
---|
65 | :info:extract Executing: cd "/opt/local/var/macports/build/_opt_local_var_macports_sources_nue.de.rsync.macports.org_macports_release_tarballs_ports_devel_libusb/libusb/work" && /usr/bin/gzip -dc '/opt/local/var/macports/distfiles/libusb/libusb-1.0.24.tar.gz' | /usr/bin/gnutar --no-same-owner -xf - |
---|
66 | :debug:extract system: cd "/opt/local/var/macports/build/_opt_local_var_macports_sources_nue.de.rsync.macports.org_macports_release_tarballs_ports_devel_libusb/libusb/work" && /usr/bin/gzip -dc '/opt/local/var/macports/distfiles/libusb/libusb-1.0.24.tar.gz' | /usr/bin/gnutar --no-same-owner -xf - |
---|
67 | :debug:extract euid/egid changed to: 0/0 |
---|
68 | :debug:extract chowned /opt/local/var/macports/build/_opt_local_var_macports_sources_nue.de.rsync.macports.org_macports_release_tarballs_ports_devel_libusb/libusb/work to macports |
---|
69 | :debug:extract euid/egid changed to: 502/502 |
---|
70 | :debug:extract Symlink: /opt/local/var/macports/build/_opt_local_var_macports_sources_nue.de.rsync.macports.org_macports_release_tarballs_ports_devel_libusb/libusb/work/libusb-1.0.24 -> libusb-libusb-c6a35c5 |
---|
71 | :debug:extract Executing proc-post-org.macports.extract-extract-0 |
---|
72 | :debug:extract Privilege de-escalation not attempted as not running as root. |
---|
73 | :debug:patch patch phase started at Sat Jan 23 17:35:36 CET 2021 |
---|
74 | :debug:patch Executing org.macports.patch (libusb) |
---|
75 | :notice:patch ---> Applying patches to libusb |
---|
76 | :info:patch ---> Applying patch-10.7-nospeedsuper.diff |
---|
77 | :debug:patch Environment: |
---|
78 | :debug:patch CC_PRINT_OPTIONS='YES' |
---|
79 | :debug:patch CC_PRINT_OPTIONS_FILE='/opt/local/var/macports/build/_opt_local_var_macports_sources_nue.de.rsync.macports.org_macports_release_tarballs_ports_devel_libusb/libusb/work/.CC_PRINT_OPTIONS' |
---|
80 | :debug:patch CPATH='/opt/local/include' |
---|
81 | :debug:patch DEVELOPER_DIR='/Developer' |
---|
82 | :debug:patch LIBRARY_PATH='/opt/local/lib' |
---|
83 | :debug:patch MACOSX_DEPLOYMENT_TARGET='10.5' |
---|
84 | :info:patch Executing: cd "/opt/local/var/macports/build/_opt_local_var_macports_sources_nue.de.rsync.macports.org_macports_release_tarballs_ports_devel_libusb/libusb/work/libusb-1.0.24" && /usr/bin/patch -p0 < '/opt/local/var/macports/sources/nue.de.rsync.macports.org/macports/release/tarballs/ports/devel/libusb/files/patch-10.7-nospeedsuper.diff' |
---|
85 | :debug:patch system: cd "/opt/local/var/macports/build/_opt_local_var_macports_sources_nue.de.rsync.macports.org_macports_release_tarballs_ports_devel_libusb/libusb/work/libusb-1.0.24" && /usr/bin/patch -p0 < '/opt/local/var/macports/sources/nue.de.rsync.macports.org/macports/release/tarballs/ports/devel/libusb/files/patch-10.7-nospeedsuper.diff' |
---|
86 | :info:patch patching file libusb/os/darwin_usb.c |
---|
87 | :info:patch ---> Applying patch-c11-const-array-size-older-GCC.diff |
---|
88 | :debug:patch Environment: |
---|
89 | :debug:patch CC_PRINT_OPTIONS='YES' |
---|
90 | :debug:patch CC_PRINT_OPTIONS_FILE='/opt/local/var/macports/build/_opt_local_var_macports_sources_nue.de.rsync.macports.org_macports_release_tarballs_ports_devel_libusb/libusb/work/.CC_PRINT_OPTIONS' |
---|
91 | :debug:patch CPATH='/opt/local/include' |
---|
92 | :debug:patch DEVELOPER_DIR='/Developer' |
---|
93 | :debug:patch LIBRARY_PATH='/opt/local/lib' |
---|
94 | :debug:patch MACOSX_DEPLOYMENT_TARGET='10.5' |
---|
95 | :info:patch Executing: cd "/opt/local/var/macports/build/_opt_local_var_macports_sources_nue.de.rsync.macports.org_macports_release_tarballs_ports_devel_libusb/libusb/work/libusb-1.0.24" && /usr/bin/patch -p0 < '/opt/local/var/macports/sources/nue.de.rsync.macports.org/macports/release/tarballs/ports/devel/libusb/files/patch-c11-const-array-size-older-GCC.diff' |
---|
96 | :debug:patch system: cd "/opt/local/var/macports/build/_opt_local_var_macports_sources_nue.de.rsync.macports.org_macports_release_tarballs_ports_devel_libusb/libusb/work/libusb-1.0.24" && /usr/bin/patch -p0 < '/opt/local/var/macports/sources/nue.de.rsync.macports.org/macports/release/tarballs/ports/devel/libusb/files/patch-c11-const-array-size-older-GCC.diff' |
---|
97 | :info:patch patching file libusb/os/darwin_usb.c |
---|
98 | :debug:patch Privilege de-escalation not attempted as not running as root. |
---|
99 | :debug:configure configure phase started at Sat Jan 23 17:35:36 CET 2021 |
---|
100 | :notice:configure ---> Configuring libusb |
---|
101 | :debug:configure Preferred compilers: macports-gcc-7 macports-gcc-6 macports-gcc-5 macports-clang-7.0 macports-clang-6.0 macports-clang-5.0 macports-clang-3.7 macports-clang-3.4 |
---|
102 | :debug:configure Using compiler 'MacPorts GCC 7' |
---|
103 | :debug:configure Executing org.macports.configure (libusb) |
---|
104 | :debug:configure Environment: |
---|
105 | :debug:configure CC='/opt/local/bin/gcc-mp-7' |
---|
106 | :debug:configure CC_PRINT_OPTIONS='YES' |
---|
107 | :debug:configure CC_PRINT_OPTIONS_FILE='/opt/local/var/macports/build/_opt_local_var_macports_sources_nue.de.rsync.macports.org_macports_release_tarballs_ports_devel_libusb/libusb/work/.CC_PRINT_OPTIONS' |
---|
108 | :debug:configure CFLAGS='-pipe -Os -arch ppc' |
---|
109 | :debug:configure CPATH='/opt/local/include' |
---|
110 | :debug:configure CPPFLAGS='-I/opt/local/include' |
---|
111 | :debug:configure CXX='/opt/local/bin/g++-mp-7' |
---|
112 | :debug:configure CXXFLAGS='-pipe -Os -arch ppc' |
---|
113 | :debug:configure DEVELOPER_DIR='/Developer' |
---|
114 | :debug:configure F77='/opt/local/bin/gfortran-mp-7' |
---|
115 | :debug:configure F90='/opt/local/bin/gfortran-mp-7' |
---|
116 | :debug:configure F90FLAGS='-pipe -Os -m32' |
---|
117 | :debug:configure FC='/opt/local/bin/gfortran-mp-7' |
---|
118 | :debug:configure FCFLAGS='-pipe -Os -m32' |
---|
119 | :debug:configure FFLAGS='-pipe -Os -m32' |
---|
120 | :debug:configure INSTALL='/usr/bin/install -c' |
---|
121 | :debug:configure LDFLAGS='-L/opt/local/lib -Wl,-headerpad_max_install_names -arch ppc' |
---|
122 | :debug:configure LIBRARY_PATH='/opt/local/lib' |
---|
123 | :debug:configure MACOSX_DEPLOYMENT_TARGET='10.5' |
---|
124 | :debug:configure OBJC='/opt/local/bin/gcc-mp-7' |
---|
125 | :debug:configure OBJCFLAGS='-pipe -Os -arch ppc' |
---|
126 | :debug:configure OBJCXX='/opt/local/bin/g++-mp-7' |
---|
127 | :debug:configure OBJCXXFLAGS='-pipe -Os -arch ppc' |
---|
128 | :info:configure Executing: cd "/opt/local/var/macports/build/_opt_local_var_macports_sources_nue.de.rsync.macports.org_macports_release_tarballs_ports_devel_libusb/libusb/work/libusb-1.0.24" && ./autogen.sh --prefix=/opt/local |
---|
129 | :debug:configure system: cd "/opt/local/var/macports/build/_opt_local_var_macports_sources_nue.de.rsync.macports.org_macports_release_tarballs_ports_devel_libusb/libusb/work/libusb-1.0.24" && ./autogen.sh --prefix=/opt/local |
---|
130 | :info:configure autoreconf: Entering directory `.' |
---|
131 | :info:configure autoreconf: configure.ac: not using Gettext |
---|
132 | :info:configure autoreconf: running: /opt/local/bin/aclocal --force -I m4 |
---|
133 | :info:configure autoreconf: configure.ac: tracing |
---|
134 | :info:configure autoreconf: running: /opt/local/bin/glibtoolize --copy --force |
---|
135 | :info:configure glibtoolize: putting auxiliary files in '.'. |
---|
136 | :info:configure glibtoolize: copying file './ltmain.sh' |
---|
137 | :info:configure glibtoolize: putting macros in AC_CONFIG_MACRO_DIRS, 'm4'. |
---|
138 | :info:configure glibtoolize: copying file 'm4/libtool.m4' |
---|
139 | :info:configure glibtoolize: copying file 'm4/ltoptions.m4' |
---|
140 | :info:configure glibtoolize: copying file 'm4/ltsugar.m4' |
---|
141 | :info:configure glibtoolize: copying file 'm4/ltversion.m4' |
---|
142 | :info:configure glibtoolize: copying file 'm4/lt~obsolete.m4' |
---|
143 | :info:configure autoreconf: running: /opt/local/bin/autoconf --force |
---|
144 | :info:configure autoreconf: running: /opt/local/bin/autoheader --force |
---|
145 | :info:configure autoreconf: running: /opt/local/bin/automake --add-missing --copy --force-missing |
---|
146 | :info:configure configure.ac:23: installing './compile' |
---|
147 | :info:configure configure.ac:27: installing './config.guess' |
---|
148 | :info:configure configure.ac:27: installing './config.sub' |
---|
149 | :info:configure configure.ac:26: installing './install-sh' |
---|
150 | :info:configure configure.ac:26: installing './missing' |
---|
151 | :info:configure Makefile.am: installing './INSTALL' |
---|
152 | :info:configure examples/Makefile.am: installing './depcomp' |
---|
153 | :info:configure autoreconf: Leaving directory `.' |
---|
154 | :info:configure checking for gcc... /opt/local/bin/gcc-mp-7 |
---|
155 | :info:configure checking whether the C compiler works... yes |
---|
156 | :info:configure checking for C compiler default output file name... a.out |
---|
157 | :info:configure checking for suffix of executables... |
---|
158 | :info:configure checking whether we are cross compiling... no |
---|
159 | :info:configure checking for suffix of object files... o |
---|
160 | :info:configure checking whether we are using the GNU C compiler... yes |
---|
161 | :info:configure checking whether /opt/local/bin/gcc-mp-7 accepts -g... yes |
---|
162 | :info:configure checking for /opt/local/bin/gcc-mp-7 option to accept ISO C89... none needed |
---|
163 | :info:configure checking whether /opt/local/bin/gcc-mp-7 understands -c and -o together... yes |
---|
164 | :info:configure checking whether we are using the GNU C++ compiler... yes |
---|
165 | :info:configure checking whether /opt/local/bin/g++-mp-7 accepts -g... yes |
---|
166 | :info:configure checking for inline... inline |
---|
167 | :info:configure checking for a BSD-compatible install... /usr/bin/install -c |
---|
168 | :info:configure checking whether build environment is sane... yes |
---|
169 | :info:configure checking for a thread-safe mkdir -p... /opt/local/bin/gmkdir -p |
---|
170 | :info:configure checking for gawk... gawk |
---|
171 | :info:configure checking whether make sets $(MAKE)... yes |
---|
172 | :info:configure checking whether make supports the include directive... yes (GNU style) |
---|
173 | :info:configure checking whether make supports nested variables... yes |
---|
174 | :info:configure checking dependency style of /opt/local/bin/gcc-mp-7... gcc3 |
---|
175 | :info:configure checking dependency style of /opt/local/bin/g++-mp-7... gcc3 |
---|
176 | :info:configure checking build system type... powerpc-apple-darwin9.8.0 |
---|
177 | :info:configure checking host system type... powerpc-apple-darwin9.8.0 |
---|
178 | :info:configure checking how to print strings... printf |
---|
179 | :info:configure checking for a sed that does not truncate output... /opt/local/bin/gsed |
---|
180 | :info:configure checking for grep that handles long lines and -e... /opt/local/bin/ggrep |
---|
181 | :info:configure checking for egrep... /opt/local/bin/ggrep -E |
---|
182 | :info:configure checking for fgrep... /opt/local/bin/ggrep -F |
---|
183 | :info:configure checking for ld used by /opt/local/bin/gcc-mp-7... /opt/local/bin/ld |
---|
184 | :info:configure checking if the linker (/opt/local/bin/ld) is GNU ld... no |
---|
185 | :info:configure checking for BSD- or MS-compatible name lister (nm)... /usr/bin/nm -p |
---|
186 | :info:configure checking the name lister (/usr/bin/nm -p) interface... BSD nm |
---|
187 | :info:configure checking whether ln -s works... yes |
---|
188 | :info:configure checking the maximum length of command line arguments... 196608 |
---|
189 | :info:configure checking how to convert powerpc-apple-darwin9.8.0 file names to powerpc-apple-darwin9.8.0 format... func_convert_file_noop |
---|
190 | :info:configure checking how to convert powerpc-apple-darwin9.8.0 file names to toolchain format... func_convert_file_noop |
---|
191 | :info:configure checking for /opt/local/bin/ld option to reload object files... -r |
---|
192 | :info:configure checking for objdump... no |
---|
193 | :info:configure checking how to recognize dependent libraries... pass_all |
---|
194 | :info:configure checking for dlltool... no |
---|
195 | :info:configure checking how to associate runtime and link libraries... printf %s\n |
---|
196 | :info:configure checking for ar... ar |
---|
197 | :info:configure checking for archiver @FILE support... no |
---|
198 | :info:configure checking for strip... strip |
---|
199 | :info:configure checking for ranlib... ranlib |
---|
200 | :info:configure checking command to parse /usr/bin/nm -p output from /opt/local/bin/gcc-mp-7 object... ok |
---|
201 | :info:configure checking for sysroot... no |
---|
202 | :info:configure checking for a working dd... /bin/dd |
---|
203 | :info:configure checking how to truncate binary pipes... /bin/dd bs=4096 count=1 |
---|
204 | :info:configure checking for mt... no |
---|
205 | :info:configure checking if : is a manifest tool... no |
---|
206 | :info:configure checking for dsymutil... dsymutil |
---|
207 | :info:configure checking for nmedit... nmedit |
---|
208 | :info:configure checking for lipo... lipo |
---|
209 | :info:configure checking for otool... otool |
---|
210 | :info:configure checking for otool64... no |
---|
211 | :info:configure checking for -single_module linker flag... yes |
---|
212 | :info:configure checking for -exported_symbols_list linker flag... yes |
---|
213 | :info:configure checking for -force_load linker flag... yes |
---|
214 | :info:configure checking how to run the C preprocessor... /opt/local/bin/gcc-mp-7 -E |
---|
215 | :info:configure checking for ANSI C header files... yes |
---|
216 | :info:configure checking for sys/types.h... yes |
---|
217 | :info:configure checking for sys/stat.h... yes |
---|
218 | :info:configure checking for stdlib.h... yes |
---|
219 | :info:configure checking for string.h... yes |
---|
220 | :info:configure checking for memory.h... yes |
---|
221 | :info:configure checking for strings.h... yes |
---|
222 | :info:configure checking for inttypes.h... yes |
---|
223 | :info:configure checking for stdint.h... yes |
---|
224 | :info:configure checking for unistd.h... yes |
---|
225 | :info:configure checking for dlfcn.h... yes |
---|
226 | :info:configure checking for objdir... .libs |
---|
227 | :info:configure checking if /opt/local/bin/gcc-mp-7 supports -fno-rtti -fno-exceptions... no |
---|
228 | :info:configure checking for /opt/local/bin/gcc-mp-7 option to produce PIC... -fno-common -DPIC |
---|
229 | :info:configure checking if /opt/local/bin/gcc-mp-7 PIC flag -fno-common -DPIC works... yes |
---|
230 | :info:configure checking if /opt/local/bin/gcc-mp-7 static flag -static works... no |
---|
231 | :info:configure checking if /opt/local/bin/gcc-mp-7 supports -c -o file.o... yes |
---|
232 | :info:configure checking if /opt/local/bin/gcc-mp-7 supports -c -o file.o... (cached) yes |
---|
233 | :info:configure checking whether the /opt/local/bin/gcc-mp-7 linker (/opt/local/bin/ld) supports shared libraries... yes |
---|
234 | :info:configure checking dynamic linker characteristics... darwin9.8.0 dyld |
---|
235 | :info:configure checking how to hardcode library paths into programs... immediate |
---|
236 | :info:configure checking whether stripping libraries is possible... yes |
---|
237 | :info:configure checking if libtool supports shared libraries... yes |
---|
238 | :info:configure checking whether to build shared libraries... yes |
---|
239 | :info:configure checking whether to build static libraries... yes |
---|
240 | :info:configure checking how to run the C++ preprocessor... /opt/local/bin/g++-mp-7 -E |
---|
241 | :info:configure checking for ld used by /opt/local/bin/g++-mp-7... /opt/local/bin/ld |
---|
242 | :info:configure checking if the linker (/opt/local/bin/ld) is GNU ld... no |
---|
243 | :info:configure checking whether the /opt/local/bin/g++-mp-7 linker (/opt/local/bin/ld) supports shared libraries... yes |
---|
244 | :info:configure checking for /opt/local/bin/g++-mp-7 option to produce PIC... -fno-common -DPIC |
---|
245 | :info:configure checking if /opt/local/bin/g++-mp-7 PIC flag -fno-common -DPIC works... yes |
---|
246 | :info:configure checking if /opt/local/bin/g++-mp-7 static flag -static works... no |
---|
247 | :info:configure checking if /opt/local/bin/g++-mp-7 supports -c -o file.o... yes |
---|
248 | :info:configure checking if /opt/local/bin/g++-mp-7 supports -c -o file.o... (cached) yes |
---|
249 | :info:configure checking whether the /opt/local/bin/g++-mp-7 linker (/opt/local/bin/ld) supports shared libraries... yes |
---|
250 | :info:configure checking dynamic linker characteristics... darwin9.8.0 dyld |
---|
251 | :info:configure checking how to hardcode library paths into programs... immediate |
---|
252 | :info:configure checking for windres... no |
---|
253 | :info:configure checking whether make supports nested variables... (cached) yes |
---|
254 | :info:configure checking if /opt/local/bin/gcc-mp-7 supports -std=gnu11... yes |
---|
255 | :info:configure checking operating system... Darwin/Mac OS X |
---|
256 | :info:configure checking for nfds_t... yes |
---|
257 | :info:configure checking for pipe2... no |
---|
258 | :info:configure checking if /opt/local/bin/gcc-mp-7 recognizes -pthread... yes |
---|
259 | :info:configure checking for library containing pthread_create... none required |
---|
260 | :info:configure checking for pthread_threadid_np... no |
---|
261 | :info:configure checking sys/time.h usability... yes |
---|
262 | :info:configure checking sys/time.h presence... yes |
---|
263 | :info:configure checking for sys/time.h... yes |
---|
264 | :info:configure checking for clock_gettime... no |
---|
265 | :info:configure checking that generated files are newer than configure... done |
---|
266 | :info:configure configure: creating ./config.status |
---|
267 | :info:configure config.status: creating libusb-1.0.pc |
---|
268 | :info:configure config.status: creating Makefile |
---|
269 | :info:configure config.status: creating libusb/Makefile |
---|
270 | :info:configure config.status: creating examples/Makefile |
---|
271 | :info:configure config.status: creating tests/Makefile |
---|
272 | :info:configure config.status: creating doc/Makefile |
---|
273 | :info:configure config.status: creating doc/doxygen.cfg |
---|
274 | :info:configure config.status: creating config.h |
---|
275 | :info:configure config.status: executing depfiles commands |
---|
276 | :info:configure config.status: executing libtool commands |
---|
277 | :debug:configure Privilege de-escalation not attempted as not running as root. |
---|
278 | :debug:build build phase started at Sat Jan 23 17:38:01 CET 2021 |
---|
279 | :notice:build ---> Building libusb |
---|
280 | :debug:build Executing org.macports.build (libusb) |
---|
281 | :debug:build port disallows a parallel build |
---|
282 | :debug:build Environment: |
---|
283 | :debug:build CC_PRINT_OPTIONS='YES' |
---|
284 | :debug:build CC_PRINT_OPTIONS_FILE='/opt/local/var/macports/build/_opt_local_var_macports_sources_nue.de.rsync.macports.org_macports_release_tarballs_ports_devel_libusb/libusb/work/.CC_PRINT_OPTIONS' |
---|
285 | :debug:build CPATH='/opt/local/include' |
---|
286 | :debug:build DEVELOPER_DIR='/Developer' |
---|
287 | :debug:build LIBRARY_PATH='/opt/local/lib' |
---|
288 | :debug:build MACOSX_DEPLOYMENT_TARGET='10.5' |
---|
289 | :info:build Executing: cd "/opt/local/var/macports/build/_opt_local_var_macports_sources_nue.de.rsync.macports.org_macports_release_tarballs_ports_devel_libusb/libusb/work/libusb-1.0.24" && /usr/bin/make -w all AM_DEFAULT_VERBOSITY=1 |
---|
290 | :debug:build system: cd "/opt/local/var/macports/build/_opt_local_var_macports_sources_nue.de.rsync.macports.org_macports_release_tarballs_ports_devel_libusb/libusb/work/libusb-1.0.24" && /usr/bin/make -w all AM_DEFAULT_VERBOSITY=1 |
---|
291 | :info:build make: Entering directory `/opt/local/var/macports/build/_opt_local_var_macports_sources_nue.de.rsync.macports.org_macports_release_tarballs_ports_devel_libusb/libusb/work/libusb-libusb-c6a35c5' |
---|
292 | :info:build /usr/bin/make all-recursive |
---|
293 | :info:build make[1]: Entering directory `/opt/local/var/macports/build/_opt_local_var_macports_sources_nue.de.rsync.macports.org_macports_release_tarballs_ports_devel_libusb/libusb/work/libusb-libusb-c6a35c5' |
---|
294 | :info:build Making all in libusb |
---|
295 | :info:build make[2]: Entering directory `/opt/local/var/macports/build/_opt_local_var_macports_sources_nue.de.rsync.macports.org_macports_release_tarballs_ports_devel_libusb/libusb/work/libusb-libusb-c6a35c5/libusb' |
---|
296 | :info:build depbase=`echo core.lo | sed 's|[^/]*$|.deps/&|;s|\.lo$||'`;\ |
---|
297 | :info:build /bin/sh ../libtool --tag=CC --mode=compile /opt/local/bin/gcc-mp-7 -DHAVE_CONFIG_H -I. -I.. -I/opt/local/include -std=gnu11 -Wall -Wextra -Wshadow -Wunused -Wwrite-strings -Werror=format-security -Werror=implicit-function-declaration -Werror=implicit-int -Werror=init-self -Werror=missing-prototypes -Werror=strict-prototypes -Werror=undef -Werror=uninitialized -fvisibility=hidden -pthread -pipe -Os -arch ppc -MT core.lo -MD -MP -MF $depbase.Tpo -c -o core.lo core.c &&\ |
---|
298 | :info:build mv -f $depbase.Tpo $depbase.Plo |
---|
299 | :info:build libtool: compile: /opt/local/bin/gcc-mp-7 -DHAVE_CONFIG_H -I. -I.. -I/opt/local/include -std=gnu11 -Wall -Wextra -Wshadow -Wunused -Wwrite-strings -Werror=format-security -Werror=implicit-function-declaration -Werror=implicit-int -Werror=init-self -Werror=missing-prototypes -Werror=strict-prototypes -Werror=undef -Werror=uninitialized -fvisibility=hidden -pthread -pipe -Os -arch ppc -MT core.lo -MD -MP -MF .deps/core.Tpo -c core.c -fno-common -DPIC -o .libs/core.o |
---|
300 | :info:build libtool: compile: /opt/local/bin/gcc-mp-7 -DHAVE_CONFIG_H -I. -I.. -I/opt/local/include -std=gnu11 -Wall -Wextra -Wshadow -Wunused -Wwrite-strings -Werror=format-security -Werror=implicit-function-declaration -Werror=implicit-int -Werror=init-self -Werror=missing-prototypes -Werror=strict-prototypes -Werror=undef -Werror=uninitialized -fvisibility=hidden -pthread -pipe -Os -arch ppc -MT core.lo -MD -MP -MF .deps/core.Tpo -c core.c -o core.o >/dev/null 2>&1 |
---|
301 | :info:build depbase=`echo descriptor.lo | sed 's|[^/]*$|.deps/&|;s|\.lo$||'`;\ |
---|
302 | :info:build /bin/sh ../libtool --tag=CC --mode=compile /opt/local/bin/gcc-mp-7 -DHAVE_CONFIG_H -I. -I.. -I/opt/local/include -std=gnu11 -Wall -Wextra -Wshadow -Wunused -Wwrite-strings -Werror=format-security -Werror=implicit-function-declaration -Werror=implicit-int -Werror=init-self -Werror=missing-prototypes -Werror=strict-prototypes -Werror=undef -Werror=uninitialized -fvisibility=hidden -pthread -pipe -Os -arch ppc -MT descriptor.lo -MD -MP -MF $depbase.Tpo -c -o descriptor.lo descriptor.c &&\ |
---|
303 | :info:build mv -f $depbase.Tpo $depbase.Plo |
---|
304 | :info:build libtool: compile: /opt/local/bin/gcc-mp-7 -DHAVE_CONFIG_H -I. -I.. -I/opt/local/include -std=gnu11 -Wall -Wextra -Wshadow -Wunused -Wwrite-strings -Werror=format-security -Werror=implicit-function-declaration -Werror=implicit-int -Werror=init-self -Werror=missing-prototypes -Werror=strict-prototypes -Werror=undef -Werror=uninitialized -fvisibility=hidden -pthread -pipe -Os -arch ppc -MT descriptor.lo -MD -MP -MF .deps/descriptor.Tpo -c descriptor.c -fno-common -DPIC -o .libs/descriptor.o |
---|
305 | :info:build libtool: compile: /opt/local/bin/gcc-mp-7 -DHAVE_CONFIG_H -I. -I.. -I/opt/local/include -std=gnu11 -Wall -Wextra -Wshadow -Wunused -Wwrite-strings -Werror=format-security -Werror=implicit-function-declaration -Werror=implicit-int -Werror=init-self -Werror=missing-prototypes -Werror=strict-prototypes -Werror=undef -Werror=uninitialized -fvisibility=hidden -pthread -pipe -Os -arch ppc -MT descriptor.lo -MD -MP -MF .deps/descriptor.Tpo -c descriptor.c -o descriptor.o >/dev/null 2>&1 |
---|
306 | :info:build depbase=`echo hotplug.lo | sed 's|[^/]*$|.deps/&|;s|\.lo$||'`;\ |
---|
307 | :info:build /bin/sh ../libtool --tag=CC --mode=compile /opt/local/bin/gcc-mp-7 -DHAVE_CONFIG_H -I. -I.. -I/opt/local/include -std=gnu11 -Wall -Wextra -Wshadow -Wunused -Wwrite-strings -Werror=format-security -Werror=implicit-function-declaration -Werror=implicit-int -Werror=init-self -Werror=missing-prototypes -Werror=strict-prototypes -Werror=undef -Werror=uninitialized -fvisibility=hidden -pthread -pipe -Os -arch ppc -MT hotplug.lo -MD -MP -MF $depbase.Tpo -c -o hotplug.lo hotplug.c &&\ |
---|
308 | :info:build mv -f $depbase.Tpo $depbase.Plo |
---|
309 | :info:build libtool: compile: /opt/local/bin/gcc-mp-7 -DHAVE_CONFIG_H -I. -I.. -I/opt/local/include -std=gnu11 -Wall -Wextra -Wshadow -Wunused -Wwrite-strings -Werror=format-security -Werror=implicit-function-declaration -Werror=implicit-int -Werror=init-self -Werror=missing-prototypes -Werror=strict-prototypes -Werror=undef -Werror=uninitialized -fvisibility=hidden -pthread -pipe -Os -arch ppc -MT hotplug.lo -MD -MP -MF .deps/hotplug.Tpo -c hotplug.c -fno-common -DPIC -o .libs/hotplug.o |
---|
310 | :info:build libtool: compile: /opt/local/bin/gcc-mp-7 -DHAVE_CONFIG_H -I. -I.. -I/opt/local/include -std=gnu11 -Wall -Wextra -Wshadow -Wunused -Wwrite-strings -Werror=format-security -Werror=implicit-function-declaration -Werror=implicit-int -Werror=init-self -Werror=missing-prototypes -Werror=strict-prototypes -Werror=undef -Werror=uninitialized -fvisibility=hidden -pthread -pipe -Os -arch ppc -MT hotplug.lo -MD -MP -MF .deps/hotplug.Tpo -c hotplug.c -o hotplug.o >/dev/null 2>&1 |
---|
311 | :info:build depbase=`echo io.lo | sed 's|[^/]*$|.deps/&|;s|\.lo$||'`;\ |
---|
312 | :info:build /bin/sh ../libtool --tag=CC --mode=compile /opt/local/bin/gcc-mp-7 -DHAVE_CONFIG_H -I. -I.. -I/opt/local/include -std=gnu11 -Wall -Wextra -Wshadow -Wunused -Wwrite-strings -Werror=format-security -Werror=implicit-function-declaration -Werror=implicit-int -Werror=init-self -Werror=missing-prototypes -Werror=strict-prototypes -Werror=undef -Werror=uninitialized -fvisibility=hidden -pthread -pipe -Os -arch ppc -MT io.lo -MD -MP -MF $depbase.Tpo -c -o io.lo io.c &&\ |
---|
313 | :info:build mv -f $depbase.Tpo $depbase.Plo |
---|
314 | :info:build libtool: compile: /opt/local/bin/gcc-mp-7 -DHAVE_CONFIG_H -I. -I.. -I/opt/local/include -std=gnu11 -Wall -Wextra -Wshadow -Wunused -Wwrite-strings -Werror=format-security -Werror=implicit-function-declaration -Werror=implicit-int -Werror=init-self -Werror=missing-prototypes -Werror=strict-prototypes -Werror=undef -Werror=uninitialized -fvisibility=hidden -pthread -pipe -Os -arch ppc -MT io.lo -MD -MP -MF .deps/io.Tpo -c io.c -fno-common -DPIC -o .libs/io.o |
---|
315 | :info:build libtool: compile: /opt/local/bin/gcc-mp-7 -DHAVE_CONFIG_H -I. -I.. -I/opt/local/include -std=gnu11 -Wall -Wextra -Wshadow -Wunused -Wwrite-strings -Werror=format-security -Werror=implicit-function-declaration -Werror=implicit-int -Werror=init-self -Werror=missing-prototypes -Werror=strict-prototypes -Werror=undef -Werror=uninitialized -fvisibility=hidden -pthread -pipe -Os -arch ppc -MT io.lo -MD -MP -MF .deps/io.Tpo -c io.c -o io.o >/dev/null 2>&1 |
---|
316 | :info:build depbase=`echo strerror.lo | sed 's|[^/]*$|.deps/&|;s|\.lo$||'`;\ |
---|
317 | :info:build /bin/sh ../libtool --tag=CC --mode=compile /opt/local/bin/gcc-mp-7 -DHAVE_CONFIG_H -I. -I.. -I/opt/local/include -std=gnu11 -Wall -Wextra -Wshadow -Wunused -Wwrite-strings -Werror=format-security -Werror=implicit-function-declaration -Werror=implicit-int -Werror=init-self -Werror=missing-prototypes -Werror=strict-prototypes -Werror=undef -Werror=uninitialized -fvisibility=hidden -pthread -pipe -Os -arch ppc -MT strerror.lo -MD -MP -MF $depbase.Tpo -c -o strerror.lo strerror.c &&\ |
---|
318 | :info:build mv -f $depbase.Tpo $depbase.Plo |
---|
319 | :info:build libtool: compile: /opt/local/bin/gcc-mp-7 -DHAVE_CONFIG_H -I. -I.. -I/opt/local/include -std=gnu11 -Wall -Wextra -Wshadow -Wunused -Wwrite-strings -Werror=format-security -Werror=implicit-function-declaration -Werror=implicit-int -Werror=init-self -Werror=missing-prototypes -Werror=strict-prototypes -Werror=undef -Werror=uninitialized -fvisibility=hidden -pthread -pipe -Os -arch ppc -MT strerror.lo -MD -MP -MF .deps/strerror.Tpo -c strerror.c -fno-common -DPIC -o .libs/strerror.o |
---|
320 | :info:build libtool: compile: /opt/local/bin/gcc-mp-7 -DHAVE_CONFIG_H -I. -I.. -I/opt/local/include -std=gnu11 -Wall -Wextra -Wshadow -Wunused -Wwrite-strings -Werror=format-security -Werror=implicit-function-declaration -Werror=implicit-int -Werror=init-self -Werror=missing-prototypes -Werror=strict-prototypes -Werror=undef -Werror=uninitialized -fvisibility=hidden -pthread -pipe -Os -arch ppc -MT strerror.lo -MD -MP -MF .deps/strerror.Tpo -c strerror.c -o strerror.o >/dev/null 2>&1 |
---|
321 | :info:build depbase=`echo sync.lo | sed 's|[^/]*$|.deps/&|;s|\.lo$||'`;\ |
---|
322 | :info:build /bin/sh ../libtool --tag=CC --mode=compile /opt/local/bin/gcc-mp-7 -DHAVE_CONFIG_H -I. -I.. -I/opt/local/include -std=gnu11 -Wall -Wextra -Wshadow -Wunused -Wwrite-strings -Werror=format-security -Werror=implicit-function-declaration -Werror=implicit-int -Werror=init-self -Werror=missing-prototypes -Werror=strict-prototypes -Werror=undef -Werror=uninitialized -fvisibility=hidden -pthread -pipe -Os -arch ppc -MT sync.lo -MD -MP -MF $depbase.Tpo -c -o sync.lo sync.c &&\ |
---|
323 | :info:build mv -f $depbase.Tpo $depbase.Plo |
---|
324 | :info:build libtool: compile: /opt/local/bin/gcc-mp-7 -DHAVE_CONFIG_H -I. -I.. -I/opt/local/include -std=gnu11 -Wall -Wextra -Wshadow -Wunused -Wwrite-strings -Werror=format-security -Werror=implicit-function-declaration -Werror=implicit-int -Werror=init-self -Werror=missing-prototypes -Werror=strict-prototypes -Werror=undef -Werror=uninitialized -fvisibility=hidden -pthread -pipe -Os -arch ppc -MT sync.lo -MD -MP -MF .deps/sync.Tpo -c sync.c -fno-common -DPIC -o .libs/sync.o |
---|
325 | :info:build libtool: compile: /opt/local/bin/gcc-mp-7 -DHAVE_CONFIG_H -I. -I.. -I/opt/local/include -std=gnu11 -Wall -Wextra -Wshadow -Wunused -Wwrite-strings -Werror=format-security -Werror=implicit-function-declaration -Werror=implicit-int -Werror=init-self -Werror=missing-prototypes -Werror=strict-prototypes -Werror=undef -Werror=uninitialized -fvisibility=hidden -pthread -pipe -Os -arch ppc -MT sync.lo -MD -MP -MF .deps/sync.Tpo -c sync.c -o sync.o >/dev/null 2>&1 |
---|
326 | :info:build depbase=`echo os/events_posix.lo | sed 's|[^/]*$|.deps/&|;s|\.lo$||'`;\ |
---|
327 | :info:build /bin/sh ../libtool --tag=CC --mode=compile /opt/local/bin/gcc-mp-7 -DHAVE_CONFIG_H -I. -I.. -I/opt/local/include -std=gnu11 -Wall -Wextra -Wshadow -Wunused -Wwrite-strings -Werror=format-security -Werror=implicit-function-declaration -Werror=implicit-int -Werror=init-self -Werror=missing-prototypes -Werror=strict-prototypes -Werror=undef -Werror=uninitialized -fvisibility=hidden -pthread -pipe -Os -arch ppc -MT os/events_posix.lo -MD -MP -MF $depbase.Tpo -c -o os/events_posix.lo os/events_posix.c &&\ |
---|
328 | :info:build mv -f $depbase.Tpo $depbase.Plo |
---|
329 | :info:build libtool: compile: /opt/local/bin/gcc-mp-7 -DHAVE_CONFIG_H -I. -I.. -I/opt/local/include -std=gnu11 -Wall -Wextra -Wshadow -Wunused -Wwrite-strings -Werror=format-security -Werror=implicit-function-declaration -Werror=implicit-int -Werror=init-self -Werror=missing-prototypes -Werror=strict-prototypes -Werror=undef -Werror=uninitialized -fvisibility=hidden -pthread -pipe -Os -arch ppc -MT os/events_posix.lo -MD -MP -MF os/.deps/events_posix.Tpo -c os/events_posix.c -fno-common -DPIC -o os/.libs/events_posix.o |
---|
330 | :info:build libtool: compile: /opt/local/bin/gcc-mp-7 -DHAVE_CONFIG_H -I. -I.. -I/opt/local/include -std=gnu11 -Wall -Wextra -Wshadow -Wunused -Wwrite-strings -Werror=format-security -Werror=implicit-function-declaration -Werror=implicit-int -Werror=init-self -Werror=missing-prototypes -Werror=strict-prototypes -Werror=undef -Werror=uninitialized -fvisibility=hidden -pthread -pipe -Os -arch ppc -MT os/events_posix.lo -MD -MP -MF os/.deps/events_posix.Tpo -c os/events_posix.c -o os/events_posix.o >/dev/null 2>&1 |
---|
331 | :info:build depbase=`echo os/threads_posix.lo | sed 's|[^/]*$|.deps/&|;s|\.lo$||'`;\ |
---|
332 | :info:build /bin/sh ../libtool --tag=CC --mode=compile /opt/local/bin/gcc-mp-7 -DHAVE_CONFIG_H -I. -I.. -I/opt/local/include -std=gnu11 -Wall -Wextra -Wshadow -Wunused -Wwrite-strings -Werror=format-security -Werror=implicit-function-declaration -Werror=implicit-int -Werror=init-self -Werror=missing-prototypes -Werror=strict-prototypes -Werror=undef -Werror=uninitialized -fvisibility=hidden -pthread -pipe -Os -arch ppc -MT os/threads_posix.lo -MD -MP -MF $depbase.Tpo -c -o os/threads_posix.lo os/threads_posix.c &&\ |
---|
333 | :info:build mv -f $depbase.Tpo $depbase.Plo |
---|
334 | :info:build libtool: compile: /opt/local/bin/gcc-mp-7 -DHAVE_CONFIG_H -I. -I.. -I/opt/local/include -std=gnu11 -Wall -Wextra -Wshadow -Wunused -Wwrite-strings -Werror=format-security -Werror=implicit-function-declaration -Werror=implicit-int -Werror=init-self -Werror=missing-prototypes -Werror=strict-prototypes -Werror=undef -Werror=uninitialized -fvisibility=hidden -pthread -pipe -Os -arch ppc -MT os/threads_posix.lo -MD -MP -MF os/.deps/threads_posix.Tpo -c os/threads_posix.c -fno-common -DPIC -o os/.libs/threads_posix.o |
---|
335 | :info:build libtool: compile: /opt/local/bin/gcc-mp-7 -DHAVE_CONFIG_H -I. -I.. -I/opt/local/include -std=gnu11 -Wall -Wextra -Wshadow -Wunused -Wwrite-strings -Werror=format-security -Werror=implicit-function-declaration -Werror=implicit-int -Werror=init-self -Werror=missing-prototypes -Werror=strict-prototypes -Werror=undef -Werror=uninitialized -fvisibility=hidden -pthread -pipe -Os -arch ppc -MT os/threads_posix.lo -MD -MP -MF os/.deps/threads_posix.Tpo -c os/threads_posix.c -o os/threads_posix.o >/dev/null 2>&1 |
---|
336 | :info:build depbase=`echo os/darwin_usb.lo | sed 's|[^/]*$|.deps/&|;s|\.lo$||'`;\ |
---|
337 | :info:build /bin/sh ../libtool --tag=CC --mode=compile /opt/local/bin/gcc-mp-7 -DHAVE_CONFIG_H -I. -I.. -I/opt/local/include -std=gnu11 -Wall -Wextra -Wshadow -Wunused -Wwrite-strings -Werror=format-security -Werror=implicit-function-declaration -Werror=implicit-int -Werror=init-self -Werror=missing-prototypes -Werror=strict-prototypes -Werror=undef -Werror=uninitialized -fvisibility=hidden -pthread -pipe -Os -arch ppc -MT os/darwin_usb.lo -MD -MP -MF $depbase.Tpo -c -o os/darwin_usb.lo os/darwin_usb.c &&\ |
---|
338 | :info:build mv -f $depbase.Tpo $depbase.Plo |
---|
339 | :info:build libtool: compile: /opt/local/bin/gcc-mp-7 -DHAVE_CONFIG_H -I. -I.. -I/opt/local/include -std=gnu11 -Wall -Wextra -Wshadow -Wunused -Wwrite-strings -Werror=format-security -Werror=implicit-function-declaration -Werror=implicit-int -Werror=init-self -Werror=missing-prototypes -Werror=strict-prototypes -Werror=undef -Werror=uninitialized -fvisibility=hidden -pthread -pipe -Os -arch ppc -MT os/darwin_usb.lo -MD -MP -MF os/.deps/darwin_usb.Tpo -c os/darwin_usb.c -fno-common -DPIC -o os/.libs/darwin_usb.o |
---|
340 | :info:build In file included from /System/Library/Frameworks/IOKit.framework/Headers/usb/IOUSBLib.h:27:0, |
---|
341 | :info:build from os/darwin_usb.h:30, |
---|
342 | :info:build from os/darwin_usb.c:49: |
---|
343 | :info:build /System/Library/Frameworks/IOKit.framework/Headers/usb/USB.h:594:9: error: too many #pragma options align=reset |
---|
344 | :info:build #pragma options align=reset |
---|
345 | :info:build ^~~~~~~ |
---|
346 | :info:build /System/Library/Frameworks/IOKit.framework/Headers/usb/USB.h:612:9: error: too many #pragma options align=reset |
---|
347 | :info:build #pragma options align=reset |
---|
348 | :info:build ^~~~~~~ |
---|
349 | :info:build /System/Library/Frameworks/IOKit.framework/Headers/usb/USB.h:632:9: error: too many #pragma options align=reset |
---|
350 | :info:build #pragma options align=reset |
---|
351 | :info:build ^~~~~~~ |
---|
352 | :info:build In file included from os/darwin_usb.h:26:0, |
---|
353 | :info:build from os/darwin_usb.c:49: |
---|
354 | :info:build os/darwin_usb.c: In function 'darwin_get_cached_device': |
---|
355 | :info:build os/darwin_usb.c:1011:16: warning: format '%x' expects argument of type 'unsigned int', but argument 6 has type 'UInt32 {aka long unsigned int}' [-Wformat=] |
---|
356 | :info:build usbi_dbg("matching sessionID/locationID 0x%" PRIx64 "/0x%x against cached device with sessionID/locationID 0x%" PRIx64 "/0x%x", |
---|
357 | :info:build ^ |
---|
358 | :info:build ./libusbi.h:287:67: note: in definition of macro '_usbi_log' |
---|
359 | :info:build #define _usbi_log(ctx, level, ...) usbi_log(ctx, level, __func__, __VA_ARGS__) |
---|
360 | :info:build ^~~~~~~~~~~ |
---|
361 | :info:build os/darwin_usb.c:1011:7: note: in expansion of macro 'usbi_dbg' |
---|
362 | :info:build usbi_dbg("matching sessionID/locationID 0x%" PRIx64 "/0x%x against cached device with sessionID/locationID 0x%" PRIx64 "/0x%x", |
---|
363 | :info:build ^~~~~~~~ |
---|
364 | :info:build os/darwin_usb.c:1011:64: note: format string is defined here |
---|
365 | :info:build usbi_dbg("matching sessionID/locationID 0x%" PRIx64 "/0x%x against cached device with sessionID/locationID 0x%" PRIx64 "/0x%x", |
---|
366 | :info:build ~^ |
---|
367 | :info:build %lx |
---|
368 | :info:build In file included from os/darwin_usb.h:26:0, |
---|
369 | :info:build from os/darwin_usb.c:49: |
---|
370 | :info:build os/darwin_usb.c:1011:16: warning: format '%x' expects argument of type 'unsigned int', but argument 8 has type 'UInt32 {aka long unsigned int}' [-Wformat=] |
---|
371 | :info:build usbi_dbg("matching sessionID/locationID 0x%" PRIx64 "/0x%x against cached device with sessionID/locationID 0x%" PRIx64 "/0x%x", |
---|
372 | :info:build ^ |
---|
373 | :info:build sessionID, locationID, new_device->session, new_device->location); |
---|
374 | :info:build ~~~~~~~~~~~~~ |
---|
375 | :info:build ./libusbi.h:287:67: note: in definition of macro '_usbi_log' |
---|
376 | :info:build #define _usbi_log(ctx, level, ...) usbi_log(ctx, level, __func__, __VA_ARGS__) |
---|
377 | :info:build ^~~~~~~~~~~ |
---|
378 | :info:build os/darwin_usb.c:1011:7: note: in expansion of macro 'usbi_dbg' |
---|
379 | :info:build usbi_dbg("matching sessionID/locationID 0x%" PRIx64 "/0x%x against cached device with sessionID/locationID 0x%" PRIx64 "/0x%x", |
---|
380 | :info:build ^~~~~~~~ |
---|
381 | :info:build os/darwin_usb.c:1011:131: note: format string is defined here |
---|
382 | :info:build usbi_dbg("matching sessionID/locationID 0x%" PRIx64 "/0x%x against cached device with sessionID/locationID 0x%" PRIx64 "/0x%x", |
---|
383 | :info:build ~^ |
---|
384 | :info:build %lx |
---|
385 | :info:build make[2]: *** [os/darwin_usb.lo] Error 1 |
---|
386 | :info:build make[2]: Leaving directory `/opt/local/var/macports/build/_opt_local_var_macports_sources_nue.de.rsync.macports.org_macports_release_tarballs_ports_devel_libusb/libusb/work/libusb-libusb-c6a35c5/libusb' |
---|
387 | :info:build make[1]: *** [all-recursive] Error 1 |
---|
388 | :info:build make[1]: Leaving directory `/opt/local/var/macports/build/_opt_local_var_macports_sources_nue.de.rsync.macports.org_macports_release_tarballs_ports_devel_libusb/libusb/work/libusb-libusb-c6a35c5' |
---|
389 | :info:build make: *** [all] Error 2 |
---|
390 | :info:build make: Leaving directory `/opt/local/var/macports/build/_opt_local_var_macports_sources_nue.de.rsync.macports.org_macports_release_tarballs_ports_devel_libusb/libusb/work/libusb-libusb-c6a35c5' |
---|
391 | :info:build Command failed: cd "/opt/local/var/macports/build/_opt_local_var_macports_sources_nue.de.rsync.macports.org_macports_release_tarballs_ports_devel_libusb/libusb/work/libusb-1.0.24" && /usr/bin/make -w all AM_DEFAULT_VERBOSITY=1 |
---|
392 | :info:build Exit code: 2 |
---|
393 | :error:build Failed to build libusb: command execution failed |
---|
394 | :debug:build Error code: CHILDSTATUS 76813 2 |
---|
395 | :debug:build Backtrace: command execution failed |
---|
396 | :debug:build while executing |
---|
397 | :debug:build "system {*}$notty {*}$nice $fullcmdstring" |
---|
398 | :debug:build invoked from within |
---|
399 | :debug:build "command_exec build" |
---|
400 | :debug:build (procedure "portbuild::build_main" line 8) |
---|
401 | :debug:build invoked from within |
---|
402 | :debug:build "$procedure $targetname" |
---|
403 | :error:build See /opt/local/var/macports/logs/_opt_local_var_macports_sources_nue.de.rsync.macports.org_macports_release_tarballs_ports_devel_libusb/libusb/main.log for details. |
---|