1 | version:1 |
---|
2 | :debug:main Starting logging for libomp @17.0.3_0+universal |
---|
3 | :debug:sysinfo Mac OS X 10.7.5 (darwin/11.4.2) arch i386 |
---|
4 | :debug:sysinfo MacPorts 2.8.1 |
---|
5 | :debug:sysinfo Xcode 4.6.3, CLT 4.6.0.0.1.1365549073 |
---|
6 | :debug:sysinfo SDK 10.7 |
---|
7 | :debug:sysinfo MACOSX_DEPLOYMENT_TARGET: 10.7 |
---|
8 | :msg:main ---> Computing dependencies for libomp:info:main .:debug:main libomp has no conflicts |
---|
9 | :debug:main Searching for dependency: xz |
---|
10 | :debug:main Found Dependency: receipt exists for xz |
---|
11 | :debug:main Searching for dependency: cmake |
---|
12 | :debug:main Found Dependency: receipt exists for cmake |
---|
13 | :debug:main Searching for dependency: perl5 |
---|
14 | :debug:main Found Dependency: receipt exists for perl5 |
---|
15 | :debug:main Searching for dependency: clang-3.7 |
---|
16 | :debug:main Found Dependency: receipt exists for clang-3.7 |
---|
17 | :debug:main Executing org.macports.main (libomp) |
---|
18 | :debug:main dropping privileges: euid changed to 503, egid changed to 501. |
---|
19 | :debug:archivefetch archivefetch phase started at Tue Oct 17 09:53:00 EDT 2023 |
---|
20 | :msg:archivefetch ---> Fetching archive for libomp |
---|
21 | :debug:archivefetch Executing org.macports.archivefetch (libomp) |
---|
22 | :debug:archivefetch euid/egid changed to: 0/0 |
---|
23 | :debug:archivefetch chowned /opt/local/var/macports/incoming to macports |
---|
24 | :debug:archivefetch euid/egid changed to: 503/501 |
---|
25 | :info:archivefetch ---> libomp-17.0.3_0+universal.darwin_11.i386-x86_64.tbz2 doesn't seem to exist in /opt/local/var/macports/incoming/verified |
---|
26 | :msg:archivefetch ---> Attempting to fetch libomp-17.0.3_0+universal.darwin_11.i386-x86_64.tbz2 from http://packages.macports.org/libomp |
---|
27 | :debug:archivefetch Fetching archive failed: The requested URL returned error: 404 |
---|
28 | :msg:archivefetch ---> Attempting to fetch libomp-17.0.3_0+universal.darwin_11.i386-x86_64.tbz2 from http://ywg.ca.packages.macports.org/mirror/macports/packages/libomp |
---|
29 | :debug:archivefetch Fetching archive failed: The requested URL returned error: 404 |
---|
30 | :msg:archivefetch ---> Attempting to fetch libomp-17.0.3_0+universal.darwin_11.i386-x86_64.tbz2 from http://mirror.fcix.net/macports/packages/libomp |
---|
31 | :debug:archivefetch Fetching archive failed: The requested URL returned error: 404 |
---|
32 | :debug:archivefetch Privilege de-escalation not attempted as not running as root. |
---|
33 | :debug:fetch fetch phase started at Tue Oct 17 09:53:01 EDT 2023 |
---|
34 | :notice:fetch ---> Fetching distfiles for libomp |
---|
35 | :debug:fetch Executing org.macports.fetch (libomp) |
---|
36 | :debug:fetch Privilege de-escalation not attempted as not running as root. |
---|
37 | :debug:checksum checksum phase started at Tue Oct 17 09:53:01 EDT 2023 |
---|
38 | :notice:checksum ---> Verifying checksums for libomp |
---|
39 | :debug:checksum Executing org.macports.checksum (libomp) |
---|
40 | :info:checksum ---> Checksumming openmp-17.0.3.src.tar.xz |
---|
41 | :debug:checksum Calculated (rmd160) is a79350f38202f4e9819373a433b1b19cef631eb2 |
---|
42 | :debug:checksum Correct (rmd160) checksum for openmp-17.0.3.src.tar.xz |
---|
43 | :debug:checksum Calculated (sha256) is e04172c067f256d06cd8112abb49bc65f4e1d986a4b49b36cd837dfee3cdd274 |
---|
44 | :debug:checksum Correct (sha256) checksum for openmp-17.0.3.src.tar.xz |
---|
45 | :debug:checksum Calculated (size) is 1273276 |
---|
46 | :debug:checksum Correct (size) checksum for openmp-17.0.3.src.tar.xz |
---|
47 | :info:checksum ---> Checksumming cmake-17.0.3.src.tar.xz |
---|
48 | :debug:checksum Calculated (rmd160) is 2f419efae4d3f8c9d87943cf1873031468a19bd7 |
---|
49 | :debug:checksum Correct (rmd160) checksum for cmake-17.0.3.src.tar.xz |
---|
50 | :debug:checksum Calculated (sha256) is 54fc534f0da09088adbaa6c3bfc9899a500153b96e60c2fb9322a7aa37b1027a |
---|
51 | :debug:checksum Correct (sha256) checksum for cmake-17.0.3.src.tar.xz |
---|
52 | :debug:checksum Calculated (size) is 8712 |
---|
53 | :debug:checksum Correct (size) checksum for cmake-17.0.3.src.tar.xz |
---|
54 | :debug:checksum Privilege de-escalation not attempted as not running as root. |
---|
55 | :debug:extract extract phase started at Tue Oct 17 09:53:01 EDT 2023 |
---|
56 | :notice:extract ---> Extracting libomp |
---|
57 | :debug:extract setting option extract.cmd to /opt/local/bin/xz |
---|
58 | :debug:extract Executing org.macports.extract (libomp) |
---|
59 | :info:extract ---> Extracting openmp-17.0.3.src.tar.xz |
---|
60 | :debug:extract setting option extract.args to '/opt/local/var/macports/distfiles/openmp-release/openmp-17.0.3.src.tar.xz' |
---|
61 | :debug:extract Environment: |
---|
62 | :debug:extract CC_PRINT_OPTIONS='YES' |
---|
63 | :debug:extract CC_PRINT_OPTIONS_FILE='/opt/local/var/macports/build/_opt_local_var_macports_sources_rsync.macports.org_macports_release_tarballs_ports_lang_libomp/libomp/work/.CC_PRINT_OPTIONS' |
---|
64 | :debug:extract CPATH='/opt/local/include' |
---|
65 | :debug:extract DEVELOPER_DIR='/Applications/Xcode.app/Contents/Developer' |
---|
66 | :debug:extract LIBRARY_PATH='/opt/local/lib' |
---|
67 | :debug:extract MACOSX_DEPLOYMENT_TARGET='10.7' |
---|
68 | :info:extract Executing: cd "/opt/local/var/macports/build/_opt_local_var_macports_sources_rsync.macports.org_macports_release_tarballs_ports_lang_libomp/libomp/work" && /opt/local/bin/xz -dc '/opt/local/var/macports/distfiles/openmp-release/openmp-17.0.3.src.tar.xz' | /usr/bin/gnutar --no-same-owner -xf - |
---|
69 | :debug:extract system: cd "/opt/local/var/macports/build/_opt_local_var_macports_sources_rsync.macports.org_macports_release_tarballs_ports_lang_libomp/libomp/work" && /opt/local/bin/xz -dc '/opt/local/var/macports/distfiles/openmp-release/openmp-17.0.3.src.tar.xz' | /usr/bin/gnutar --no-same-owner -xf - |
---|
70 | :debug:extract euid/egid changed to: 0/0 |
---|
71 | :debug:extract chowned /opt/local/var/macports/build/_opt_local_var_macports_sources_rsync.macports.org_macports_release_tarballs_ports_lang_libomp/libomp/work to macports |
---|
72 | :debug:extract euid/egid changed to: 503/501 |
---|
73 | :info:extract ---> Extracting cmake-17.0.3.src.tar.xz |
---|
74 | :debug:extract setting option extract.args to '/opt/local/var/macports/distfiles/openmp-release/cmake-17.0.3.src.tar.xz' |
---|
75 | :debug:extract Environment: |
---|
76 | :debug:extract CC_PRINT_OPTIONS='YES' |
---|
77 | :debug:extract CC_PRINT_OPTIONS_FILE='/opt/local/var/macports/build/_opt_local_var_macports_sources_rsync.macports.org_macports_release_tarballs_ports_lang_libomp/libomp/work/.CC_PRINT_OPTIONS' |
---|
78 | :debug:extract CPATH='/opt/local/include' |
---|
79 | :debug:extract DEVELOPER_DIR='/Applications/Xcode.app/Contents/Developer' |
---|
80 | :debug:extract LIBRARY_PATH='/opt/local/lib' |
---|
81 | :debug:extract MACOSX_DEPLOYMENT_TARGET='10.7' |
---|
82 | :info:extract Executing: cd "/opt/local/var/macports/build/_opt_local_var_macports_sources_rsync.macports.org_macports_release_tarballs_ports_lang_libomp/libomp/work" && /opt/local/bin/xz -dc '/opt/local/var/macports/distfiles/openmp-release/cmake-17.0.3.src.tar.xz' | /usr/bin/gnutar --no-same-owner -xf - |
---|
83 | :debug:extract system: cd "/opt/local/var/macports/build/_opt_local_var_macports_sources_rsync.macports.org_macports_release_tarballs_ports_lang_libomp/libomp/work" && /opt/local/bin/xz -dc '/opt/local/var/macports/distfiles/openmp-release/cmake-17.0.3.src.tar.xz' | /usr/bin/gnutar --no-same-owner -xf - |
---|
84 | :debug:extract euid/egid changed to: 0/0 |
---|
85 | :debug:extract chowned /opt/local/var/macports/build/_opt_local_var_macports_sources_rsync.macports.org_macports_release_tarballs_ports_lang_libomp/libomp/work to macports |
---|
86 | :debug:extract euid/egid changed to: 503/501 |
---|
87 | :debug:extract Executing proc-post-org.macports.extract-extract-0 |
---|
88 | :info:extract ---> Patching check-depends.pl: /bulk.*compatibility/s/s+/s+.*/ |
---|
89 | :debug:extract Executing reinplace: /usr/bin/sed /bulk.*compatibility/s/s+/s+.*/ </opt/local/var/macports/build/_opt_local_var_macports_sources_rsync.macports.org_macports_release_tarballs_ports_lang_libomp/libomp/work/openmp-17.0.3.src/runtime/tools/check-depends.pl >@file13 |
---|
90 | :debug:extract euid/egid changed to: 0/0 |
---|
91 | :debug:extract chowned /opt/local/var/macports/build/_opt_local_var_macports_sources_rsync.macports.org_macports_release_tarballs_ports_lang_libomp/libomp/work/openmp-17.0.3.src/runtime/tools/check-depends.pl to macports |
---|
92 | :debug:extract euid/egid changed to: 503/501 |
---|
93 | :debug:extract euid/egid changed to: 0/0 |
---|
94 | :debug:extract setting attributes on /opt/local/var/macports/build/_opt_local_var_macports_sources_rsync.macports.org_macports_release_tarballs_ports_lang_libomp/libomp/work/openmp-17.0.3.src/runtime/tools/check-depends.pl |
---|
95 | :debug:extract euid/egid changed to: 503/501 |
---|
96 | :debug:extract system -W /opt/local/var/macports/build/_opt_local_var_macports_sources_rsync.macports.org_macports_release_tarballs_ports_lang_libomp/libomp/work: mv cmake*.src/Modules/* openmp*/cmake/ |
---|
97 | :debug:extract Privilege de-escalation not attempted as not running as root. |
---|
98 | :debug:patch patch phase started at Tue Oct 17 09:53:02 EDT 2023 |
---|
99 | :debug:patch Executing org.macports.patch (libomp) |
---|
100 | :notice:patch ---> Applying patches to libomp |
---|
101 | :info:patch ---> Applying patch-libomp-use-gettid-on-Leopard.diff |
---|
102 | :debug:patch Environment: |
---|
103 | :debug:patch CC_PRINT_OPTIONS='YES' |
---|
104 | :debug:patch CC_PRINT_OPTIONS_FILE='/opt/local/var/macports/build/_opt_local_var_macports_sources_rsync.macports.org_macports_release_tarballs_ports_lang_libomp/libomp/work/.CC_PRINT_OPTIONS' |
---|
105 | :debug:patch CPATH='/opt/local/include' |
---|
106 | :debug:patch DEVELOPER_DIR='/Applications/Xcode.app/Contents/Developer' |
---|
107 | :debug:patch LIBRARY_PATH='/opt/local/lib' |
---|
108 | :debug:patch MACOSX_DEPLOYMENT_TARGET='10.7' |
---|
109 | :info:patch Executing: cd "/opt/local/var/macports/build/_opt_local_var_macports_sources_rsync.macports.org_macports_release_tarballs_ports_lang_libomp/libomp/work/openmp-17.0.3.src" && /usr/bin/patch -p0 < '/opt/local/var/macports/sources/rsync.macports.org/macports/release/tarballs/ports/lang/libomp/files/patch-libomp-use-gettid-on-Leopard.diff' |
---|
110 | :debug:patch system: cd "/opt/local/var/macports/build/_opt_local_var_macports_sources_rsync.macports.org_macports_release_tarballs_ports_lang_libomp/libomp/work/openmp-17.0.3.src" && /usr/bin/patch -p0 < '/opt/local/var/macports/sources/rsync.macports.org/macports/release/tarballs/ports/lang/libomp/files/patch-libomp-use-gettid-on-Leopard.diff' |
---|
111 | :info:patch patching file runtime/src/kmp_wrapper_getpid.h |
---|
112 | :debug:patch Privilege de-escalation not attempted as not running as root. |
---|
113 | :debug:configure configure phase started at Tue Oct 17 09:53:02 EDT 2023 |
---|
114 | :notice:configure ---> Configuring libomp |
---|
115 | :debug:configure Preferred compilers: macports-clang-15 macports-clang-14 macports-clang-13 macports-clang-12 macports-clang-11 macports-clang-10 macports-clang-9.0 macports-clang-8.0 macports-clang-7.0 macports-clang-6.0 macports-clang-5.0 macports-clang-3.7 macports-clang-3.4 |
---|
116 | :debug:configure Using compiler 'MacPorts Clang 3.7' |
---|
117 | :debug:configure Executing proc-pre-org.macports.configure-configure-0 |
---|
118 | :debug:configure CPPFLAGS="-I/opt/local/include" inserted into CFLAGS="-Os -stdlib=libc++ -DNDEBUG -I/opt/local/include" CXXFLAGS="-Os -std=c++11 -DNDEBUG -I/opt/local/include -stdlib=libc++" |
---|
119 | :debug:configure Executing proc-pre-org.macports.configure-configure-1 |
---|
120 | :debug:configure Executing org.macports.configure (libomp) |
---|
121 | :info:configure ---> Configuring libomp for architecture x86_64 |
---|
122 | :debug:configure setting option configure.dir to /opt/local/var/macports/build/_opt_local_var_macports_sources_rsync.macports.org_macports_release_tarballs_ports_lang_libomp/libomp/work/build-x86_64 |
---|
123 | :debug:configure setting option autoreconf.dir to /opt/local/var/macports/build/_opt_local_var_macports_sources_rsync.macports.org_macports_release_tarballs_ports_lang_libomp/libomp/work/openmp-17.0.3.src-x86_64 |
---|
124 | :debug:configure setting option autoconf.dir to /opt/local/var/macports/build/_opt_local_var_macports_sources_rsync.macports.org_macports_release_tarballs_ports_lang_libomp/libomp/work/openmp-17.0.3.src-x86_64 |
---|
125 | :debug:configure Environment: |
---|
126 | :debug:configure CC='/opt/local/bin/clang-mp-3.7' |
---|
127 | :debug:configure CC_PRINT_OPTIONS='YES' |
---|
128 | :debug:configure CC_PRINT_OPTIONS_FILE='/opt/local/var/macports/build/_opt_local_var_macports_sources_rsync.macports.org_macports_release_tarballs_ports_lang_libomp/libomp/work/.CC_PRINT_OPTIONS' |
---|
129 | :debug:configure CFLAGS='-pipe -Os -stdlib=libc++ -DNDEBUG -I/opt/local/include' |
---|
130 | :debug:configure CPATH='/opt/local/include' |
---|
131 | :debug:configure CXX='/opt/local/bin/clang++-mp-3.7' |
---|
132 | :debug:configure CXXFLAGS='-pipe -Os -std=c++11 -DNDEBUG -I/opt/local/include -stdlib=libc++' |
---|
133 | :debug:configure DEVELOPER_DIR='/Applications/Xcode.app/Contents/Developer' |
---|
134 | :debug:configure F90FLAGS='-pipe -Os' |
---|
135 | :debug:configure FCFLAGS='-pipe -Os' |
---|
136 | :debug:configure FFLAGS='-pipe -Os' |
---|
137 | :debug:configure INSTALL='/usr/bin/install -c' |
---|
138 | :debug:configure LDFLAGS='-L/opt/local/lib -Wl,-headerpad_max_install_names' |
---|
139 | :debug:configure LIBRARY_PATH='/opt/local/lib' |
---|
140 | :debug:configure MACOSX_DEPLOYMENT_TARGET='10.7' |
---|
141 | :debug:configure OBJC='/opt/local/bin/clang-mp-3.7' |
---|
142 | :debug:configure OBJCFLAGS='-pipe -Os -I/opt/local/include' |
---|
143 | :debug:configure OBJCXX='/opt/local/bin/clang++-mp-3.7' |
---|
144 | :debug:configure OBJCXXFLAGS='-pipe -Os -std=c++11 -I/opt/local/include -stdlib=libc++' |
---|
145 | :info:configure Executing: cd "/opt/local/var/macports/build/_opt_local_var_macports_sources_rsync.macports.org_macports_release_tarballs_ports_lang_libomp/libomp/work/build-x86_64" && /opt/local/bin/cmake -G "CodeBlocks - Unix Makefiles" -DCMAKE_INSTALL_PREFIX=/opt/local/tmp -DCMAKE_INSTALL_RPATH=/opt/local/lib/libomp -DCMAKE_INSTALL_NAME_DIR=/opt/local/lib/libomp -DCMAKE_OSX_DEPLOYMENT_TARGET="10.7" -DCMAKE_OSX_SYSROOT="/" -DCMAKE_OSX_ARCHITECTURES=x86_64 /opt/local/var/macports/build/_opt_local_var_macports_sources_rsync.macports.org_macports_release_tarballs_ports_lang_libomp/libomp/work/openmp-17.0.3.src |
---|
146 | :debug:configure system: cd "/opt/local/var/macports/build/_opt_local_var_macports_sources_rsync.macports.org_macports_release_tarballs_ports_lang_libomp/libomp/work/build-x86_64" && /opt/local/bin/cmake -G "CodeBlocks - Unix Makefiles" -DCMAKE_INSTALL_PREFIX=/opt/local/tmp -DCMAKE_INSTALL_RPATH=/opt/local/lib/libomp -DCMAKE_INSTALL_NAME_DIR=/opt/local/lib/libomp -DCMAKE_OSX_DEPLOYMENT_TARGET="10.7" -DCMAKE_OSX_SYSROOT="/" -DCMAKE_OSX_ARCHITECTURES=x86_64 /opt/local/var/macports/build/_opt_local_var_macports_sources_rsync.macports.org_macports_release_tarballs_ports_lang_libomp/libomp/work/openmp-17.0.3.src |
---|
147 | :info:configure -- The C compiler identification is Clang 3.7.1 |
---|
148 | :info:configure -- The CXX compiler identification is Clang 3.7.1 |
---|
149 | :info:configure -- The ASM compiler identification is Clang with GNU-like command-line |
---|
150 | :info:configure -- Found assembler: /opt/local/bin/clang-mp-3.7 |
---|
151 | :info:configure -- Detecting C compiler ABI info |
---|
152 | :info:configure -- Detecting C compiler ABI info - done |
---|
153 | :info:configure -- Check for working C compiler: /opt/local/bin/clang-mp-3.7 - skipped |
---|
154 | :info:configure -- Detecting C compile features |
---|
155 | :info:configure -- Detecting C compile features - done |
---|
156 | :info:configure -- Detecting CXX compiler ABI info |
---|
157 | :info:configure -- Detecting CXX compiler ABI info - done |
---|
158 | :info:configure -- Check for working CXX compiler: /opt/local/bin/clang++-mp-3.7 - skipped |
---|
159 | :info:configure -- Detecting CXX compile features |
---|
160 | :info:configure -- Detecting CXX compile features - done |
---|
161 | :info:configure -- Performing Test OPENMP_HAVE_ONEAPI_COMPILER |
---|
162 | :info:configure -- Performing Test OPENMP_HAVE_ONEAPI_COMPILER - Failed |
---|
163 | :info:configure -- Performing Test OPENMP_HAVE_WALL_FLAG |
---|
164 | :info:configure -- Performing Test OPENMP_HAVE_WALL_FLAG - Success |
---|
165 | :info:configure -- Performing Test OPENMP_HAVE_WERROR_FLAG |
---|
166 | :info:configure -- Performing Test OPENMP_HAVE_WERROR_FLAG - Success |
---|
167 | :info:configure -- Performing Test OPENMP_HAVE_WCAST_QUAL_FLAG |
---|
168 | :info:configure -- Performing Test OPENMP_HAVE_WCAST_QUAL_FLAG - Success |
---|
169 | :info:configure -- Performing Test OPENMP_HAVE_WFORMAT_PEDANTIC_FLAG |
---|
170 | :info:configure -- Performing Test OPENMP_HAVE_WFORMAT_PEDANTIC_FLAG - Success |
---|
171 | :info:configure -- Performing Test OPENMP_HAVE_WIMPLICIT_FALLTHROUGH_FLAG |
---|
172 | :info:configure -- Performing Test OPENMP_HAVE_WIMPLICIT_FALLTHROUGH_FLAG - Success |
---|
173 | :info:configure -- Performing Test OPENMP_HAVE_WSIGN_COMPARE_FLAG |
---|
174 | :info:configure -- Performing Test OPENMP_HAVE_WSIGN_COMPARE_FLAG - Success |
---|
175 | :info:configure -- Performing Test OPENMP_HAVE_WENUM_CONSTEXPR_CONVERSION_FLAG |
---|
176 | :info:configure -- Performing Test OPENMP_HAVE_WENUM_CONSTEXPR_CONVERSION_FLAG - Failed |
---|
177 | :info:configure -- Performing Test OPENMP_HAVE_WEXTRA_FLAG |
---|
178 | :info:configure -- Performing Test OPENMP_HAVE_WEXTRA_FLAG - Success |
---|
179 | :info:configure -- Performing Test OPENMP_HAVE_WPEDANTIC_FLAG |
---|
180 | :info:configure -- Performing Test OPENMP_HAVE_WPEDANTIC_FLAG - Success |
---|
181 | :info:configure -- Performing Test OPENMP_HAVE_WMAYBE_UNINITIALIZED_FLAG |
---|
182 | :info:configure -- Performing Test OPENMP_HAVE_WMAYBE_UNINITIALIZED_FLAG - Failed |
---|
183 | :info:configure -- Found Python3: /opt/local/bin/python3.11 (found version "3.11.6") found components: Interpreter |
---|
184 | :info:configure -- Cannot find llvm-lit. |
---|
185 | :info:configure -- Please put llvm-lit in your PATH, set OPENMP_LLVM_LIT_EXECUTABLE to its full path, or point OPENMP_LLVM_TOOLS_DIR to its directory. |
---|
186 | :info:configure CMake Warning at cmake/OpenMPTesting.cmake:22 (message): |
---|
187 | :info:configure The check targets will not be available! |
---|
188 | :info:configure Call Stack (most recent call first): |
---|
189 | :info:configure cmake/OpenMPTesting.cmake:51 (find_standalone_test_dependencies) |
---|
190 | :info:configure CMakeLists.txt:69 (include) |
---|
191 | :info:configure -- Performing Test LIBOMP_HAVE_FNO_EXCEPTIONS_FLAG |
---|
192 | :info:configure -- Performing Test LIBOMP_HAVE_FNO_EXCEPTIONS_FLAG - Success |
---|
193 | :info:configure -- Performing Test LIBOMP_HAVE_FNO_RTTI_FLAG |
---|
194 | :info:configure -- Performing Test LIBOMP_HAVE_FNO_RTTI_FLAG - Success |
---|
195 | :info:configure -- Performing Test LIBOMP_HAVE_WCLASS_MEMACCESS_FLAG |
---|
196 | :info:configure -- Performing Test LIBOMP_HAVE_WCLASS_MEMACCESS_FLAG - Failed |
---|
197 | :info:configure -- Performing Test LIBOMP_HAVE_WCOVERED_SWITCH_DEFAULT_FLAG |
---|
198 | :info:configure -- Performing Test LIBOMP_HAVE_WCOVERED_SWITCH_DEFAULT_FLAG - Success |
---|
199 | :info:configure -- Performing Test LIBOMP_HAVE_WFRAME_ADDRESS_FLAG |
---|
200 | :info:configure -- Performing Test LIBOMP_HAVE_WFRAME_ADDRESS_FLAG - Failed |
---|
201 | :info:configure -- Performing Test LIBOMP_HAVE_WSTRICT_ALIASING_FLAG |
---|
202 | :info:configure -- Performing Test LIBOMP_HAVE_WSTRICT_ALIASING_FLAG - Success |
---|
203 | :info:configure -- Performing Test LIBOMP_HAVE_WSTRINGOP_OVERFLOW_FLAG |
---|
204 | :info:configure -- Performing Test LIBOMP_HAVE_WSTRINGOP_OVERFLOW_FLAG - Failed |
---|
205 | :info:configure -- Performing Test LIBOMP_HAVE_WSTRINGOP_TRUNCATION_FLAG |
---|
206 | :info:configure -- Performing Test LIBOMP_HAVE_WSTRINGOP_TRUNCATION_FLAG - Failed |
---|
207 | :info:configure -- Performing Test LIBOMP_HAVE_WSWITCH_FLAG |
---|
208 | :info:configure -- Performing Test LIBOMP_HAVE_WSWITCH_FLAG - Success |
---|
209 | :info:configure -- Performing Test LIBOMP_HAVE_WUNINITIALIZED_FLAG |
---|
210 | :info:configure -- Performing Test LIBOMP_HAVE_WUNINITIALIZED_FLAG - Success |
---|
211 | :info:configure -- Performing Test LIBOMP_HAVE_WRETURN_TYPE_C_LINKAGE_FLAG |
---|
212 | :info:configure -- Performing Test LIBOMP_HAVE_WRETURN_TYPE_C_LINKAGE_FLAG - Success |
---|
213 | :info:configure -- Performing Test LIBOMP_HAVE_WCAST_QUAL_FLAG |
---|
214 | :info:configure -- Performing Test LIBOMP_HAVE_WCAST_QUAL_FLAG - Success |
---|
215 | :info:configure -- Performing Test LIBOMP_HAVE_WINT_TO_VOID_POINTER_CAST_FLAG |
---|
216 | :info:configure -- Performing Test LIBOMP_HAVE_WINT_TO_VOID_POINTER_CAST_FLAG - Success |
---|
217 | :info:configure -- Performing Test LIBOMP_HAVE_MSSE2_FLAG |
---|
218 | :info:configure -- Performing Test LIBOMP_HAVE_MSSE2_FLAG - Success |
---|
219 | :info:configure -- Performing Test LIBOMP_HAVE_FTLS_MODEL_FLAG |
---|
220 | :info:configure -- Performing Test LIBOMP_HAVE_FTLS_MODEL_FLAG - Success |
---|
221 | :info:configure -- Performing Test LIBOMP_HAVE_MMIC_FLAG |
---|
222 | :info:configure -- Performing Test LIBOMP_HAVE_MMIC_FLAG - Failed |
---|
223 | :info:configure -- Performing Test LIBOMP_HAVE_M32_FLAG |
---|
224 | :info:configure -- Performing Test LIBOMP_HAVE_M32_FLAG - Success |
---|
225 | :info:configure -- Looking for shm_open |
---|
226 | :info:configure -- Looking for shm_open - found |
---|
227 | :info:configure -- Looking for xmmintrin.h |
---|
228 | :info:configure -- Looking for xmmintrin.h - found |
---|
229 | :info:configure -- Performing Test LIBOMP_HAVE__MM_MALLOC |
---|
230 | :info:configure -- Performing Test LIBOMP_HAVE__MM_MALLOC - Success |
---|
231 | :info:configure -- Looking for aligned_alloc |
---|
232 | :info:configure -- Looking for aligned_alloc - not found |
---|
233 | :info:configure -- Looking for posix_memalign |
---|
234 | :info:configure -- Looking for posix_memalign - found |
---|
235 | :info:configure -- Looking for _aligned_malloc |
---|
236 | :info:configure -- Looking for _aligned_malloc - not found |
---|
237 | :info:configure -- Performing Test CMAKE_HAVE_LIBC_PTHREAD |
---|
238 | :info:configure -- Performing Test CMAKE_HAVE_LIBC_PTHREAD - Success |
---|
239 | :info:configure -- Found Threads: TRUE |
---|
240 | :info:configure -- Looking for immintrin.h |
---|
241 | :info:configure -- Looking for immintrin.h - found |
---|
242 | :info:configure -- Performing Test LIBOMP_HAVE_ATTRIBUTE_RTM |
---|
243 | :info:configure -- Performing Test LIBOMP_HAVE_ATTRIBUTE_RTM - Success |
---|
244 | :info:configure -- Performing Test LIBOMP_HAVE_ATTRIBUTE_WAITPKG |
---|
245 | :info:configure -- Performing Test LIBOMP_HAVE_ATTRIBUTE_WAITPKG - Success |
---|
246 | :info:configure -- Performing Test LIBOMP_HAVE_WAITPKG_INTRINSICS |
---|
247 | :info:configure -- Performing Test LIBOMP_HAVE_WAITPKG_INTRINSICS - Failed |
---|
248 | :info:configure -- Performing Test LIBOMP_HAVE_RTM_INTRINSICS |
---|
249 | :info:configure -- Performing Test LIBOMP_HAVE_RTM_INTRINSICS - Failed |
---|
250 | :info:configure -- Found Perl: /opt/local/bin/perl (found version "5.34.1") |
---|
251 | :info:configure -- Performing Test LIBOMP_HAVE___BUILTIN_FRAME_ADDRESS |
---|
252 | :info:configure -- Performing Test LIBOMP_HAVE___BUILTIN_FRAME_ADDRESS - Success |
---|
253 | :info:configure -- Performing Test LIBOMP_HAVE_WEAK_ATTRIBUTE |
---|
254 | :info:configure -- Performing Test LIBOMP_HAVE_WEAK_ATTRIBUTE - Success |
---|
255 | :info:configure -- Performing Test LIBOMP_HAVE_PSAPI |
---|
256 | :info:configure -- Performing Test LIBOMP_HAVE_PSAPI - Failed |
---|
257 | :info:configure -- LIBOMP: Operating System -- Darwin |
---|
258 | :info:configure -- LIBOMP: Target Architecture -- x86_64 |
---|
259 | :info:configure -- LIBOMP: Build Type -- Release |
---|
260 | :info:configure -- LIBOMP: Library Kind -- SHARED |
---|
261 | :info:configure -- LIBOMP: Library Type -- normal |
---|
262 | :info:configure -- LIBOMP: Fortran Modules -- FALSE |
---|
263 | :info:configure -- LIBOMP: Build -- 20140926 |
---|
264 | :info:configure -- LIBOMP: Use Stats-gathering -- FALSE |
---|
265 | :info:configure -- LIBOMP: Use Debugger-support -- FALSE |
---|
266 | :info:configure -- LIBOMP: Use ITT notify -- TRUE |
---|
267 | :info:configure -- LIBOMP: Use OMPT-support -- TRUE |
---|
268 | :info:configure -- LIBOMP: Use OMPT-optional -- TRUE |
---|
269 | :info:configure -- LIBOMP: Use OMPD-support -- FALSE |
---|
270 | :info:configure -- LIBOMP: Use Adaptive locks -- TRUE |
---|
271 | :info:configure -- LIBOMP: Use quad precision -- FALSE |
---|
272 | :info:configure -- LIBOMP: Use Hwloc library -- FALSE |
---|
273 | :info:configure -- LIBOMP: Use OMPX-taskgraph -- FALSE |
---|
274 | :info:configure -- Looking for sqrt in m |
---|
275 | :info:configure -- Looking for sqrt in m - found |
---|
276 | :info:configure -- Looking for __atomic_load_1 |
---|
277 | :info:configure -- Looking for __atomic_load_1 - not found |
---|
278 | :info:configure -- Looking for __atomic_load_1 in atomic |
---|
279 | :info:configure -- Looking for __atomic_load_1 in atomic - not found |
---|
280 | :info:configure -- check-libomp does nothing. |
---|
281 | :info:configure -- check-ompt does nothing. |
---|
282 | :info:configure -- Found Python3: /opt/local/bin/python3.11 (found version "3.11.6") found components: Interpreter Development Development.Module Development.Embed |
---|
283 | :info:configure -- check-openmp does nothing. |
---|
284 | :info:configure -- Configuring done |
---|
285 | :info:configure -- Generating done |
---|
286 | :info:configure -- Build files have been written to: /opt/local/var/macports/build/_opt_local_var_macports_sources_rsync.macports.org_macports_release_tarballs_ports_lang_libomp/libomp/work/build-x86_64 |
---|
287 | :debug:configure setting option autoconf.dir to /opt/local/var/macports/build/_opt_local_var_macports_sources_rsync.macports.org_macports_release_tarballs_ports_lang_libomp/libomp/work/openmp-17.0.3.src |
---|
288 | :debug:configure setting option autoreconf.dir to /opt/local/var/macports/build/_opt_local_var_macports_sources_rsync.macports.org_macports_release_tarballs_ports_lang_libomp/libomp/work/openmp-17.0.3.src |
---|
289 | :debug:configure setting option configure.dir to /opt/local/var/macports/build/_opt_local_var_macports_sources_rsync.macports.org_macports_release_tarballs_ports_lang_libomp/libomp/work/build |
---|
290 | :debug:configure setting option configure.compiler to macports-clang-3.7 |
---|
291 | :debug:configure setting option configure.f90 to {} |
---|
292 | :debug:configure setting option configure.f77 to {} |
---|
293 | :debug:configure setting option configure.fc to {} |
---|
294 | :debug:configure setting option configure.cc to /opt/local/bin/clang-mp-3.7 |
---|
295 | :debug:configure setting option configure.cxx to /opt/local/bin/clang++-mp-3.7 |
---|
296 | :debug:configure setting option configure.objc to /opt/local/bin/clang-mp-3.7 |
---|
297 | :info:configure ---> Configuring libomp for architecture i386 |
---|
298 | :debug:configure setting option configure.dir to /opt/local/var/macports/build/_opt_local_var_macports_sources_rsync.macports.org_macports_release_tarballs_ports_lang_libomp/libomp/work/build-i386 |
---|
299 | :debug:configure setting option autoreconf.dir to /opt/local/var/macports/build/_opt_local_var_macports_sources_rsync.macports.org_macports_release_tarballs_ports_lang_libomp/libomp/work/openmp-17.0.3.src-i386 |
---|
300 | :debug:configure setting option autoconf.dir to /opt/local/var/macports/build/_opt_local_var_macports_sources_rsync.macports.org_macports_release_tarballs_ports_lang_libomp/libomp/work/openmp-17.0.3.src-i386 |
---|
301 | :debug:configure Environment: |
---|
302 | :debug:configure CC='/opt/local/bin/clang-mp-3.7' |
---|
303 | :debug:configure CC_PRINT_OPTIONS='YES' |
---|
304 | :debug:configure CC_PRINT_OPTIONS_FILE='/opt/local/var/macports/build/_opt_local_var_macports_sources_rsync.macports.org_macports_release_tarballs_ports_lang_libomp/libomp/work/.CC_PRINT_OPTIONS' |
---|
305 | :debug:configure CFLAGS='-pipe -Os -stdlib=libc++ -DNDEBUG -I/opt/local/include' |
---|
306 | :debug:configure CPATH='/opt/local/include' |
---|
307 | :debug:configure CXX='/opt/local/bin/clang++-mp-3.7' |
---|
308 | :debug:configure CXXFLAGS='-pipe -Os -std=c++11 -DNDEBUG -I/opt/local/include -stdlib=libc++' |
---|
309 | :debug:configure DEVELOPER_DIR='/Applications/Xcode.app/Contents/Developer' |
---|
310 | :debug:configure F90FLAGS='-pipe -Os' |
---|
311 | :debug:configure FCFLAGS='-pipe -Os' |
---|
312 | :debug:configure FFLAGS='-pipe -Os' |
---|
313 | :debug:configure INSTALL='/usr/bin/install -c' |
---|
314 | :debug:configure LDFLAGS='-L/opt/local/lib -Wl,-headerpad_max_install_names' |
---|
315 | :debug:configure LIBRARY_PATH='/opt/local/lib' |
---|
316 | :debug:configure MACOSX_DEPLOYMENT_TARGET='10.7' |
---|
317 | :debug:configure OBJC='/opt/local/bin/clang-mp-3.7' |
---|
318 | :debug:configure OBJCFLAGS='-pipe -Os -I/opt/local/include' |
---|
319 | :debug:configure OBJCXX='/opt/local/bin/clang++-mp-3.7' |
---|
320 | :debug:configure OBJCXXFLAGS='-pipe -Os -std=c++11 -I/opt/local/include -stdlib=libc++' |
---|
321 | :info:configure Executing: cd "/opt/local/var/macports/build/_opt_local_var_macports_sources_rsync.macports.org_macports_release_tarballs_ports_lang_libomp/libomp/work/build-i386" && /opt/local/bin/cmake -G "CodeBlocks - Unix Makefiles" -DCMAKE_INSTALL_PREFIX=/opt/local/tmp -DCMAKE_INSTALL_RPATH=/opt/local/lib/libomp -DCMAKE_INSTALL_NAME_DIR=/opt/local/lib/libomp -DCMAKE_OSX_DEPLOYMENT_TARGET="10.7" -DCMAKE_OSX_SYSROOT="/" -DCMAKE_OSX_ARCHITECTURES=i386 /opt/local/var/macports/build/_opt_local_var_macports_sources_rsync.macports.org_macports_release_tarballs_ports_lang_libomp/libomp/work/openmp-17.0.3.src |
---|
322 | :debug:configure system: cd "/opt/local/var/macports/build/_opt_local_var_macports_sources_rsync.macports.org_macports_release_tarballs_ports_lang_libomp/libomp/work/build-i386" && /opt/local/bin/cmake -G "CodeBlocks - Unix Makefiles" -DCMAKE_INSTALL_PREFIX=/opt/local/tmp -DCMAKE_INSTALL_RPATH=/opt/local/lib/libomp -DCMAKE_INSTALL_NAME_DIR=/opt/local/lib/libomp -DCMAKE_OSX_DEPLOYMENT_TARGET="10.7" -DCMAKE_OSX_SYSROOT="/" -DCMAKE_OSX_ARCHITECTURES=i386 /opt/local/var/macports/build/_opt_local_var_macports_sources_rsync.macports.org_macports_release_tarballs_ports_lang_libomp/libomp/work/openmp-17.0.3.src |
---|
323 | :info:configure -- The C compiler identification is Clang 3.7.1 |
---|
324 | :info:configure -- The CXX compiler identification is Clang 3.7.1 |
---|
325 | :info:configure -- The ASM compiler identification is Clang with GNU-like command-line |
---|
326 | :info:configure -- Found assembler: /opt/local/bin/clang-mp-3.7 |
---|
327 | :info:configure -- Detecting C compiler ABI info |
---|
328 | :info:configure -- Detecting C compiler ABI info - done |
---|
329 | :info:configure -- Check for working C compiler: /opt/local/bin/clang-mp-3.7 - skipped |
---|
330 | :info:configure -- Detecting C compile features |
---|
331 | :info:configure -- Detecting C compile features - done |
---|
332 | :info:configure -- Detecting CXX compiler ABI info |
---|
333 | :info:configure -- Detecting CXX compiler ABI info - done |
---|
334 | :info:configure -- Check for working CXX compiler: /opt/local/bin/clang++-mp-3.7 - skipped |
---|
335 | :info:configure -- Detecting CXX compile features |
---|
336 | :info:configure -- Detecting CXX compile features - done |
---|
337 | :info:configure -- Performing Test OPENMP_HAVE_ONEAPI_COMPILER |
---|
338 | :info:configure -- Performing Test OPENMP_HAVE_ONEAPI_COMPILER - Failed |
---|
339 | :info:configure -- Performing Test OPENMP_HAVE_WALL_FLAG |
---|
340 | :info:configure -- Performing Test OPENMP_HAVE_WALL_FLAG - Success |
---|
341 | :info:configure -- Performing Test OPENMP_HAVE_WERROR_FLAG |
---|
342 | :info:configure -- Performing Test OPENMP_HAVE_WERROR_FLAG - Success |
---|
343 | :info:configure -- Performing Test OPENMP_HAVE_WCAST_QUAL_FLAG |
---|
344 | :info:configure -- Performing Test OPENMP_HAVE_WCAST_QUAL_FLAG - Success |
---|
345 | :info:configure -- Performing Test OPENMP_HAVE_WFORMAT_PEDANTIC_FLAG |
---|
346 | :info:configure -- Performing Test OPENMP_HAVE_WFORMAT_PEDANTIC_FLAG - Success |
---|
347 | :info:configure -- Performing Test OPENMP_HAVE_WIMPLICIT_FALLTHROUGH_FLAG |
---|
348 | :info:configure -- Performing Test OPENMP_HAVE_WIMPLICIT_FALLTHROUGH_FLAG - Success |
---|
349 | :info:configure -- Performing Test OPENMP_HAVE_WSIGN_COMPARE_FLAG |
---|
350 | :info:configure -- Performing Test OPENMP_HAVE_WSIGN_COMPARE_FLAG - Success |
---|
351 | :info:configure -- Performing Test OPENMP_HAVE_WENUM_CONSTEXPR_CONVERSION_FLAG |
---|
352 | :info:configure -- Performing Test OPENMP_HAVE_WENUM_CONSTEXPR_CONVERSION_FLAG - Failed |
---|
353 | :info:configure -- Performing Test OPENMP_HAVE_WEXTRA_FLAG |
---|
354 | :info:configure -- Performing Test OPENMP_HAVE_WEXTRA_FLAG - Success |
---|
355 | :info:configure -- Performing Test OPENMP_HAVE_WPEDANTIC_FLAG |
---|
356 | :info:configure -- Performing Test OPENMP_HAVE_WPEDANTIC_FLAG - Success |
---|
357 | :info:configure -- Performing Test OPENMP_HAVE_WMAYBE_UNINITIALIZED_FLAG |
---|
358 | :info:configure -- Performing Test OPENMP_HAVE_WMAYBE_UNINITIALIZED_FLAG - Failed |
---|
359 | :info:configure -- Found Python3: /opt/local/bin/python3.11 (found version "3.11.6") found components: Interpreter |
---|
360 | :info:configure -- Cannot find llvm-lit. |
---|
361 | :info:configure -- Please put llvm-lit in your PATH, set OPENMP_LLVM_LIT_EXECUTABLE to its full path, or point OPENMP_LLVM_TOOLS_DIR to its directory. |
---|
362 | :info:configure CMake Warning at cmake/OpenMPTesting.cmake:22 (message): |
---|
363 | :info:configure The check targets will not be available! |
---|
364 | :info:configure Call Stack (most recent call first): |
---|
365 | :info:configure cmake/OpenMPTesting.cmake:51 (find_standalone_test_dependencies) |
---|
366 | :info:configure CMakeLists.txt:69 (include) |
---|
367 | :info:configure -- Performing Test LIBOMP_HAVE_FNO_EXCEPTIONS_FLAG |
---|
368 | :info:configure -- Performing Test LIBOMP_HAVE_FNO_EXCEPTIONS_FLAG - Success |
---|
369 | :info:configure -- Performing Test LIBOMP_HAVE_FNO_RTTI_FLAG |
---|
370 | :info:configure -- Performing Test LIBOMP_HAVE_FNO_RTTI_FLAG - Success |
---|
371 | :info:configure -- Performing Test LIBOMP_HAVE_WCLASS_MEMACCESS_FLAG |
---|
372 | :info:configure -- Performing Test LIBOMP_HAVE_WCLASS_MEMACCESS_FLAG - Failed |
---|
373 | :info:configure -- Performing Test LIBOMP_HAVE_WCOVERED_SWITCH_DEFAULT_FLAG |
---|
374 | :info:configure -- Performing Test LIBOMP_HAVE_WCOVERED_SWITCH_DEFAULT_FLAG - Success |
---|
375 | :info:configure -- Performing Test LIBOMP_HAVE_WFRAME_ADDRESS_FLAG |
---|
376 | :info:configure -- Performing Test LIBOMP_HAVE_WFRAME_ADDRESS_FLAG - Failed |
---|
377 | :info:configure -- Performing Test LIBOMP_HAVE_WSTRICT_ALIASING_FLAG |
---|
378 | :info:configure -- Performing Test LIBOMP_HAVE_WSTRICT_ALIASING_FLAG - Success |
---|
379 | :info:configure -- Performing Test LIBOMP_HAVE_WSTRINGOP_OVERFLOW_FLAG |
---|
380 | :info:configure -- Performing Test LIBOMP_HAVE_WSTRINGOP_OVERFLOW_FLAG - Failed |
---|
381 | :info:configure -- Performing Test LIBOMP_HAVE_WSTRINGOP_TRUNCATION_FLAG |
---|
382 | :info:configure -- Performing Test LIBOMP_HAVE_WSTRINGOP_TRUNCATION_FLAG - Failed |
---|
383 | :info:configure -- Performing Test LIBOMP_HAVE_WSWITCH_FLAG |
---|
384 | :info:configure -- Performing Test LIBOMP_HAVE_WSWITCH_FLAG - Success |
---|
385 | :info:configure -- Performing Test LIBOMP_HAVE_WUNINITIALIZED_FLAG |
---|
386 | :info:configure -- Performing Test LIBOMP_HAVE_WUNINITIALIZED_FLAG - Success |
---|
387 | :info:configure -- Performing Test LIBOMP_HAVE_WRETURN_TYPE_C_LINKAGE_FLAG |
---|
388 | :info:configure -- Performing Test LIBOMP_HAVE_WRETURN_TYPE_C_LINKAGE_FLAG - Success |
---|
389 | :info:configure -- Performing Test LIBOMP_HAVE_WCAST_QUAL_FLAG |
---|
390 | :info:configure -- Performing Test LIBOMP_HAVE_WCAST_QUAL_FLAG - Success |
---|
391 | :info:configure -- Performing Test LIBOMP_HAVE_WINT_TO_VOID_POINTER_CAST_FLAG |
---|
392 | :info:configure -- Performing Test LIBOMP_HAVE_WINT_TO_VOID_POINTER_CAST_FLAG - Success |
---|
393 | :info:configure -- Performing Test LIBOMP_HAVE_MSSE2_FLAG |
---|
394 | :info:configure -- Performing Test LIBOMP_HAVE_MSSE2_FLAG - Success |
---|
395 | :info:configure -- Performing Test LIBOMP_HAVE_FTLS_MODEL_FLAG |
---|
396 | :info:configure -- Performing Test LIBOMP_HAVE_FTLS_MODEL_FLAG - Success |
---|
397 | :info:configure -- Performing Test LIBOMP_HAVE_MMIC_FLAG |
---|
398 | :info:configure -- Performing Test LIBOMP_HAVE_MMIC_FLAG - Failed |
---|
399 | :info:configure -- Performing Test LIBOMP_HAVE_M32_FLAG |
---|
400 | :info:configure -- Performing Test LIBOMP_HAVE_M32_FLAG - Success |
---|
401 | :info:configure -- Looking for shm_open |
---|
402 | :info:configure -- Looking for shm_open - found |
---|
403 | :info:configure -- Looking for xmmintrin.h |
---|
404 | :info:configure -- Looking for xmmintrin.h - found |
---|
405 | :info:configure -- Performing Test LIBOMP_HAVE__MM_MALLOC |
---|
406 | :info:configure -- Performing Test LIBOMP_HAVE__MM_MALLOC - Success |
---|
407 | :info:configure -- Looking for aligned_alloc |
---|
408 | :info:configure -- Looking for aligned_alloc - not found |
---|
409 | :info:configure -- Looking for posix_memalign |
---|
410 | :info:configure -- Looking for posix_memalign - found |
---|
411 | :info:configure -- Looking for _aligned_malloc |
---|
412 | :info:configure -- Looking for _aligned_malloc - not found |
---|
413 | :info:configure -- Performing Test CMAKE_HAVE_LIBC_PTHREAD |
---|
414 | :info:configure -- Performing Test CMAKE_HAVE_LIBC_PTHREAD - Success |
---|
415 | :info:configure -- Found Threads: TRUE |
---|
416 | :info:configure -- Looking for immintrin.h |
---|
417 | :info:configure -- Looking for immintrin.h - found |
---|
418 | :info:configure -- Performing Test LIBOMP_HAVE_ATTRIBUTE_RTM |
---|
419 | :info:configure -- Performing Test LIBOMP_HAVE_ATTRIBUTE_RTM - Success |
---|
420 | :info:configure -- Performing Test LIBOMP_HAVE_ATTRIBUTE_WAITPKG |
---|
421 | :info:configure -- Performing Test LIBOMP_HAVE_ATTRIBUTE_WAITPKG - Success |
---|
422 | :info:configure -- Performing Test LIBOMP_HAVE_WAITPKG_INTRINSICS |
---|
423 | :info:configure -- Performing Test LIBOMP_HAVE_WAITPKG_INTRINSICS - Failed |
---|
424 | :info:configure -- Performing Test LIBOMP_HAVE_RTM_INTRINSICS |
---|
425 | :info:configure -- Performing Test LIBOMP_HAVE_RTM_INTRINSICS - Failed |
---|
426 | :info:configure -- Found Perl: /opt/local/bin/perl (found version "5.34.1") |
---|
427 | :info:configure -- Performing Test LIBOMP_HAVE___BUILTIN_FRAME_ADDRESS |
---|
428 | :info:configure -- Performing Test LIBOMP_HAVE___BUILTIN_FRAME_ADDRESS - Success |
---|
429 | :info:configure -- Performing Test LIBOMP_HAVE_WEAK_ATTRIBUTE |
---|
430 | :info:configure -- Performing Test LIBOMP_HAVE_WEAK_ATTRIBUTE - Success |
---|
431 | :info:configure -- Performing Test LIBOMP_HAVE_PSAPI |
---|
432 | :info:configure -- Performing Test LIBOMP_HAVE_PSAPI - Failed |
---|
433 | :info:configure -- LIBOMP: Operating System -- Darwin |
---|
434 | :info:configure -- LIBOMP: Target Architecture -- i386 |
---|
435 | :info:configure -- LIBOMP: Build Type -- Release |
---|
436 | :info:configure -- LIBOMP: Library Kind -- SHARED |
---|
437 | :info:configure -- LIBOMP: Library Type -- normal |
---|
438 | :info:configure -- LIBOMP: Fortran Modules -- FALSE |
---|
439 | :info:configure -- LIBOMP: Build -- 20140926 |
---|
440 | :info:configure -- LIBOMP: Use Stats-gathering -- FALSE |
---|
441 | :info:configure -- LIBOMP: Use Debugger-support -- FALSE |
---|
442 | :info:configure -- LIBOMP: Use ITT notify -- TRUE |
---|
443 | :info:configure -- LIBOMP: Use OMPT-support -- TRUE |
---|
444 | :info:configure -- LIBOMP: Use OMPT-optional -- TRUE |
---|
445 | :info:configure -- LIBOMP: Use OMPD-support -- FALSE |
---|
446 | :info:configure -- LIBOMP: Use Adaptive locks -- TRUE |
---|
447 | :info:configure -- LIBOMP: Use quad precision -- FALSE |
---|
448 | :info:configure -- LIBOMP: Use Hwloc library -- FALSE |
---|
449 | :info:configure -- LIBOMP: Use OMPX-taskgraph -- FALSE |
---|
450 | :info:configure -- Looking for sqrt in m |
---|
451 | :info:configure -- Looking for sqrt in m - found |
---|
452 | :info:configure -- Looking for __atomic_load_1 |
---|
453 | :info:configure -- Looking for __atomic_load_1 - not found |
---|
454 | :info:configure -- Looking for __atomic_load_1 in atomic |
---|
455 | :info:configure -- Looking for __atomic_load_1 in atomic - not found |
---|
456 | :info:configure -- check-libomp does nothing. |
---|
457 | :info:configure -- check-ompt does nothing. |
---|
458 | :info:configure -- Could NOT find Python3 (missing: Python3_EXECUTABLE Interpreter) (found version "3.11.6") |
---|
459 | :info:configure Reason given by package: |
---|
460 | :info:configure Interpreter: Wrong architecture for the interpreter "/opt/local/bin/python3.11" |
---|
461 | :info:configure -- check-openmp does nothing. |
---|
462 | :info:configure -- Configuring done |
---|
463 | :info:configure -- Generating done |
---|
464 | :info:configure -- Build files have been written to: /opt/local/var/macports/build/_opt_local_var_macports_sources_rsync.macports.org_macports_release_tarballs_ports_lang_libomp/libomp/work/build-i386 |
---|
465 | :debug:configure setting option autoconf.dir to /opt/local/var/macports/build/_opt_local_var_macports_sources_rsync.macports.org_macports_release_tarballs_ports_lang_libomp/libomp/work/openmp-17.0.3.src |
---|
466 | :debug:configure setting option autoreconf.dir to /opt/local/var/macports/build/_opt_local_var_macports_sources_rsync.macports.org_macports_release_tarballs_ports_lang_libomp/libomp/work/openmp-17.0.3.src |
---|
467 | :debug:configure setting option configure.dir to /opt/local/var/macports/build/_opt_local_var_macports_sources_rsync.macports.org_macports_release_tarballs_ports_lang_libomp/libomp/work/build |
---|
468 | :debug:configure setting option configure.compiler to macports-clang-3.7 |
---|
469 | :debug:configure setting option configure.f90 to {} |
---|
470 | :debug:configure setting option configure.f77 to {} |
---|
471 | :debug:configure setting option configure.fc to {} |
---|
472 | :debug:configure setting option configure.cc to /opt/local/bin/clang-mp-3.7 |
---|
473 | :debug:configure setting option configure.cxx to /opt/local/bin/clang++-mp-3.7 |
---|
474 | :debug:configure setting option configure.objc to /opt/local/bin/clang-mp-3.7 |
---|
475 | :debug:configure Executing proc-post-org.macports.configure-configure-0 |
---|
476 | :debug:configure configure.ccache restored to no |
---|
477 | :debug:configure Executing proc-post-org.macports.configure-configure-1 |
---|
478 | :debug:configure Executing portconfigure::configure_finish |
---|
479 | :debug:configure Privilege de-escalation not attempted as not running as root. |
---|
480 | :debug:build build phase started at Tue Oct 17 09:54:24 EDT 2023 |
---|
481 | :notice:build ---> Building libomp |
---|
482 | :debug:build Executing org.macports.build (libomp) |
---|
483 | :info:build ---> Building libomp for architecture x86_64 |
---|
484 | :debug:build setting option build.dir to /opt/local/var/macports/build/_opt_local_var_macports_sources_rsync.macports.org_macports_release_tarballs_ports_lang_libomp/libomp/work/build-x86_64 |
---|
485 | :debug:build Environment: |
---|
486 | :debug:build CC_PRINT_OPTIONS='YES' |
---|
487 | :debug:build CC_PRINT_OPTIONS_FILE='/opt/local/var/macports/build/_opt_local_var_macports_sources_rsync.macports.org_macports_release_tarballs_ports_lang_libomp/libomp/work/.CC_PRINT_OPTIONS' |
---|
488 | :debug:build CPATH='/opt/local/include' |
---|
489 | :debug:build DEVELOPER_DIR='/Applications/Xcode.app/Contents/Developer' |
---|
490 | :debug:build LIBRARY_PATH='/opt/local/lib' |
---|
491 | :debug:build MACOSX_DEPLOYMENT_TARGET='10.7' |
---|
492 | :info:build Executing: cd "/opt/local/var/macports/build/_opt_local_var_macports_sources_rsync.macports.org_macports_release_tarballs_ports_lang_libomp/libomp/work/build-x86_64" && /usr/bin/make -j4 -w all VERBOSE=ON |
---|
493 | :debug:build system: cd "/opt/local/var/macports/build/_opt_local_var_macports_sources_rsync.macports.org_macports_release_tarballs_ports_lang_libomp/libomp/work/build-x86_64" && /usr/bin/make -j4 -w all VERBOSE=ON |
---|
494 | :info:build make: Entering directory `/opt/local/var/macports/build/_opt_local_var_macports_sources_rsync.macports.org_macports_release_tarballs_ports_lang_libomp/libomp/work/build-x86_64' |
---|
495 | :info:build /opt/local/bin/cmake -S/opt/local/var/macports/build/_opt_local_var_macports_sources_rsync.macports.org_macports_release_tarballs_ports_lang_libomp/libomp/work/openmp-17.0.3.src -B/opt/local/var/macports/build/_opt_local_var_macports_sources_rsync.macports.org_macports_release_tarballs_ports_lang_libomp/libomp/work/build-x86_64 --check-build-system CMakeFiles/Makefile.cmake 0 |
---|
496 | :info:build /opt/local/bin/cmake -E cmake_progress_start /opt/local/var/macports/build/_opt_local_var_macports_sources_rsync.macports.org_macports_release_tarballs_ports_lang_libomp/libomp/work/build-x86_64/CMakeFiles /opt/local/var/macports/build/_opt_local_var_macports_sources_rsync.macports.org_macports_release_tarballs_ports_lang_libomp/libomp/work/build-x86_64//CMakeFiles/progress.marks |
---|
497 | :info:build /usr/bin/make -f CMakeFiles/Makefile2 all |
---|
498 | :info:build make[1]: Entering directory `/opt/local/var/macports/build/_opt_local_var_macports_sources_rsync.macports.org_macports_release_tarballs_ports_lang_libomp/libomp/work/build-x86_64' |
---|
499 | :info:build /usr/bin/make -f runtime/src/CMakeFiles/libomp-needed-headers.dir/build.make runtime/src/CMakeFiles/libomp-needed-headers.dir/depend |
---|
500 | :info:build make[2]: Entering directory `/opt/local/var/macports/build/_opt_local_var_macports_sources_rsync.macports.org_macports_release_tarballs_ports_lang_libomp/libomp/work/build-x86_64' |
---|
501 | :info:build cd /opt/local/var/macports/build/_opt_local_var_macports_sources_rsync.macports.org_macports_release_tarballs_ports_lang_libomp/libomp/work/build-x86_64 && /opt/local/bin/cmake -E cmake_depends "Unix Makefiles" /opt/local/var/macports/build/_opt_local_var_macports_sources_rsync.macports.org_macports_release_tarballs_ports_lang_libomp/libomp/work/openmp-17.0.3.src /opt/local/var/macports/build/_opt_local_var_macports_sources_rsync.macports.org_macports_release_tarballs_ports_lang_libomp/libomp/work/openmp-17.0.3.src/runtime/src /opt/local/var/macports/build/_opt_local_var_macports_sources_rsync.macports.org_macports_release_tarballs_ports_lang_libomp/libomp/work/build-x86_64 /opt/local/var/macports/build/_opt_local_var_macports_sources_rsync.macports.org_macports_release_tarballs_ports_lang_libomp/libomp/work/build-x86_64/runtime/src /opt/local/var/macports/build/_opt_local_var_macports_sources_rsync.macports.org_macports_release_tarballs_ports_lang_libomp/libomp/work/build-x86_64/runtime/src/CMakeFiles/libomp-needed-headers.dir/DependInfo.cmake --color= |
---|
502 | :info:build make[2]: Leaving directory `/opt/local/var/macports/build/_opt_local_var_macports_sources_rsync.macports.org_macports_release_tarballs_ports_lang_libomp/libomp/work/build-x86_64' |
---|
503 | :info:build /usr/bin/make -f runtime/src/CMakeFiles/libomp-needed-headers.dir/build.make runtime/src/CMakeFiles/libomp-needed-headers.dir/build |
---|
504 | :info:build make[2]: Entering directory `/opt/local/var/macports/build/_opt_local_var_macports_sources_rsync.macports.org_macports_release_tarballs_ports_lang_libomp/libomp/work/build-x86_64' |
---|
505 | :info:build [ 2%] Generating kmp_i18n_id.inc |
---|
506 | :info:build cd /opt/local/var/macports/build/_opt_local_var_macports_sources_rsync.macports.org_macports_release_tarballs_ports_lang_libomp/libomp/work/build-x86_64/runtime/src && /opt/local/bin/perl /opt/local/var/macports/build/_opt_local_var_macports_sources_rsync.macports.org_macports_release_tarballs_ports_lang_libomp/libomp/work/openmp-17.0.3.src/runtime/tools/message-converter.pl --os=mac --prefix=kmp_i18n --enum=kmp_i18n_id.inc /opt/local/var/macports/build/_opt_local_var_macports_sources_rsync.macports.org_macports_release_tarballs_ports_lang_libomp/libomp/work/openmp-17.0.3.src/runtime/src/i18n/en_US.txt |
---|
507 | :info:build [ 5%] Generating kmp_i18n_default.inc |
---|
508 | :info:build cd /opt/local/var/macports/build/_opt_local_var_macports_sources_rsync.macports.org_macports_release_tarballs_ports_lang_libomp/libomp/work/build-x86_64/runtime/src && /opt/local/bin/perl /opt/local/var/macports/build/_opt_local_var_macports_sources_rsync.macports.org_macports_release_tarballs_ports_lang_libomp/libomp/work/openmp-17.0.3.src/runtime/tools/message-converter.pl --os=mac --prefix=kmp_i18n --default=kmp_i18n_default.inc /opt/local/var/macports/build/_opt_local_var_macports_sources_rsync.macports.org_macports_release_tarballs_ports_lang_libomp/libomp/work/openmp-17.0.3.src/runtime/src/i18n/en_US.txt |
---|
509 | :info:build make[2]: Leaving directory `/opt/local/var/macports/build/_opt_local_var_macports_sources_rsync.macports.org_macports_release_tarballs_ports_lang_libomp/libomp/work/build-x86_64' |
---|
510 | :info:build [ 5%] Built target libomp-needed-headers |
---|
511 | :info:build /usr/bin/make -f runtime/src/CMakeFiles/omp.dir/build.make runtime/src/CMakeFiles/omp.dir/depend |
---|
512 | :info:build make[2]: Entering directory `/opt/local/var/macports/build/_opt_local_var_macports_sources_rsync.macports.org_macports_release_tarballs_ports_lang_libomp/libomp/work/build-x86_64' |
---|
513 | :info:build cd /opt/local/var/macports/build/_opt_local_var_macports_sources_rsync.macports.org_macports_release_tarballs_ports_lang_libomp/libomp/work/build-x86_64 && /opt/local/bin/cmake -E cmake_depends "Unix Makefiles" /opt/local/var/macports/build/_opt_local_var_macports_sources_rsync.macports.org_macports_release_tarballs_ports_lang_libomp/libomp/work/openmp-17.0.3.src /opt/local/var/macports/build/_opt_local_var_macports_sources_rsync.macports.org_macports_release_tarballs_ports_lang_libomp/libomp/work/openmp-17.0.3.src/runtime/src /opt/local/var/macports/build/_opt_local_var_macports_sources_rsync.macports.org_macports_release_tarballs_ports_lang_libomp/libomp/work/build-x86_64 /opt/local/var/macports/build/_opt_local_var_macports_sources_rsync.macports.org_macports_release_tarballs_ports_lang_libomp/libomp/work/build-x86_64/runtime/src /opt/local/var/macports/build/_opt_local_var_macports_sources_rsync.macports.org_macports_release_tarballs_ports_lang_libomp/libomp/work/build-x86_64/runtime/src/CMakeFiles/omp.dir/DependInfo.cmake --color= |
---|
514 | :info:build Dependee "/opt/local/var/macports/build/_opt_local_var_macports_sources_rsync.macports.org_macports_release_tarballs_ports_lang_libomp/libomp/work/build-x86_64/runtime/src/CMakeFiles/omp.dir/DependInfo.cmake" is newer than depender "/opt/local/var/macports/build/_opt_local_var_macports_sources_rsync.macports.org_macports_release_tarballs_ports_lang_libomp/libomp/work/build-x86_64/runtime/src/CMakeFiles/omp.dir/depend.internal". |
---|
515 | :info:build Dependee "/opt/local/var/macports/build/_opt_local_var_macports_sources_rsync.macports.org_macports_release_tarballs_ports_lang_libomp/libomp/work/build-x86_64/runtime/src/CMakeFiles/CMakeDirectoryInformation.cmake" is newer than depender "/opt/local/var/macports/build/_opt_local_var_macports_sources_rsync.macports.org_macports_release_tarballs_ports_lang_libomp/libomp/work/build-x86_64/runtime/src/CMakeFiles/omp.dir/depend.internal". |
---|
516 | :info:build Scanning dependencies of target omp |
---|
517 | :info:build make[2]: Leaving directory `/opt/local/var/macports/build/_opt_local_var_macports_sources_rsync.macports.org_macports_release_tarballs_ports_lang_libomp/libomp/work/build-x86_64' |
---|
518 | :info:build /usr/bin/make -f runtime/src/CMakeFiles/omp.dir/build.make runtime/src/CMakeFiles/omp.dir/build |
---|
519 | :info:build make[2]: Entering directory `/opt/local/var/macports/build/_opt_local_var_macports_sources_rsync.macports.org_macports_release_tarballs_ports_lang_libomp/libomp/work/build-x86_64' |
---|
520 | :info:build [ 8%] Building CXX object runtime/src/CMakeFiles/omp.dir/kmp_csupport.cpp.o |
---|
521 | :info:build [ 11%] Building CXX object runtime/src/CMakeFiles/omp.dir/kmp_atomic.cpp.o |
---|
522 | :info:build cd /opt/local/var/macports/build/_opt_local_var_macports_sources_rsync.macports.org_macports_release_tarballs_ports_lang_libomp/libomp/work/build-x86_64/runtime/src && /opt/local/bin/clang++-mp-3.7 -Domp_EXPORTS -I/opt/local/var/macports/build/_opt_local_var_macports_sources_rsync.macports.org_macports_release_tarballs_ports_lang_libomp/libomp/work/build-x86_64/runtime/src -I/opt/local/var/macports/build/_opt_local_var_macports_sources_rsync.macports.org_macports_release_tarballs_ports_lang_libomp/libomp/work/openmp-17.0.3.src/runtime/src -I/opt/local/var/macports/build/_opt_local_var_macports_sources_rsync.macports.org_macports_release_tarballs_ports_lang_libomp/libomp/work/openmp-17.0.3.src/runtime/src/i18n -I/opt/local/var/macports/build/_opt_local_var_macports_sources_rsync.macports.org_macports_release_tarballs_ports_lang_libomp/libomp/work/openmp-17.0.3.src/runtime/src/include -I/opt/local/var/macports/build/_opt_local_var_macports_sources_rsync.macports.org_macports_release_tarballs_ports_lang_libomp/libomp/work/openmp-17.0.3.src/runtime/src/thirdparty/ittnotify -pipe -Os -std=c++11 -DNDEBUG -I/opt/local/include -stdlib=libc++ -Wall -Wcast-qual -Wformat-pedantic -Wimplicit-fallthrough -Wsign-compare -Wno-extra -Wno-pedantic -O3 -DNDEBUG -arch x86_64 -mmacosx-version-min=10.7 -fPIC -D _GNU_SOURCE -D _REENTRANT -std=c++1z -fno-exceptions -fno-rtti -Wno-covered-switch-default -Wno-strict-aliasing -Wno-switch -Wno-uninitialized -Wno-return-type-c-linkage -Wno-cast-qual -Wno-int-to-void-pointer-cast -MD -MT runtime/src/CMakeFiles/omp.dir/kmp_csupport.cpp.o -MF CMakeFiles/omp.dir/kmp_csupport.cpp.o.d -o CMakeFiles/omp.dir/kmp_csupport.cpp.o -c /opt/local/var/macports/build/_opt_local_var_macports_sources_rsync.macports.org_macports_release_tarballs_ports_lang_libomp/libomp/work/openmp-17.0.3.src/runtime/src/kmp_csupport.cpp |
---|
523 | :info:build cd /opt/local/var/macports/build/_opt_local_var_macports_sources_rsync.macports.org_macports_release_tarballs_ports_lang_libomp/libomp/work/build-x86_64/runtime/src && /opt/local/bin/clang++-mp-3.7 -Domp_EXPORTS -I/opt/local/var/macports/build/_opt_local_var_macports_sources_rsync.macports.org_macports_release_tarballs_ports_lang_libomp/libomp/work/build-x86_64/runtime/src -I/opt/local/var/macports/build/_opt_local_var_macports_sources_rsync.macports.org_macports_release_tarballs_ports_lang_libomp/libomp/work/openmp-17.0.3.src/runtime/src -I/opt/local/var/macports/build/_opt_local_var_macports_sources_rsync.macports.org_macports_release_tarballs_ports_lang_libomp/libomp/work/openmp-17.0.3.src/runtime/src/i18n -I/opt/local/var/macports/build/_opt_local_var_macports_sources_rsync.macports.org_macports_release_tarballs_ports_lang_libomp/libomp/work/openmp-17.0.3.src/runtime/src/include -I/opt/local/var/macports/build/_opt_local_var_macports_sources_rsync.macports.org_macports_release_tarballs_ports_lang_libomp/libomp/work/openmp-17.0.3.src/runtime/src/thirdparty/ittnotify -pipe -Os -std=c++11 -DNDEBUG -I/opt/local/include -stdlib=libc++ -Wall -Wcast-qual -Wformat-pedantic -Wimplicit-fallthrough -Wsign-compare -Wno-extra -Wno-pedantic -O3 -DNDEBUG -arch x86_64 -mmacosx-version-min=10.7 -fPIC -D _GNU_SOURCE -D _REENTRANT -std=c++1z -fno-exceptions -fno-rtti -Wno-covered-switch-default -Wno-strict-aliasing -Wno-switch -Wno-uninitialized -Wno-return-type-c-linkage -Wno-cast-qual -Wno-int-to-void-pointer-cast -MD -MT runtime/src/CMakeFiles/omp.dir/kmp_atomic.cpp.o -MF CMakeFiles/omp.dir/kmp_atomic.cpp.o.d -o CMakeFiles/omp.dir/kmp_atomic.cpp.o -c /opt/local/var/macports/build/_opt_local_var_macports_sources_rsync.macports.org_macports_release_tarballs_ports_lang_libomp/libomp/work/openmp-17.0.3.src/runtime/src/kmp_atomic.cpp |
---|
524 | :info:build [ 13%] Building CXX object runtime/src/CMakeFiles/omp.dir/kmp_alloc.cpp.o |
---|
525 | :info:build [ 16%] Building CXX object runtime/src/CMakeFiles/omp.dir/kmp_debug.cpp.o |
---|
526 | :info:build cd /opt/local/var/macports/build/_opt_local_var_macports_sources_rsync.macports.org_macports_release_tarballs_ports_lang_libomp/libomp/work/build-x86_64/runtime/src && /opt/local/bin/clang++-mp-3.7 -Domp_EXPORTS -I/opt/local/var/macports/build/_opt_local_var_macports_sources_rsync.macports.org_macports_release_tarballs_ports_lang_libomp/libomp/work/build-x86_64/runtime/src -I/opt/local/var/macports/build/_opt_local_var_macports_sources_rsync.macports.org_macports_release_tarballs_ports_lang_libomp/libomp/work/openmp-17.0.3.src/runtime/src -I/opt/local/var/macports/build/_opt_local_var_macports_sources_rsync.macports.org_macports_release_tarballs_ports_lang_libomp/libomp/work/openmp-17.0.3.src/runtime/src/i18n -I/opt/local/var/macports/build/_opt_local_var_macports_sources_rsync.macports.org_macports_release_tarballs_ports_lang_libomp/libomp/work/openmp-17.0.3.src/runtime/src/include -I/opt/local/var/macports/build/_opt_local_var_macports_sources_rsync.macports.org_macports_release_tarballs_ports_lang_libomp/libomp/work/openmp-17.0.3.src/runtime/src/thirdparty/ittnotify -pipe -Os -std=c++11 -DNDEBUG -I/opt/local/include -stdlib=libc++ -Wall -Wcast-qual -Wformat-pedantic -Wimplicit-fallthrough -Wsign-compare -Wno-extra -Wno-pedantic -O3 -DNDEBUG -arch x86_64 -mmacosx-version-min=10.7 -fPIC -D _GNU_SOURCE -D _REENTRANT -std=c++1z -fno-exceptions -fno-rtti -Wno-covered-switch-default -Wno-strict-aliasing -Wno-switch -Wno-uninitialized -Wno-return-type-c-linkage -Wno-cast-qual -Wno-int-to-void-pointer-cast -MD -MT runtime/src/CMakeFiles/omp.dir/kmp_alloc.cpp.o -MF CMakeFiles/omp.dir/kmp_alloc.cpp.o.d -o CMakeFiles/omp.dir/kmp_alloc.cpp.o -c /opt/local/var/macports/build/_opt_local_var_macports_sources_rsync.macports.org_macports_release_tarballs_ports_lang_libomp/libomp/work/openmp-17.0.3.src/runtime/src/kmp_alloc.cpp |
---|
527 | :info:build cd /opt/local/var/macports/build/_opt_local_var_macports_sources_rsync.macports.org_macports_release_tarballs_ports_lang_libomp/libomp/work/build-x86_64/runtime/src && /opt/local/bin/clang++-mp-3.7 -Domp_EXPORTS -I/opt/local/var/macports/build/_opt_local_var_macports_sources_rsync.macports.org_macports_release_tarballs_ports_lang_libomp/libomp/work/build-x86_64/runtime/src -I/opt/local/var/macports/build/_opt_local_var_macports_sources_rsync.macports.org_macports_release_tarballs_ports_lang_libomp/libomp/work/openmp-17.0.3.src/runtime/src -I/opt/local/var/macports/build/_opt_local_var_macports_sources_rsync.macports.org_macports_release_tarballs_ports_lang_libomp/libomp/work/openmp-17.0.3.src/runtime/src/i18n -I/opt/local/var/macports/build/_opt_local_var_macports_sources_rsync.macports.org_macports_release_tarballs_ports_lang_libomp/libomp/work/openmp-17.0.3.src/runtime/src/include -I/opt/local/var/macports/build/_opt_local_var_macports_sources_rsync.macports.org_macports_release_tarballs_ports_lang_libomp/libomp/work/openmp-17.0.3.src/runtime/src/thirdparty/ittnotify -pipe -Os -std=c++11 -DNDEBUG -I/opt/local/include -stdlib=libc++ -Wall -Wcast-qual -Wformat-pedantic -Wimplicit-fallthrough -Wsign-compare -Wno-extra -Wno-pedantic -O3 -DNDEBUG -arch x86_64 -mmacosx-version-min=10.7 -fPIC -D _GNU_SOURCE -D _REENTRANT -std=c++1z -fno-exceptions -fno-rtti -Wno-covered-switch-default -Wno-strict-aliasing -Wno-switch -Wno-uninitialized -Wno-return-type-c-linkage -Wno-cast-qual -Wno-int-to-void-pointer-cast -MD -MT runtime/src/CMakeFiles/omp.dir/kmp_debug.cpp.o -MF CMakeFiles/omp.dir/kmp_debug.cpp.o.d -o CMakeFiles/omp.dir/kmp_debug.cpp.o -c /opt/local/var/macports/build/_opt_local_var_macports_sources_rsync.macports.org_macports_release_tarballs_ports_lang_libomp/libomp/work/openmp-17.0.3.src/runtime/src/kmp_debug.cpp |
---|
528 | :info:build In file included from /opt/local/var/macports/build/_opt_local_var_macports_sources_rsync.macports.org_macports_release_tarballs_ports_lang_libomp/libomp/work/openmp-17.0.3.src/runtime/src/kmp_csupport.cpp:18: |
---|
529 | :info:build In file included from /opt/local/var/macports/build/_opt_local_var_macports_sources_rsync.macports.org_macports_release_tarballs_ports_lang_libomp/libomp/work/openmp-17.0.3.src/runtime/src/kmp_itt.h:322: |
---|
530 | :info:build /opt/local/var/macports/build/_opt_local_var_macports_sources_rsync.macports.org_macports_release_tarballs_ports_lang_libomp/libomp/work/openmp-17.0.3.src/runtime/src/kmp_itt.inl:64:5: error: copying member subobject of type 'std::atomic<bool>' invokes deleted constructor |
---|
531 | :info:build KMP_BOOTSTRAP_LOCK_INITIALIZER(metadata_lock); |
---|
532 | :info:build ^~~~~~~~~~~~~~~~~~~~~~~~~~~~~~~~~~~~~~~~~~~~~ |
---|
533 | :info:build /opt/local/var/macports/build/_opt_local_var_macports_sources_rsync.macports.org_macports_release_tarballs_ports_lang_libomp/libomp/work/openmp-17.0.3.src/runtime/src/kmp_lock.h:515:46: note: expanded from macro 'KMP_BOOTSTRAP_LOCK_INITIALIZER' |
---|
534 | :info:build #define KMP_BOOTSTRAP_LOCK_INITIALIZER(lock) KMP_TICKET_LOCK_INITIALIZER((lock)) |
---|
535 | :info:build ^~~~~~~~~~~~~~~~~~~~~~~~~~~~~~~~~~~ |
---|
536 | :info:build /opt/local/var/macports/build/_opt_local_var_macports_sources_rsync.macports.org_macports_release_tarballs_ports_lang_libomp/libomp/work/openmp-17.0.3.src/runtime/src/kmp_lock.h:279:7: note: expanded from macro 'KMP_TICKET_LOCK_INITIALIZER' |
---|
537 | :info:build { true, &(lock), NULL, 0U, 0U, 0, -1 } \ |
---|
538 | :info:build ^~~~ |
---|
539 | :info:build /opt/local/libexec/llvm-3.7/bin/../include/c++/v1/atomic:998:7: note: copy constructor of 'atomic<bool>' is implicitly deleted because base class '__atomic_base<bool>' has a deleted copy constructor |
---|
540 | :info:build : public __atomic_base<_Tp> |
---|
541 | :info:build ^ |
---|
542 | :info:build /opt/local/libexec/llvm-3.7/bin/../include/c++/v1/atomic:902:5: note: '__atomic_base' has been explicitly marked deleted here |
---|
543 | :info:build __atomic_base(const __atomic_base&) = delete; |
---|
544 | :info:build ^ |
---|
545 | :info:build In file included from /opt/local/var/macports/build/_opt_local_var_macports_sources_rsync.macports.org_macports_release_tarballs_ports_lang_libomp/libomp/work/openmp-17.0.3.src/runtime/src/kmp_csupport.cpp:18: |
---|
546 | :info:build In file included from /opt/local/var/macports/build/_opt_local_var_macports_sources_rsync.macports.org_macports_release_tarballs_ports_lang_libomp/libomp/work/openmp-17.0.3.src/runtime/src/kmp_itt.h:322: |
---|
547 | :info:build /opt/local/var/macports/build/_opt_local_var_macports_sources_rsync.macports.org_macports_release_tarballs_ports_lang_libomp/libomp/work/openmp-17.0.3.src/runtime/src/kmp_itt.inl:64:5: error: copying member subobject of type 'std::atomic<unsigned int>' invokes deleted constructor |
---|
548 | :info:build KMP_BOOTSTRAP_LOCK_INITIALIZER(metadata_lock); |
---|
549 | :info:build ^~~~~~~~~~~~~~~~~~~~~~~~~~~~~~~~~~~~~~~~~~~~~ |
---|
550 | :info:build /opt/local/var/macports/build/_opt_local_var_macports_sources_rsync.macports.org_macports_release_tarballs_ports_lang_libomp/libomp/work/openmp-17.0.3.src/runtime/src/kmp_lock.h:515:46: note: expanded from macro 'KMP_BOOTSTRAP_LOCK_INITIALIZER' |
---|
551 | :info:build #define KMP_BOOTSTRAP_LOCK_INITIALIZER(lock) KMP_TICKET_LOCK_INITIALIZER((lock)) |
---|
552 | :info:build ^~~~~~~~~~~~~~~~~~~~~~~~~~~~~~~~~~~ |
---|
553 | :info:build /opt/local/var/macports/build/_opt_local_var_macports_sources_rsync.macports.org_macports_release_tarballs_ports_lang_libomp/libomp/work/openmp-17.0.3.src/runtime/src/kmp_lock.h:279:28: note: expanded from macro 'KMP_TICKET_LOCK_INITIALIZER' |
---|
554 | :info:build { true, &(lock), NULL, 0U, 0U, 0, -1 } \ |
---|
555 | :info:build ^~ |
---|
556 | :info:build /opt/local/libexec/llvm-3.7/bin/../include/c++/v1/atomic:998:7: note: copy constructor of 'atomic<unsigned int>' is implicitly deleted because base class '__atomic_base<unsigned int>' has a deleted copy constructor |
---|
557 | :info:build : public __atomic_base<_Tp> |
---|
558 | :info:build ^ |
---|
559 | :info:build /opt/local/libexec/llvm-3.7/bin/../include/c++/v1/atomic:917:7: note: copy constructor of '__atomic_base<unsigned int, true>' is implicitly deleted because base class '__atomic_base<unsigned int, false>' has a deleted copy constructor |
---|
560 | :info:build : public __atomic_base<_Tp, false> |
---|
561 | :info:build ^ |
---|
562 | :info:build /opt/local/libexec/llvm-3.7/bin/../include/c++/v1/atomic:902:5: note: '__atomic_base' has been explicitly marked deleted here |
---|
563 | :info:build __atomic_base(const __atomic_base&) = delete; |
---|
564 | :info:build ^ |
---|
565 | :info:build In file included from /opt/local/var/macports/build/_opt_local_var_macports_sources_rsync.macports.org_macports_release_tarballs_ports_lang_libomp/libomp/work/openmp-17.0.3.src/runtime/src/kmp_csupport.cpp:18: |
---|
566 | :info:build In file included from /opt/local/var/macports/build/_opt_local_var_macports_sources_rsync.macports.org_macports_release_tarballs_ports_lang_libomp/libomp/work/openmp-17.0.3.src/runtime/src/kmp_itt.h:322: |
---|
567 | :info:build /opt/local/var/macports/build/_opt_local_var_macports_sources_rsync.macports.org_macports_release_tarballs_ports_lang_libomp/libomp/work/openmp-17.0.3.src/runtime/src/kmp_itt.inl:64:5: error: copying member subobject of type 'std::atomic<unsigned int>' invokes deleted constructor |
---|
568 | :info:build KMP_BOOTSTRAP_LOCK_INITIALIZER(metadata_lock); |
---|
569 | :info:build ^~~~~~~~~~~~~~~~~~~~~~~~~~~~~~~~~~~~~~~~~~~~~ |
---|
570 | :info:build /opt/local/var/macports/build/_opt_local_var_macports_sources_rsync.macports.org_macports_release_tarballs_ports_lang_libomp/libomp/work/openmp-17.0.3.src/runtime/src/kmp_lock.h:515:46: note: expanded from macro 'KMP_BOOTSTRAP_LOCK_INITIALIZER' |
---|
571 | :info:build #define KMP_BOOTSTRAP_LOCK_INITIALIZER(lock) KMP_TICKET_LOCK_INITIALIZER((lock)) |
---|
572 | :info:build ^~~~~~~~~~~~~~~~~~~~~~~~~~~~~~~~~~~ |
---|
573 | :info:build /opt/local/var/macports/build/_opt_local_var_macports_sources_rsync.macports.org_macports_release_tarballs_ports_lang_libomp/libomp/work/openmp-17.0.3.src/runtime/src/kmp_lock.h:279:32: note: expanded from macro 'KMP_TICKET_LOCK_INITIALIZER' |
---|
574 | :info:build { true, &(lock), NULL, 0U, 0U, 0, -1 } \ |
---|
575 | :info:build ^~ |
---|
576 | :info:build /opt/local/libexec/llvm-3.7/bin/../include/c++/v1/atomic:998:7: note: copy constructor of 'atomic<unsigned int>' is implicitly deleted because base class '__atomic_base<unsigned int>' has a deleted copy constructor |
---|
577 | :info:build : public __atomic_base<_Tp> |
---|
578 | :info:build ^ |
---|
579 | :info:build /opt/local/libexec/llvm-3.7/bin/../include/c++/v1/atomic:917:7: note: copy constructor of '__atomic_base<unsigned int, true>' is implicitly deleted because base class '__atomic_base<unsigned int, false>' has a deleted copy constructor |
---|
580 | :info:build : public __atomic_base<_Tp, false> |
---|
581 | :info:build ^ |
---|
582 | :info:build /opt/local/libexec/llvm-3.7/bin/../include/c++/v1/atomic:902:5: note: '__atomic_base' has been explicitly marked deleted here |
---|
583 | :info:build __atomic_base(const __atomic_base&) = delete; |
---|
584 | :info:build ^ |
---|
585 | :info:build In file included from /opt/local/var/macports/build/_opt_local_var_macports_sources_rsync.macports.org_macports_release_tarballs_ports_lang_libomp/libomp/work/openmp-17.0.3.src/runtime/src/kmp_csupport.cpp:18: |
---|
586 | :info:build In file included from /opt/local/var/macports/build/_opt_local_var_macports_sources_rsync.macports.org_macports_release_tarballs_ports_lang_libomp/libomp/work/openmp-17.0.3.src/runtime/src/kmp_itt.h:322: |
---|
587 | :info:build /opt/local/var/macports/build/_opt_local_var_macports_sources_rsync.macports.org_macports_release_tarballs_ports_lang_libomp/libomp/work/openmp-17.0.3.src/runtime/src/kmp_itt.inl:64:5: error: copying member subobject of type 'std::atomic<int>' invokes deleted constructor |
---|
588 | :info:build KMP_BOOTSTRAP_LOCK_INITIALIZER(metadata_lock); |
---|
589 | :info:build ^~~~~~~~~~~~~~~~~~~~~~~~~~~~~~~~~~~~~~~~~~~~~ |
---|
590 | :info:build /opt/local/var/macports/build/_opt_local_var_macports_sources_rsync.macports.org_macports_release_tarballs_ports_lang_libomp/libomp/work/openmp-17.0.3.src/runtime/src/kmp_lock.h:515:46: note: expanded from macro 'KMP_BOOTSTRAP_LOCK_INITIALIZER' |
---|
591 | :info:build #define KMP_BOOTSTRAP_LOCK_INITIALIZER(lock) KMP_TICKET_LOCK_INITIALIZER((lock)) |
---|
592 | :info:build ^~~~~~~~~~~~~~~~~~~~~~~~~~~~~~~~~~~ |
---|
593 | :info:build /opt/local/var/macports/build/_opt_local_var_macports_sources_rsync.macports.org_macports_release_tarballs_ports_lang_libomp/libomp/work/openmp-17.0.3.src/runtime/src/kmp_lock.h:279:36: note: expanded from macro 'KMP_TICKET_LOCK_INITIALIZER' |
---|
594 | :info:build { true, &(lock), NULL, 0U, 0U, 0, -1 } \ |
---|
595 | :info:build ^ |
---|
596 | :info:build /opt/local/libexec/llvm-3.7/bin/../include/c++/v1/atomic:998:7: note: copy constructor of 'atomic<int>' is implicitly deleted because base class '__atomic_base<int>' has a deleted copy constructor |
---|
597 | :info:build : public __atomic_base<_Tp> |
---|
598 | :info:build ^ |
---|
599 | :info:build /opt/local/libexec/llvm-3.7/bin/../include/c++/v1/atomic:917:7: note: copy constructor of '__atomic_base<int, true>' is implicitly deleted because base class '__atomic_base<int, false>' has a deleted copy constructor |
---|
600 | :info:build : public __atomic_base<_Tp, false> |
---|
601 | :info:build ^ |
---|
602 | :info:build /opt/local/libexec/llvm-3.7/bin/../include/c++/v1/atomic:902:5: note: '__atomic_base' has been explicitly marked deleted here |
---|
603 | :info:build __atomic_base(const __atomic_base&) = delete; |
---|
604 | :info:build ^ |
---|
605 | :info:build In file included from /opt/local/var/macports/build/_opt_local_var_macports_sources_rsync.macports.org_macports_release_tarballs_ports_lang_libomp/libomp/work/openmp-17.0.3.src/runtime/src/kmp_csupport.cpp:18: |
---|
606 | :info:build In file included from /opt/local/var/macports/build/_opt_local_var_macports_sources_rsync.macports.org_macports_release_tarballs_ports_lang_libomp/libomp/work/openmp-17.0.3.src/runtime/src/kmp_itt.h:322: |
---|
607 | :info:build /opt/local/var/macports/build/_opt_local_var_macports_sources_rsync.macports.org_macports_release_tarballs_ports_lang_libomp/libomp/work/openmp-17.0.3.src/runtime/src/kmp_itt.inl:64:5: error: copying member subobject of type 'std::atomic<int>' invokes deleted constructor |
---|
608 | :info:build KMP_BOOTSTRAP_LOCK_INITIALIZER(metadata_lock); |
---|
609 | :info:build ^~~~~~~~~~~~~~~~~~~~~~~~~~~~~~~~~~~~~~~~~~~~~ |
---|
610 | :info:build /opt/local/var/macports/build/_opt_local_var_macports_sources_rsync.macports.org_macports_release_tarballs_ports_lang_libomp/libomp/work/openmp-17.0.3.src/runtime/src/kmp_lock.h:515:46: note: expanded from macro 'KMP_BOOTSTRAP_LOCK_INITIALIZER' |
---|
611 | :info:build #define KMP_BOOTSTRAP_LOCK_INITIALIZER(lock) KMP_TICKET_LOCK_INITIALIZER((lock)) |
---|
612 | :info:build ^~~~~~~~~~~~~~~~~~~~~~~~~~~~~~~~~~~ |
---|
613 | :info:build /opt/local/var/macports/build/_opt_local_var_macports_sources_rsync.macports.org_macports_release_tarballs_ports_lang_libomp/libomp/work/openmp-17.0.3.src/runtime/src/kmp_lock.h:279:39: note: expanded from macro 'KMP_TICKET_LOCK_INITIALIZER' |
---|
614 | :info:build { true, &(lock), NULL, 0U, 0U, 0, -1 } \ |
---|
615 | :info:build ^~ |
---|
616 | :info:build /opt/local/libexec/llvm-3.7/bin/../include/c++/v1/atomic:998:7: note: copy constructor of 'atomic<int>' is implicitly deleted because base class '__atomic_base<int>' has a deleted copy constructor |
---|
617 | :info:build : public __atomic_base<_Tp> |
---|
618 | :info:build ^ |
---|
619 | :info:build /opt/local/libexec/llvm-3.7/bin/../include/c++/v1/atomic:917:7: note: copy constructor of '__atomic_base<int, true>' is implicitly deleted because base class '__atomic_base<int, false>' has a deleted copy constructor |
---|
620 | :info:build : public __atomic_base<_Tp, false> |
---|
621 | :info:build ^ |
---|
622 | :info:build /opt/local/libexec/llvm-3.7/bin/../include/c++/v1/atomic:902:5: note: '__atomic_base' has been explicitly marked deleted here |
---|
623 | :info:build __atomic_base(const __atomic_base&) = delete; |
---|
624 | :info:build ^ |
---|
625 | :info:build 5 errors generated. |
---|
626 | :info:build make[2]: *** [runtime/src/CMakeFiles/omp.dir/kmp_csupport.cpp.o] Error 1 |
---|
627 | :info:build make[2]: *** Waiting for unfinished jobs.... |
---|
628 | :info:build [ 19%] Building CXX object runtime/src/CMakeFiles/omp.dir/kmp_itt.cpp.o |
---|
629 | :info:build cd /opt/local/var/macports/build/_opt_local_var_macports_sources_rsync.macports.org_macports_release_tarballs_ports_lang_libomp/libomp/work/build-x86_64/runtime/src && /opt/local/bin/clang++-mp-3.7 -Domp_EXPORTS -I/opt/local/var/macports/build/_opt_local_var_macports_sources_rsync.macports.org_macports_release_tarballs_ports_lang_libomp/libomp/work/build-x86_64/runtime/src -I/opt/local/var/macports/build/_opt_local_var_macports_sources_rsync.macports.org_macports_release_tarballs_ports_lang_libomp/libomp/work/openmp-17.0.3.src/runtime/src -I/opt/local/var/macports/build/_opt_local_var_macports_sources_rsync.macports.org_macports_release_tarballs_ports_lang_libomp/libomp/work/openmp-17.0.3.src/runtime/src/i18n -I/opt/local/var/macports/build/_opt_local_var_macports_sources_rsync.macports.org_macports_release_tarballs_ports_lang_libomp/libomp/work/openmp-17.0.3.src/runtime/src/include -I/opt/local/var/macports/build/_opt_local_var_macports_sources_rsync.macports.org_macports_release_tarballs_ports_lang_libomp/libomp/work/openmp-17.0.3.src/runtime/src/thirdparty/ittnotify -pipe -Os -std=c++11 -DNDEBUG -I/opt/local/include -stdlib=libc++ -Wall -Wcast-qual -Wformat-pedantic -Wimplicit-fallthrough -Wsign-compare -Wno-extra -Wno-pedantic -O3 -DNDEBUG -arch x86_64 -mmacosx-version-min=10.7 -fPIC -D _GNU_SOURCE -D _REENTRANT -std=c++1z -fno-exceptions -fno-rtti -Wno-covered-switch-default -Wno-strict-aliasing -Wno-switch -Wno-uninitialized -Wno-return-type-c-linkage -Wno-cast-qual -Wno-int-to-void-pointer-cast -MD -MT runtime/src/CMakeFiles/omp.dir/kmp_itt.cpp.o -MF CMakeFiles/omp.dir/kmp_itt.cpp.o.d -o CMakeFiles/omp.dir/kmp_itt.cpp.o -c /opt/local/var/macports/build/_opt_local_var_macports_sources_rsync.macports.org_macports_release_tarballs_ports_lang_libomp/libomp/work/openmp-17.0.3.src/runtime/src/kmp_itt.cpp |
---|
630 | :info:build In file included from /opt/local/var/macports/build/_opt_local_var_macports_sources_rsync.macports.org_macports_release_tarballs_ports_lang_libomp/libomp/work/openmp-17.0.3.src/runtime/src/kmp_itt.cpp:16: |
---|
631 | :info:build In file included from /opt/local/var/macports/build/_opt_local_var_macports_sources_rsync.macports.org_macports_release_tarballs_ports_lang_libomp/libomp/work/openmp-17.0.3.src/runtime/src/kmp_itt.h:322: |
---|
632 | :info:build /opt/local/var/macports/build/_opt_local_var_macports_sources_rsync.macports.org_macports_release_tarballs_ports_lang_libomp/libomp/work/openmp-17.0.3.src/runtime/src/kmp_itt.inl:64:5: error: copying member subobject of type 'std::atomic<bool>' invokes deleted constructor |
---|
633 | :info:build KMP_BOOTSTRAP_LOCK_INITIALIZER(metadata_lock); |
---|
634 | :info:build ^~~~~~~~~~~~~~~~~~~~~~~~~~~~~~~~~~~~~~~~~~~~~ |
---|
635 | :info:build /opt/local/var/macports/build/_opt_local_var_macports_sources_rsync.macports.org_macports_release_tarballs_ports_lang_libomp/libomp/work/openmp-17.0.3.src/runtime/src/kmp_lock.h:515:46: note: expanded from macro 'KMP_BOOTSTRAP_LOCK_INITIALIZER' |
---|
636 | :info:build #define KMP_BOOTSTRAP_LOCK_INITIALIZER(lock) KMP_TICKET_LOCK_INITIALIZER((lock)) |
---|
637 | :info:build ^~~~~~~~~~~~~~~~~~~~~~~~~~~~~~~~~~~ |
---|
638 | :info:build /opt/local/var/macports/build/_opt_local_var_macports_sources_rsync.macports.org_macports_release_tarballs_ports_lang_libomp/libomp/work/openmp-17.0.3.src/runtime/src/kmp_lock.h:279:7: note: expanded from macro 'KMP_TICKET_LOCK_INITIALIZER' |
---|
639 | :info:build { true, &(lock), NULL, 0U, 0U, 0, -1 } \ |
---|
640 | :info:build ^~~~ |
---|
641 | :info:build /opt/local/libexec/llvm-3.7/bin/../include/c++/v1/atomic:998:7: note: copy constructor of 'atomic<bool>' is implicitly deleted because base class '__atomic_base<bool>' has a deleted copy constructor |
---|
642 | :info:build : public __atomic_base<_Tp> |
---|
643 | :info:build ^ |
---|
644 | :info:build /opt/local/libexec/llvm-3.7/bin/../include/c++/v1/atomic:902:5: note: '__atomic_base' has been explicitly marked deleted here |
---|
645 | :info:build __atomic_base(const __atomic_base&) = delete; |
---|
646 | :info:build ^ |
---|
647 | :info:build In file included from /opt/local/var/macports/build/_opt_local_var_macports_sources_rsync.macports.org_macports_release_tarballs_ports_lang_libomp/libomp/work/openmp-17.0.3.src/runtime/src/kmp_itt.cpp:16: |
---|
648 | :info:build In file included from /opt/local/var/macports/build/_opt_local_var_macports_sources_rsync.macports.org_macports_release_tarballs_ports_lang_libomp/libomp/work/openmp-17.0.3.src/runtime/src/kmp_itt.h:322: |
---|
649 | :info:build /opt/local/var/macports/build/_opt_local_var_macports_sources_rsync.macports.org_macports_release_tarballs_ports_lang_libomp/libomp/work/openmp-17.0.3.src/runtime/src/kmp_itt.inl:64:5: error: copying member subobject of type 'std::atomic<unsigned int>' invokes deleted constructor |
---|
650 | :info:build KMP_BOOTSTRAP_LOCK_INITIALIZER(metadata_lock); |
---|
651 | :info:build ^~~~~~~~~~~~~~~~~~~~~~~~~~~~~~~~~~~~~~~~~~~~~ |
---|
652 | :info:build /opt/local/var/macports/build/_opt_local_var_macports_sources_rsync.macports.org_macports_release_tarballs_ports_lang_libomp/libomp/work/openmp-17.0.3.src/runtime/src/kmp_lock.h:515:46: note: expanded from macro 'KMP_BOOTSTRAP_LOCK_INITIALIZER' |
---|
653 | :info:build #define KMP_BOOTSTRAP_LOCK_INITIALIZER(lock) KMP_TICKET_LOCK_INITIALIZER((lock)) |
---|
654 | :info:build ^~~~~~~~~~~~~~~~~~~~~~~~~~~~~~~~~~~ |
---|
655 | :info:build /opt/local/var/macports/build/_opt_local_var_macports_sources_rsync.macports.org_macports_release_tarballs_ports_lang_libomp/libomp/work/openmp-17.0.3.src/runtime/src/kmp_lock.h:279:28: note: expanded from macro 'KMP_TICKET_LOCK_INITIALIZER' |
---|
656 | :info:build { true, &(lock), NULL, 0U, 0U, 0, -1 } \ |
---|
657 | :info:build ^~ |
---|
658 | :info:build /opt/local/libexec/llvm-3.7/bin/../include/c++/v1/atomic:998:7: note: copy constructor of 'atomic<unsigned int>' is implicitly deleted because base class '__atomic_base<unsigned int>' has a deleted copy constructor |
---|
659 | :info:build : public __atomic_base<_Tp> |
---|
660 | :info:build ^ |
---|
661 | :info:build /opt/local/libexec/llvm-3.7/bin/../include/c++/v1/atomic:917:7: note: copy constructor of '__atomic_base<unsigned int, true>' is implicitly deleted because base class '__atomic_base<unsigned int, false>' has a deleted copy constructor |
---|
662 | :info:build : public __atomic_base<_Tp, false> |
---|
663 | :info:build ^ |
---|
664 | :info:build /opt/local/libexec/llvm-3.7/bin/../include/c++/v1/atomic:902:5: note: '__atomic_base' has been explicitly marked deleted here |
---|
665 | :info:build __atomic_base(const __atomic_base&) = delete; |
---|
666 | :info:build ^ |
---|
667 | :info:build In file included from /opt/local/var/macports/build/_opt_local_var_macports_sources_rsync.macports.org_macports_release_tarballs_ports_lang_libomp/libomp/work/openmp-17.0.3.src/runtime/src/kmp_itt.cpp:16: |
---|
668 | :info:build In file included from /opt/local/var/macports/build/_opt_local_var_macports_sources_rsync.macports.org_macports_release_tarballs_ports_lang_libomp/libomp/work/openmp-17.0.3.src/runtime/src/kmp_itt.h:322: |
---|
669 | :info:build /opt/local/var/macports/build/_opt_local_var_macports_sources_rsync.macports.org_macports_release_tarballs_ports_lang_libomp/libomp/work/openmp-17.0.3.src/runtime/src/kmp_itt.inl:64:5: error: copying member subobject of type 'std::atomic<unsigned int>' invokes deleted constructor |
---|
670 | :info:build KMP_BOOTSTRAP_LOCK_INITIALIZER(metadata_lock); |
---|
671 | :info:build ^~~~~~~~~~~~~~~~~~~~~~~~~~~~~~~~~~~~~~~~~~~~~ |
---|
672 | :info:build /opt/local/var/macports/build/_opt_local_var_macports_sources_rsync.macports.org_macports_release_tarballs_ports_lang_libomp/libomp/work/openmp-17.0.3.src/runtime/src/kmp_lock.h:515:46: note: expanded from macro 'KMP_BOOTSTRAP_LOCK_INITIALIZER' |
---|
673 | :info:build #define KMP_BOOTSTRAP_LOCK_INITIALIZER(lock) KMP_TICKET_LOCK_INITIALIZER((lock)) |
---|
674 | :info:build ^~~~~~~~~~~~~~~~~~~~~~~~~~~~~~~~~~~ |
---|
675 | :info:build /opt/local/var/macports/build/_opt_local_var_macports_sources_rsync.macports.org_macports_release_tarballs_ports_lang_libomp/libomp/work/openmp-17.0.3.src/runtime/src/kmp_lock.h:279:32: note: expanded from macro 'KMP_TICKET_LOCK_INITIALIZER' |
---|
676 | :info:build { true, &(lock), NULL, 0U, 0U, 0, -1 } \ |
---|
677 | :info:build ^~ |
---|
678 | :info:build /opt/local/libexec/llvm-3.7/bin/../include/c++/v1/atomic:998:7: note: copy constructor of 'atomic<unsigned int>' is implicitly deleted because base class '__atomic_base<unsigned int>' has a deleted copy constructor |
---|
679 | :info:build : public __atomic_base<_Tp> |
---|
680 | :info:build ^ |
---|
681 | :info:build /opt/local/libexec/llvm-3.7/bin/../include/c++/v1/atomic:917:7: note: copy constructor of '__atomic_base<unsigned int, true>' is implicitly deleted because base class '__atomic_base<unsigned int, false>' has a deleted copy constructor |
---|
682 | :info:build : public __atomic_base<_Tp, false> |
---|
683 | :info:build ^ |
---|
684 | :info:build /opt/local/libexec/llvm-3.7/bin/../include/c++/v1/atomic:902:5: note: '__atomic_base' has been explicitly marked deleted here |
---|
685 | :info:build __atomic_base(const __atomic_base&) = delete; |
---|
686 | :info:build ^ |
---|
687 | :info:build In file included from /opt/local/var/macports/build/_opt_local_var_macports_sources_rsync.macports.org_macports_release_tarballs_ports_lang_libomp/libomp/work/openmp-17.0.3.src/runtime/src/kmp_itt.cpp:16: |
---|
688 | :info:build In file included from /opt/local/var/macports/build/_opt_local_var_macports_sources_rsync.macports.org_macports_release_tarballs_ports_lang_libomp/libomp/work/openmp-17.0.3.src/runtime/src/kmp_itt.h:322: |
---|
689 | :info:build /opt/local/var/macports/build/_opt_local_var_macports_sources_rsync.macports.org_macports_release_tarballs_ports_lang_libomp/libomp/work/openmp-17.0.3.src/runtime/src/kmp_itt.inl:64:5: error: copying member subobject of type 'std::atomic<int>' invokes deleted constructor |
---|
690 | :info:build KMP_BOOTSTRAP_LOCK_INITIALIZER(metadata_lock); |
---|
691 | :info:build ^~~~~~~~~~~~~~~~~~~~~~~~~~~~~~~~~~~~~~~~~~~~~ |
---|
692 | :info:build /opt/local/var/macports/build/_opt_local_var_macports_sources_rsync.macports.org_macports_release_tarballs_ports_lang_libomp/libomp/work/openmp-17.0.3.src/runtime/src/kmp_lock.h:515:46: note: expanded from macro 'KMP_BOOTSTRAP_LOCK_INITIALIZER' |
---|
693 | :info:build #define KMP_BOOTSTRAP_LOCK_INITIALIZER(lock) KMP_TICKET_LOCK_INITIALIZER((lock)) |
---|
694 | :info:build ^~~~~~~~~~~~~~~~~~~~~~~~~~~~~~~~~~~ |
---|
695 | :info:build /opt/local/var/macports/build/_opt_local_var_macports_sources_rsync.macports.org_macports_release_tarballs_ports_lang_libomp/libomp/work/openmp-17.0.3.src/runtime/src/kmp_lock.h:279:36: note: expanded from macro 'KMP_TICKET_LOCK_INITIALIZER' |
---|
696 | :info:build { true, &(lock), NULL, 0U, 0U, 0, -1 } \ |
---|
697 | :info:build ^ |
---|
698 | :info:build /opt/local/libexec/llvm-3.7/bin/../include/c++/v1/atomic:998:7: note: copy constructor of 'atomic<int>' is implicitly deleted because base class '__atomic_base<int>' has a deleted copy constructor |
---|
699 | :info:build : public __atomic_base<_Tp> |
---|
700 | :info:build ^ |
---|
701 | :info:build /opt/local/libexec/llvm-3.7/bin/../include/c++/v1/atomic:917:7: note: copy constructor of '__atomic_base<int, true>' is implicitly deleted because base class '__atomic_base<int, false>' has a deleted copy constructor |
---|
702 | :info:build : public __atomic_base<_Tp, false> |
---|
703 | :info:build ^ |
---|
704 | :info:build /opt/local/libexec/llvm-3.7/bin/../include/c++/v1/atomic:902:5: note: '__atomic_base' has been explicitly marked deleted here |
---|
705 | :info:build __atomic_base(const __atomic_base&) = delete; |
---|
706 | :info:build ^ |
---|
707 | :info:build In file included from /opt/local/var/macports/build/_opt_local_var_macports_sources_rsync.macports.org_macports_release_tarballs_ports_lang_libomp/libomp/work/openmp-17.0.3.src/runtime/src/kmp_itt.cpp:16: |
---|
708 | :info:build In file included from /opt/local/var/macports/build/_opt_local_var_macports_sources_rsync.macports.org_macports_release_tarballs_ports_lang_libomp/libomp/work/openmp-17.0.3.src/runtime/src/kmp_itt.h:322: |
---|
709 | :info:build /opt/local/var/macports/build/_opt_local_var_macports_sources_rsync.macports.org_macports_release_tarballs_ports_lang_libomp/libomp/work/openmp-17.0.3.src/runtime/src/kmp_itt.inl:64:5: error: copying member subobject of type 'std::atomic<int>' invokes deleted constructor |
---|
710 | :info:build KMP_BOOTSTRAP_LOCK_INITIALIZER(metadata_lock); |
---|
711 | :info:build ^~~~~~~~~~~~~~~~~~~~~~~~~~~~~~~~~~~~~~~~~~~~~ |
---|
712 | :info:build /opt/local/var/macports/build/_opt_local_var_macports_sources_rsync.macports.org_macports_release_tarballs_ports_lang_libomp/libomp/work/openmp-17.0.3.src/runtime/src/kmp_lock.h:515:46: note: expanded from macro 'KMP_BOOTSTRAP_LOCK_INITIALIZER' |
---|
713 | :info:build #define KMP_BOOTSTRAP_LOCK_INITIALIZER(lock) KMP_TICKET_LOCK_INITIALIZER((lock)) |
---|
714 | :info:build ^~~~~~~~~~~~~~~~~~~~~~~~~~~~~~~~~~~ |
---|
715 | :info:build /opt/local/var/macports/build/_opt_local_var_macports_sources_rsync.macports.org_macports_release_tarballs_ports_lang_libomp/libomp/work/openmp-17.0.3.src/runtime/src/kmp_lock.h:279:39: note: expanded from macro 'KMP_TICKET_LOCK_INITIALIZER' |
---|
716 | :info:build { true, &(lock), NULL, 0U, 0U, 0, -1 } \ |
---|
717 | :info:build ^~ |
---|
718 | :info:build /opt/local/libexec/llvm-3.7/bin/../include/c++/v1/atomic:998:7: note: copy constructor of 'atomic<int>' is implicitly deleted because base class '__atomic_base<int>' has a deleted copy constructor |
---|
719 | :info:build : public __atomic_base<_Tp> |
---|
720 | :info:build ^ |
---|
721 | :info:build /opt/local/libexec/llvm-3.7/bin/../include/c++/v1/atomic:917:7: note: copy constructor of '__atomic_base<int, true>' is implicitly deleted because base class '__atomic_base<int, false>' has a deleted copy constructor |
---|
722 | :info:build : public __atomic_base<_Tp, false> |
---|
723 | :info:build ^ |
---|
724 | :info:build /opt/local/libexec/llvm-3.7/bin/../include/c++/v1/atomic:902:5: note: '__atomic_base' has been explicitly marked deleted here |
---|
725 | :info:build __atomic_base(const __atomic_base&) = delete; |
---|
726 | :info:build ^ |
---|
727 | :info:build /opt/local/var/macports/build/_opt_local_var_macports_sources_rsync.macports.org_macports_release_tarballs_ports_lang_libomp/libomp/work/openmp-17.0.3.src/runtime/src/kmp_itt.cpp:51:5: error: copying member subobject of type 'std::atomic<bool>' invokes deleted constructor |
---|
728 | :info:build KMP_BOOTSTRAP_LOCK_INITIALIZER(__kmp_itt_debug_lock); |
---|
729 | :info:build ^~~~~~~~~~~~~~~~~~~~~~~~~~~~~~~~~~~~~~~~~~~~~~~~~~~~ |
---|
730 | :info:build /opt/local/var/macports/build/_opt_local_var_macports_sources_rsync.macports.org_macports_release_tarballs_ports_lang_libomp/libomp/work/openmp-17.0.3.src/runtime/src/kmp_lock.h:515:46: note: expanded from macro 'KMP_BOOTSTRAP_LOCK_INITIALIZER' |
---|
731 | :info:build #define KMP_BOOTSTRAP_LOCK_INITIALIZER(lock) KMP_TICKET_LOCK_INITIALIZER((lock)) |
---|
732 | :info:build ^~~~~~~~~~~~~~~~~~~~~~~~~~~~~~~~~~~ |
---|
733 | :info:build /opt/local/var/macports/build/_opt_local_var_macports_sources_rsync.macports.org_macports_release_tarballs_ports_lang_libomp/libomp/work/openmp-17.0.3.src/runtime/src/kmp_lock.h:279:7: note: expanded from macro 'KMP_TICKET_LOCK_INITIALIZER' |
---|
734 | :info:build { true, &(lock), NULL, 0U, 0U, 0, -1 } \ |
---|
735 | :info:build ^~~~ |
---|
736 | :info:build /opt/local/libexec/llvm-3.7/bin/../include/c++/v1/atomic:998:7: note: copy constructor of 'atomic<bool>' is implicitly deleted because base class '__atomic_base<bool>' has a deleted copy constructor |
---|
737 | :info:build : public __atomic_base<_Tp> |
---|
738 | :info:build ^ |
---|
739 | :info:build /opt/local/libexec/llvm-3.7/bin/../include/c++/v1/atomic:902:5: note: '__atomic_base' has been explicitly marked deleted here |
---|
740 | :info:build __atomic_base(const __atomic_base&) = delete; |
---|
741 | :info:build ^ |
---|
742 | :info:build /opt/local/var/macports/build/_opt_local_var_macports_sources_rsync.macports.org_macports_release_tarballs_ports_lang_libomp/libomp/work/openmp-17.0.3.src/runtime/src/kmp_itt.cpp:51:5: error: copying member subobject of type 'std::atomic<unsigned int>' invokes deleted constructor |
---|
743 | :info:build KMP_BOOTSTRAP_LOCK_INITIALIZER(__kmp_itt_debug_lock); |
---|
744 | :info:build ^~~~~~~~~~~~~~~~~~~~~~~~~~~~~~~~~~~~~~~~~~~~~~~~~~~~ |
---|
745 | :info:build /opt/local/var/macports/build/_opt_local_var_macports_sources_rsync.macports.org_macports_release_tarballs_ports_lang_libomp/libomp/work/openmp-17.0.3.src/runtime/src/kmp_lock.h:515:46: note: expanded from macro 'KMP_BOOTSTRAP_LOCK_INITIALIZER' |
---|
746 | :info:build #define KMP_BOOTSTRAP_LOCK_INITIALIZER(lock) KMP_TICKET_LOCK_INITIALIZER((lock)) |
---|
747 | :info:build ^~~~~~~~~~~~~~~~~~~~~~~~~~~~~~~~~~~ |
---|
748 | :info:build /opt/local/var/macports/build/_opt_local_var_macports_sources_rsync.macports.org_macports_release_tarballs_ports_lang_libomp/libomp/work/openmp-17.0.3.src/runtime/src/kmp_lock.h:279:28: note: expanded from macro 'KMP_TICKET_LOCK_INITIALIZER' |
---|
749 | :info:build { true, &(lock), NULL, 0U, 0U, 0, -1 } \ |
---|
750 | :info:build ^~ |
---|
751 | :info:build /opt/local/libexec/llvm-3.7/bin/../include/c++/v1/atomic:998:7: note: copy constructor of 'atomic<unsigned int>' is implicitly deleted because base class '__atomic_base<unsigned int>' has a deleted copy constructor |
---|
752 | :info:build : public __atomic_base<_Tp> |
---|
753 | :info:build ^ |
---|
754 | :info:build /opt/local/libexec/llvm-3.7/bin/../include/c++/v1/atomic:917:7: note: copy constructor of '__atomic_base<unsigned int, true>' is implicitly deleted because base class '__atomic_base<unsigned int, false>' has a deleted copy constructor |
---|
755 | :info:build : public __atomic_base<_Tp, false> |
---|
756 | :info:build ^ |
---|
757 | :info:build /opt/local/libexec/llvm-3.7/bin/../include/c++/v1/atomic:902:5: note: '__atomic_base' has been explicitly marked deleted here |
---|
758 | :info:build __atomic_base(const __atomic_base&) = delete; |
---|
759 | :info:build ^ |
---|
760 | :info:build /opt/local/var/macports/build/_opt_local_var_macports_sources_rsync.macports.org_macports_release_tarballs_ports_lang_libomp/libomp/work/openmp-17.0.3.src/runtime/src/kmp_itt.cpp:51:5: error: copying member subobject of type 'std::atomic<unsigned int>' invokes deleted constructor |
---|
761 | :info:build KMP_BOOTSTRAP_LOCK_INITIALIZER(__kmp_itt_debug_lock); |
---|
762 | :info:build ^~~~~~~~~~~~~~~~~~~~~~~~~~~~~~~~~~~~~~~~~~~~~~~~~~~~ |
---|
763 | :info:build /opt/local/var/macports/build/_opt_local_var_macports_sources_rsync.macports.org_macports_release_tarballs_ports_lang_libomp/libomp/work/openmp-17.0.3.src/runtime/src/kmp_lock.h:515:46: note: expanded from macro 'KMP_BOOTSTRAP_LOCK_INITIALIZER' |
---|
764 | :info:build #define KMP_BOOTSTRAP_LOCK_INITIALIZER(lock) KMP_TICKET_LOCK_INITIALIZER((lock)) |
---|
765 | :info:build ^~~~~~~~~~~~~~~~~~~~~~~~~~~~~~~~~~~ |
---|
766 | :info:build /opt/local/var/macports/build/_opt_local_var_macports_sources_rsync.macports.org_macports_release_tarballs_ports_lang_libomp/libomp/work/openmp-17.0.3.src/runtime/src/kmp_lock.h:279:32: note: expanded from macro 'KMP_TICKET_LOCK_INITIALIZER' |
---|
767 | :info:build { true, &(lock), NULL, 0U, 0U, 0, -1 } \ |
---|
768 | :info:build ^~ |
---|
769 | :info:build /opt/local/libexec/llvm-3.7/bin/../include/c++/v1/atomic:998:7: note: copy constructor of 'atomic<unsigned int>' is implicitly deleted because base class '__atomic_base<unsigned int>' has a deleted copy constructor |
---|
770 | :info:build : public __atomic_base<_Tp> |
---|
771 | :info:build ^ |
---|
772 | :info:build /opt/local/libexec/llvm-3.7/bin/../include/c++/v1/atomic:917:7: note: copy constructor of '__atomic_base<unsigned int, true>' is implicitly deleted because base class '__atomic_base<unsigned int, false>' has a deleted copy constructor |
---|
773 | :info:build : public __atomic_base<_Tp, false> |
---|
774 | :info:build ^ |
---|
775 | :info:build /opt/local/libexec/llvm-3.7/bin/../include/c++/v1/atomic:902:5: note: '__atomic_base' has been explicitly marked deleted here |
---|
776 | :info:build __atomic_base(const __atomic_base&) = delete; |
---|
777 | :info:build ^ |
---|
778 | :info:build /opt/local/var/macports/build/_opt_local_var_macports_sources_rsync.macports.org_macports_release_tarballs_ports_lang_libomp/libomp/work/openmp-17.0.3.src/runtime/src/kmp_itt.cpp:51:5: error: copying member subobject of type 'std::atomic<int>' invokes deleted constructor |
---|
779 | :info:build KMP_BOOTSTRAP_LOCK_INITIALIZER(__kmp_itt_debug_lock); |
---|
780 | :info:build ^~~~~~~~~~~~~~~~~~~~~~~~~~~~~~~~~~~~~~~~~~~~~~~~~~~~ |
---|
781 | :info:build /opt/local/var/macports/build/_opt_local_var_macports_sources_rsync.macports.org_macports_release_tarballs_ports_lang_libomp/libomp/work/openmp-17.0.3.src/runtime/src/kmp_lock.h:515:46: note: expanded from macro 'KMP_BOOTSTRAP_LOCK_INITIALIZER' |
---|
782 | :info:build #define KMP_BOOTSTRAP_LOCK_INITIALIZER(lock) KMP_TICKET_LOCK_INITIALIZER((lock)) |
---|
783 | :info:build ^~~~~~~~~~~~~~~~~~~~~~~~~~~~~~~~~~~ |
---|
784 | :info:build /opt/local/var/macports/build/_opt_local_var_macports_sources_rsync.macports.org_macports_release_tarballs_ports_lang_libomp/libomp/work/openmp-17.0.3.src/runtime/src/kmp_lock.h:279:36: note: expanded from macro 'KMP_TICKET_LOCK_INITIALIZER' |
---|
785 | :info:build { true, &(lock), NULL, 0U, 0U, 0, -1 } \ |
---|
786 | :info:build ^ |
---|
787 | :info:build /opt/local/libexec/llvm-3.7/bin/../include/c++/v1/atomic:998:7: note: copy constructor of 'atomic<int>' is implicitly deleted because base class '__atomic_base<int>' has a deleted copy constructor |
---|
788 | :info:build : public __atomic_base<_Tp> |
---|
789 | :info:build ^ |
---|
790 | :info:build /opt/local/libexec/llvm-3.7/bin/../include/c++/v1/atomic:917:7: note: copy constructor of '__atomic_base<int, true>' is implicitly deleted because base class '__atomic_base<int, false>' has a deleted copy constructor |
---|
791 | :info:build : public __atomic_base<_Tp, false> |
---|
792 | :info:build ^ |
---|
793 | :info:build /opt/local/libexec/llvm-3.7/bin/../include/c++/v1/atomic:902:5: note: '__atomic_base' has been explicitly marked deleted here |
---|
794 | :info:build __atomic_base(const __atomic_base&) = delete; |
---|
795 | :info:build ^ |
---|
796 | :info:build /opt/local/var/macports/build/_opt_local_var_macports_sources_rsync.macports.org_macports_release_tarballs_ports_lang_libomp/libomp/work/openmp-17.0.3.src/runtime/src/kmp_itt.cpp:51:5: error: copying member subobject of type 'std::atomic<int>' invokes deleted constructor |
---|
797 | :info:build KMP_BOOTSTRAP_LOCK_INITIALIZER(__kmp_itt_debug_lock); |
---|
798 | :info:build ^~~~~~~~~~~~~~~~~~~~~~~~~~~~~~~~~~~~~~~~~~~~~~~~~~~~ |
---|
799 | :info:build /opt/local/var/macports/build/_opt_local_var_macports_sources_rsync.macports.org_macports_release_tarballs_ports_lang_libomp/libomp/work/openmp-17.0.3.src/runtime/src/kmp_lock.h:515:46: note: expanded from macro 'KMP_BOOTSTRAP_LOCK_INITIALIZER' |
---|
800 | :info:build #define KMP_BOOTSTRAP_LOCK_INITIALIZER(lock) KMP_TICKET_LOCK_INITIALIZER((lock)) |
---|
801 | :info:build ^~~~~~~~~~~~~~~~~~~~~~~~~~~~~~~~~~~ |
---|
802 | :info:build /opt/local/var/macports/build/_opt_local_var_macports_sources_rsync.macports.org_macports_release_tarballs_ports_lang_libomp/libomp/work/openmp-17.0.3.src/runtime/src/kmp_lock.h:279:39: note: expanded from macro 'KMP_TICKET_LOCK_INITIALIZER' |
---|
803 | :info:build { true, &(lock), NULL, 0U, 0U, 0, -1 } \ |
---|
804 | :info:build ^~ |
---|
805 | :info:build /opt/local/libexec/llvm-3.7/bin/../include/c++/v1/atomic:998:7: note: copy constructor of 'atomic<int>' is implicitly deleted because base class '__atomic_base<int>' has a deleted copy constructor |
---|
806 | :info:build : public __atomic_base<_Tp> |
---|
807 | :info:build ^ |
---|
808 | :info:build /opt/local/libexec/llvm-3.7/bin/../include/c++/v1/atomic:917:7: note: copy constructor of '__atomic_base<int, true>' is implicitly deleted because base class '__atomic_base<int, false>' has a deleted copy constructor |
---|
809 | :info:build : public __atomic_base<_Tp, false> |
---|
810 | :info:build ^ |
---|
811 | :info:build /opt/local/libexec/llvm-3.7/bin/../include/c++/v1/atomic:902:5: note: '__atomic_base' has been explicitly marked deleted here |
---|
812 | :info:build __atomic_base(const __atomic_base&) = delete; |
---|
813 | :info:build ^ |
---|
814 | :info:build 10 errors generated. |
---|
815 | :info:build make[2]: *** [runtime/src/CMakeFiles/omp.dir/kmp_itt.cpp.o] Error 1 |
---|
816 | :info:build make[2]: Leaving directory `/opt/local/var/macports/build/_opt_local_var_macports_sources_rsync.macports.org_macports_release_tarballs_ports_lang_libomp/libomp/work/build-x86_64' |
---|
817 | :info:build make[1]: *** [runtime/src/CMakeFiles/omp.dir/all] Error 2 |
---|
818 | :info:build make[1]: Leaving directory `/opt/local/var/macports/build/_opt_local_var_macports_sources_rsync.macports.org_macports_release_tarballs_ports_lang_libomp/libomp/work/build-x86_64' |
---|
819 | :info:build make: *** [all] Error 2 |
---|
820 | :info:build make: Leaving directory `/opt/local/var/macports/build/_opt_local_var_macports_sources_rsync.macports.org_macports_release_tarballs_ports_lang_libomp/libomp/work/build-x86_64' |
---|
821 | :info:build Command failed: cd "/opt/local/var/macports/build/_opt_local_var_macports_sources_rsync.macports.org_macports_release_tarballs_ports_lang_libomp/libomp/work/build-x86_64" && /usr/bin/make -j4 -w all VERBOSE=ON |
---|
822 | :info:build Exit code: 2 |
---|
823 | :error:build Failed to build libomp: command execution failed |
---|
824 | :debug:build Error code: NONE |
---|
825 | :debug:build Backtrace: command execution failed |
---|
826 | :debug:build while executing |
---|
827 | :debug:build "$procedure $targetname" |
---|
828 | :error:build See /opt/local/var/macports/logs/_opt_local_var_macports_sources_rsync.macports.org_macports_release_tarballs_ports_lang_libomp/libomp/main.log for details. |
---|