1 | version:1 |
---|
2 | :debug:main Starting logging for py311-lxml @5.1.1_0 |
---|
3 | :debug:sysinfo Mac OS X 10.4.11 (darwin/8.11.0) arch powerpc |
---|
4 | :debug:sysinfo MacPorts 2.9.1 |
---|
5 | :debug:sysinfo Xcode 2.5, CLT none |
---|
6 | :debug:sysinfo SDK 10.4 |
---|
7 | :debug:sysinfo MACOSX_DEPLOYMENT_TARGET: 10.4 |
---|
8 | :debug:main Fetching py311-lxml-5.1.1_0.darwin_8.ppc.tbz2 archive size |
---|
9 | :msg:main ---> Computing dependencies for py311-lxml:info:main .:debug:main py311-lxml has no conflicts |
---|
10 | :debug:main Searching for dependency: zlib |
---|
11 | :debug:main Found Dependency: receipt exists for zlib |
---|
12 | :debug:main Searching for dependency: libxml2 |
---|
13 | :debug:main Found Dependency: receipt exists for libxml2 |
---|
14 | :debug:main Searching for dependency: libxslt |
---|
15 | :debug:main Found Dependency: receipt exists for libxslt |
---|
16 | :debug:main Searching for dependency: python311 |
---|
17 | :debug:main Found Dependency: receipt exists for python311 |
---|
18 | :debug:main Executing org.macports.main (py311-lxml) |
---|
19 | :debug:main dropping privileges: euid changed to 502, egid changed to 502. |
---|
20 | :debug:archivefetch archivefetch phase started at Sun Mar 31 12:49:27 CEST 2024 |
---|
21 | :msg:archivefetch ---> Fetching archive for py311-lxml |
---|
22 | :debug:archivefetch Executing org.macports.archivefetch (py311-lxml) |
---|
23 | :debug:archivefetch euid/egid changed to: 0/0 |
---|
24 | :debug:archivefetch chowned /opt/local/var/macports/incoming to macports |
---|
25 | :debug:archivefetch euid/egid changed to: 502/502 |
---|
26 | :info:archivefetch ---> py311-lxml-5.1.1_0.darwin_8.ppc.tbz2 doesn't seem to exist in /opt/local/var/macports/incoming/verified |
---|
27 | :msg:archivefetch ---> Attempting to fetch py311-lxml-5.1.1_0.darwin_8.ppc.tbz2 from http://packages.macports.org/py311-lxml |
---|
28 | :debug:archivefetch Fetching archive failed: The requested URL returned error: 404 |
---|
29 | :msg:archivefetch ---> Attempting to fetch py311-lxml-5.1.1_0.darwin_8.ppc.tbz2 from http://fra.de.packages.macports.org/py311-lxml |
---|
30 | :debug:archivefetch Fetching archive failed: The requested URL returned error: 404 |
---|
31 | :msg:archivefetch ---> Attempting to fetch py311-lxml-5.1.1_0.darwin_8.ppc.tbz2 from http://cph.dk.packages.macports.org/py311-lxml |
---|
32 | :debug:archivefetch Fetching archive failed: The requested URL returned error: 404 |
---|
33 | :msg:archivefetch ---> Attempting to fetch py311-lxml-5.1.1_0.darwin_8.ppc.tbz2 from http://nue.de.packages.macports.org/py311-lxml |
---|
34 | :debug:archivefetch Fetching archive failed: The requested URL returned error: 404 |
---|
35 | :msg:archivefetch ---> Attempting to fetch py311-lxml-5.1.1_0.darwin_8.ppc.tbz2 from http://mse.uk.packages.macports.org/py311-lxml |
---|
36 | :debug:archivefetch Fetching archive failed: The requested URL returned error: 404 |
---|
37 | :msg:archivefetch ---> Attempting to fetch py311-lxml-5.1.1_0.darwin_8.ppc.tbz2 from http://fco.it.packages.macports.org/py311-lxml |
---|
38 | :debug:archivefetch Fetching archive failed: The requested URL returned error: 404 |
---|
39 | :msg:archivefetch ---> Attempting to fetch py311-lxml-5.1.1_0.darwin_8.ppc.tbz2 from http://ywg.ca.packages.macports.org/mirror/macports/packages/py311-lxml |
---|
40 | :debug:archivefetch Fetching archive failed: The requested URL returned error: 404 |
---|
41 | :msg:archivefetch ---> Attempting to fetch py311-lxml-5.1.1_0.darwin_8.ppc.tbz2 from http://mirror.fcix.net/macports/packages/py311-lxml |
---|
42 | :debug:archivefetch Fetching archive failed: The requested URL returned error: 404 |
---|
43 | :msg:archivefetch ---> Attempting to fetch py311-lxml-5.1.1_0.darwin_8.ppc.tbz2 from http://jog.id.packages.macports.org/macports/packages/py311-lxml |
---|
44 | :debug:archivefetch Fetching archive failed: The requested URL returned error: 404 |
---|
45 | :msg:archivefetch ---> Attempting to fetch py311-lxml-5.1.1_0.darwin_8.ppc.tbz2 from http://kmq.jp.packages.macports.org/py311-lxml |
---|
46 | :debug:archivefetch Fetching archive failed: The requested URL returned error: 404 |
---|
47 | :msg:archivefetch ---> Attempting to fetch py311-lxml-5.1.1_0.darwin_8.ppc.tbz2 from http://pek.cn.packages.macports.org/macports/packages/py311-lxml |
---|
48 | :debug:archivefetch Fetching archive failed: The requested URL returned error: 404 |
---|
49 | :msg:archivefetch ---> Attempting to fetch py311-lxml-5.1.1_0.darwin_8.ppc.tbz2 from http://atl.us.packages.macports.org/py311-lxml |
---|
50 | :debug:archivefetch Fetching archive failed: The requested URL returned error: 404 |
---|
51 | :error:archivefetch Failed to archivefetch py311-lxml: version @5.1.1_0: The requested URL returned error: 404 |
---|
52 | :debug:archivefetch Error code: NONE |
---|
53 | :debug:archivefetch Backtrace: version @5.1.1_0: The requested URL returned error: 404 |
---|
54 | :debug:archivefetch while executing |
---|
55 | :debug:archivefetch "error [msgcat::mc "version @[option version]_[option revision][option portvariants]: %s" $lastError]" |
---|
56 | :debug:archivefetch (procedure "portarchivefetch::fetchfiles" line 159) |
---|
57 | :debug:archivefetch invoked from within |
---|
58 | :debug:archivefetch "portarchivefetch::fetchfiles" |
---|
59 | :debug:archivefetch (procedure "portarchivefetch::archivefetch_main" line 5) |
---|
60 | :debug:archivefetch invoked from within |
---|
61 | :debug:archivefetch "$procedure $targetname" |
---|
62 | :error:archivefetch See /opt/local/var/macports/logs/_opt_local_var_macports_sources_nue.de.rsync.macports.org_macports_release_tarballs_ports_python_py-lxml/py311-lxml/main.log for details. |
---|
63 | version:1 |
---|
64 | :debug:main Starting logging for py311-lxml @5.1.1_0 |
---|
65 | :debug:sysinfo Mac OS X 10.4.11 (darwin/8.11.0) arch powerpc |
---|
66 | :debug:sysinfo MacPorts 2.9.1 |
---|
67 | :debug:sysinfo Xcode 2.5, CLT none |
---|
68 | :debug:sysinfo SDK 10.4 |
---|
69 | :debug:sysinfo MACOSX_DEPLOYMENT_TARGET: 10.4 |
---|
70 | :msg:main ---> Computing dependencies for py311-lxml:info:main .:debug:main py311-lxml has no conflicts |
---|
71 | :debug:main Searching for dependency: py311-cython |
---|
72 | :debug:main Found Dependency: receipt exists for py311-cython |
---|
73 | :debug:main Searching for dependency: apple-gcc42 |
---|
74 | :debug:main Found Dependency: receipt exists for apple-gcc42 |
---|
75 | :debug:main Searching for dependency: py311-build |
---|
76 | :debug:main Found Dependency: receipt exists for py311-build |
---|
77 | :debug:main Searching for dependency: py311-installer |
---|
78 | :debug:main Found Dependency: receipt exists for py311-installer |
---|
79 | :debug:main Searching for dependency: py311-setuptools |
---|
80 | :debug:main Found Dependency: receipt exists for py311-setuptools |
---|
81 | :debug:main Searching for dependency: py311-wheel |
---|
82 | :debug:main Found Dependency: receipt exists for py311-wheel |
---|
83 | :debug:main Searching for dependency: zlib |
---|
84 | :debug:main Found Dependency: receipt exists for zlib |
---|
85 | :debug:main Searching for dependency: libxml2 |
---|
86 | :debug:main Found Dependency: receipt exists for libxml2 |
---|
87 | :debug:main Searching for dependency: libxslt |
---|
88 | :debug:main Found Dependency: receipt exists for libxslt |
---|
89 | :debug:main Searching for dependency: python311 |
---|
90 | :debug:main Found Dependency: receipt exists for python311 |
---|
91 | :debug:main Executing org.macports.main (py311-lxml) |
---|
92 | :debug:main dropping privileges: euid changed to 502, egid changed to 502. |
---|
93 | :debug:archivefetch archivefetch phase started at Sun Mar 31 12:51:21 CEST 2024 |
---|
94 | :msg:archivefetch ---> Fetching archive for py311-lxml |
---|
95 | :debug:archivefetch Executing org.macports.archivefetch (py311-lxml) |
---|
96 | :debug:archivefetch euid/egid changed to: 0/0 |
---|
97 | :debug:archivefetch chowned /opt/local/var/macports/incoming to macports |
---|
98 | :debug:archivefetch euid/egid changed to: 502/502 |
---|
99 | :info:archivefetch ---> py311-lxml-5.1.1_0.darwin_8.ppc.tbz2 doesn't seem to exist in /opt/local/var/macports/incoming/verified |
---|
100 | :msg:archivefetch ---> Attempting to fetch py311-lxml-5.1.1_0.darwin_8.ppc.tbz2 from http://packages.macports.org/py311-lxml |
---|
101 | :debug:archivefetch Fetching archive failed: The requested URL returned error: 404 |
---|
102 | :msg:archivefetch ---> Attempting to fetch py311-lxml-5.1.1_0.darwin_8.ppc.tbz2 from http://fra.de.packages.macports.org/py311-lxml |
---|
103 | :debug:archivefetch Fetching archive failed: The requested URL returned error: 404 |
---|
104 | :msg:archivefetch ---> Attempting to fetch py311-lxml-5.1.1_0.darwin_8.ppc.tbz2 from http://cph.dk.packages.macports.org/py311-lxml |
---|
105 | :debug:archivefetch Fetching archive failed: The requested URL returned error: 404 |
---|
106 | :debug:archivefetch Privilege de-escalation not attempted as not running as root. |
---|
107 | :debug:fetch fetch phase started at Sun Mar 31 12:51:31 CEST 2024 |
---|
108 | :notice:fetch ---> Fetching distfiles for py311-lxml |
---|
109 | :debug:fetch Executing org.macports.fetch (py311-lxml) |
---|
110 | :debug:fetch Privilege de-escalation not attempted as not running as root. |
---|
111 | :debug:checksum checksum phase started at Sun Mar 31 12:51:31 CEST 2024 |
---|
112 | :notice:checksum ---> Verifying checksums for py311-lxml |
---|
113 | :debug:checksum Executing org.macports.checksum (py311-lxml) |
---|
114 | :info:checksum ---> Checksumming lxml-5.1.1.tar.gz |
---|
115 | :debug:checksum Calculated (rmd160) is 75d83693fe901f290e3ce6ad6db44ebf4546175b |
---|
116 | :debug:checksum Correct (rmd160) checksum for lxml-5.1.1.tar.gz |
---|
117 | :debug:checksum Calculated (sha256) is 42a8aa957e98bd8b884a8142175ec24ce4ef0a57760e8879f193bfe64b757ca9 |
---|
118 | :debug:checksum Correct (sha256) checksum for lxml-5.1.1.tar.gz |
---|
119 | :debug:checksum Calculated (size) is 3838907 |
---|
120 | :debug:checksum Correct (size) checksum for lxml-5.1.1.tar.gz |
---|
121 | :debug:checksum Privilege de-escalation not attempted as not running as root. |
---|
122 | :debug:extract extract phase started at Sun Mar 31 12:51:32 CEST 2024 |
---|
123 | :notice:extract ---> Extracting py311-lxml |
---|
124 | :debug:extract Executing org.macports.extract (py311-lxml) |
---|
125 | :info:extract ---> Extracting lxml-5.1.1.tar.gz |
---|
126 | :debug:extract setting option extract.args to '/opt/local/var/macports/distfiles/py-lxml/lxml-5.1.1.tar.gz' |
---|
127 | :debug:extract Environment: |
---|
128 | :debug:extract CC_PRINT_OPTIONS='YES' |
---|
129 | :debug:extract CC_PRINT_OPTIONS_FILE='/opt/local/var/macports/build/_opt_local_var_macports_sources_nue.de.rsync.macports.org_macports_release_tarballs_ports_python_py-lxml/py311-lxml/work/.CC_PRINT_OPTIONS' |
---|
130 | :debug:extract CPATH='/opt/local/include' |
---|
131 | :debug:extract DEVELOPER_DIR='/Developer' |
---|
132 | :debug:extract LIBRARY_PATH='/opt/local/lib' |
---|
133 | :debug:extract MACOSX_DEPLOYMENT_TARGET='10.4' |
---|
134 | :info:extract Executing: cd "/opt/local/var/macports/build/_opt_local_var_macports_sources_nue.de.rsync.macports.org_macports_release_tarballs_ports_python_py-lxml/py311-lxml/work" && /usr/bin/gzip -dc '/opt/local/var/macports/distfiles/py-lxml/lxml-5.1.1.tar.gz' | /usr/bin/gnutar --no-same-owner -xf - |
---|
135 | :debug:extract system: cd "/opt/local/var/macports/build/_opt_local_var_macports_sources_nue.de.rsync.macports.org_macports_release_tarballs_ports_python_py-lxml/py311-lxml/work" && /usr/bin/gzip -dc '/opt/local/var/macports/distfiles/py-lxml/lxml-5.1.1.tar.gz' | /usr/bin/gnutar --no-same-owner -xf - |
---|
136 | :debug:extract euid/egid changed to: 0/0 |
---|
137 | :debug:extract chowned /opt/local/var/macports/build/_opt_local_var_macports_sources_nue.de.rsync.macports.org_macports_release_tarballs_ports_python_py-lxml/py311-lxml/work to macports |
---|
138 | :debug:extract euid/egid changed to: 502/502 |
---|
139 | :debug:extract Executing proc-post-org.macports.extract-extract-0 |
---|
140 | :debug:extract Privilege de-escalation not attempted as not running as root. |
---|
141 | :debug:patch patch phase started at Sun Mar 31 12:51:39 CEST 2024 |
---|
142 | :debug:patch Executing org.macports.patch (py311-lxml) |
---|
143 | :notice:patch ---> Applying patches to py311-lxml |
---|
144 | :info:patch ---> Applying patch-setupinfo-remove-xcrun-call.diff |
---|
145 | :debug:patch Environment: |
---|
146 | :debug:patch CC_PRINT_OPTIONS='YES' |
---|
147 | :debug:patch CC_PRINT_OPTIONS_FILE='/opt/local/var/macports/build/_opt_local_var_macports_sources_nue.de.rsync.macports.org_macports_release_tarballs_ports_python_py-lxml/py311-lxml/work/.CC_PRINT_OPTIONS' |
---|
148 | :debug:patch CPATH='/opt/local/include' |
---|
149 | :debug:patch DEVELOPER_DIR='/Developer' |
---|
150 | :debug:patch LIBRARY_PATH='/opt/local/lib' |
---|
151 | :debug:patch MACOSX_DEPLOYMENT_TARGET='10.4' |
---|
152 | :info:patch Executing: cd "/opt/local/var/macports/build/_opt_local_var_macports_sources_nue.de.rsync.macports.org_macports_release_tarballs_ports_python_py-lxml/py311-lxml/work/lxml-5.1.1" && /usr/bin/patch -p0 < '/opt/local/var/macports/sources/nue.de.rsync.macports.org/macports/release/tarballs/ports/python/py-lxml/files/patch-setupinfo-remove-xcrun-call.diff' |
---|
153 | :debug:patch system: cd "/opt/local/var/macports/build/_opt_local_var_macports_sources_nue.de.rsync.macports.org_macports_release_tarballs_ports_python_py-lxml/py311-lxml/work/lxml-5.1.1" && /usr/bin/patch -p0 < '/opt/local/var/macports/sources/nue.de.rsync.macports.org/macports/release/tarballs/ports/python/py-lxml/files/patch-setupinfo-remove-xcrun-call.diff' |
---|
154 | :info:patch patching file setupinfo.py |
---|
155 | :info:patch Hunk #1 succeeded at 120 (offset -4 lines). |
---|
156 | :debug:patch Privilege de-escalation not attempted as not running as root. |
---|
157 | :debug:configure configure phase started at Sun Mar 31 12:51:40 CEST 2024 |
---|
158 | :notice:configure ---> Configuring py311-lxml |
---|
159 | :debug:configure Preferred compilers: apple-gcc-4.2 gcc-4.0 macports-gcc-7 macports-gcc-6 macports-gcc-5 |
---|
160 | :debug:configure Using compiler 'MacPorts Apple GCC 4.2' |
---|
161 | :debug:configure Executing org.macports.configure (py311-lxml) |
---|
162 | :debug:configure Executing portconfigure::configure_finish |
---|
163 | :debug:configure Privilege de-escalation not attempted as not running as root. |
---|
164 | :debug:build build phase started at Sun Mar 31 12:51:40 CEST 2024 |
---|
165 | :notice:build ---> Building py311-lxml |
---|
166 | :debug:build Executing proc-pre-org.macports.build-build-0 |
---|
167 | :debug:build Executing org.macports.build (py311-lxml) |
---|
168 | :debug:build Environment: |
---|
169 | :debug:build CC='/opt/local/bin/gcc-apple-4.2' |
---|
170 | :debug:build CC_PRINT_OPTIONS='YES' |
---|
171 | :debug:build CC_PRINT_OPTIONS_FILE='/opt/local/var/macports/build/_opt_local_var_macports_sources_nue.de.rsync.macports.org_macports_release_tarballs_ports_python_py-lxml/py311-lxml/work/.CC_PRINT_OPTIONS' |
---|
172 | :debug:build CFLAGS='-std=gnu99 -arch ppc -isysroot/' |
---|
173 | :debug:build CPATH='/opt/local/include' |
---|
174 | :debug:build CXX='/opt/local/bin/g++-apple-4.2' |
---|
175 | :debug:build CXXFLAGS='-arch ppc -isysroot/' |
---|
176 | :debug:build DEVELOPER_DIR='/Developer' |
---|
177 | :debug:build F90FLAGS='-m32' |
---|
178 | :debug:build FCFLAGS='-m32' |
---|
179 | :debug:build FFLAGS='-m32' |
---|
180 | :debug:build LDFLAGS='-arch ppc' |
---|
181 | :debug:build LIBRARY_PATH='/opt/local/lib' |
---|
182 | :debug:build MACOSX_DEPLOYMENT_TARGET='10.4' |
---|
183 | :debug:build OBJC='/opt/local/bin/gcc-apple-4.2' |
---|
184 | :debug:build OBJCFLAGS='-Os -arch ppc -isysroot/' |
---|
185 | :info:build Executing: cd "/opt/local/var/macports/build/_opt_local_var_macports_sources_nue.de.rsync.macports.org_macports_release_tarballs_ports_python_py-lxml/py311-lxml/work/lxml-5.1.1" && /opt/local/Library/Frameworks/Python.framework/Versions/3.11/bin/python3.11 -m build --no-isolation --wheel --outdir /opt/local/var/macports/build/_opt_local_var_macports_sources_nue.de.rsync.macports.org_macports_release_tarballs_ports_python_py-lxml/py311-lxml/work |
---|
186 | :debug:build system: cd "/opt/local/var/macports/build/_opt_local_var_macports_sources_nue.de.rsync.macports.org_macports_release_tarballs_ports_python_py-lxml/py311-lxml/work/lxml-5.1.1" && /opt/local/Library/Frameworks/Python.framework/Versions/3.11/bin/python3.11 -m build --no-isolation --wheel --outdir /opt/local/var/macports/build/_opt_local_var_macports_sources_nue.de.rsync.macports.org_macports_release_tarballs_ports_python_py-lxml/py311-lxml/work |
---|
187 | :info:build * Getting build dependencies for wheel... |
---|
188 | :info:build <string>:67: DeprecationWarning: pkg_resources is deprecated as an API. See https://setuptools.pypa.io/en/latest/pkg_resources.html |
---|
189 | :info:build Building lxml version 5.1.1. |
---|
190 | :info:build Building without Cython. |
---|
191 | :info:build Building against libxml2 2.12.6 and libxslt 1.1.39 |
---|
192 | :info:build Building against libxml2/libxslt in the following directory: /opt/local/lib |
---|
193 | :info:build running egg_info |
---|
194 | :info:build writing src/lxml.egg-info/PKG-INFO |
---|
195 | :info:build writing dependency_links to src/lxml.egg-info/dependency_links.txt |
---|
196 | :info:build writing requirements to src/lxml.egg-info/requires.txt |
---|
197 | :info:build writing top-level names to src/lxml.egg-info/top_level.txt |
---|
198 | :info:build ERROR setuptools_scm._file_finders.git listing git files failed - pretending there aren't any |
---|
199 | :info:build reading manifest file 'src/lxml.egg-info/SOURCES.txt' |
---|
200 | :info:build reading manifest template 'MANIFEST.in' |
---|
201 | :info:build adding license file 'LICENSE.txt' |
---|
202 | :info:build adding license file 'LICENSES.txt' |
---|
203 | :info:build writing manifest file 'src/lxml.egg-info/SOURCES.txt' |
---|
204 | :info:build * Building wheel... |
---|
205 | :info:build <string>:67: DeprecationWarning: pkg_resources is deprecated as an API. See https://setuptools.pypa.io/en/latest/pkg_resources.html |
---|
206 | :info:build Building lxml version 5.1.1. |
---|
207 | :info:build Building without Cython. |
---|
208 | :info:build Building against libxml2 2.12.6 and libxslt 1.1.39 |
---|
209 | :info:build Building against libxml2/libxslt in the following directory: /opt/local/lib |
---|
210 | :info:build running bdist_wheel |
---|
211 | :info:build running build |
---|
212 | :info:build running build_py |
---|
213 | :info:build creating build |
---|
214 | :info:build creating build/lib.macosx-10.4-ppc-cpython-311 |
---|
215 | :info:build creating build/lib.macosx-10.4-ppc-cpython-311/lxml |
---|
216 | :info:build copying src/lxml/ElementInclude.py -> build/lib.macosx-10.4-ppc-cpython-311/lxml |
---|
217 | :info:build copying src/lxml/__init__.py -> build/lib.macosx-10.4-ppc-cpython-311/lxml |
---|
218 | :info:build copying src/lxml/_elementpath.py -> build/lib.macosx-10.4-ppc-cpython-311/lxml |
---|
219 | :info:build copying src/lxml/builder.py -> build/lib.macosx-10.4-ppc-cpython-311/lxml |
---|
220 | :info:build copying src/lxml/cssselect.py -> build/lib.macosx-10.4-ppc-cpython-311/lxml |
---|
221 | :info:build copying src/lxml/doctestcompare.py -> build/lib.macosx-10.4-ppc-cpython-311/lxml |
---|
222 | :info:build copying src/lxml/pyclasslookup.py -> build/lib.macosx-10.4-ppc-cpython-311/lxml |
---|
223 | :info:build copying src/lxml/sax.py -> build/lib.macosx-10.4-ppc-cpython-311/lxml |
---|
224 | :info:build copying src/lxml/usedoctest.py -> build/lib.macosx-10.4-ppc-cpython-311/lxml |
---|
225 | :info:build creating build/lib.macosx-10.4-ppc-cpython-311/lxml/includes |
---|
226 | :info:build copying src/lxml/includes/__init__.py -> build/lib.macosx-10.4-ppc-cpython-311/lxml/includes |
---|
227 | :info:build creating build/lib.macosx-10.4-ppc-cpython-311/lxml/html |
---|
228 | :info:build copying src/lxml/html/ElementSoup.py -> build/lib.macosx-10.4-ppc-cpython-311/lxml/html |
---|
229 | :info:build copying src/lxml/html/__init__.py -> build/lib.macosx-10.4-ppc-cpython-311/lxml/html |
---|
230 | :info:build copying src/lxml/html/_diffcommand.py -> build/lib.macosx-10.4-ppc-cpython-311/lxml/html |
---|
231 | :info:build copying src/lxml/html/_html5builder.py -> build/lib.macosx-10.4-ppc-cpython-311/lxml/html |
---|
232 | :info:build copying src/lxml/html/_setmixin.py -> build/lib.macosx-10.4-ppc-cpython-311/lxml/html |
---|
233 | :info:build copying src/lxml/html/builder.py -> build/lib.macosx-10.4-ppc-cpython-311/lxml/html |
---|
234 | :info:build copying src/lxml/html/clean.py -> build/lib.macosx-10.4-ppc-cpython-311/lxml/html |
---|
235 | :info:build copying src/lxml/html/defs.py -> build/lib.macosx-10.4-ppc-cpython-311/lxml/html |
---|
236 | :info:build copying src/lxml/html/diff.py -> build/lib.macosx-10.4-ppc-cpython-311/lxml/html |
---|
237 | :info:build copying src/lxml/html/formfill.py -> build/lib.macosx-10.4-ppc-cpython-311/lxml/html |
---|
238 | :info:build copying src/lxml/html/html5parser.py -> build/lib.macosx-10.4-ppc-cpython-311/lxml/html |
---|
239 | :info:build copying src/lxml/html/soupparser.py -> build/lib.macosx-10.4-ppc-cpython-311/lxml/html |
---|
240 | :info:build copying src/lxml/html/usedoctest.py -> build/lib.macosx-10.4-ppc-cpython-311/lxml/html |
---|
241 | :info:build creating build/lib.macosx-10.4-ppc-cpython-311/lxml/isoschematron |
---|
242 | :info:build copying src/lxml/isoschematron/__init__.py -> build/lib.macosx-10.4-ppc-cpython-311/lxml/isoschematron |
---|
243 | :info:build copying src/lxml/etree.h -> build/lib.macosx-10.4-ppc-cpython-311/lxml |
---|
244 | :info:build copying src/lxml/etree_api.h -> build/lib.macosx-10.4-ppc-cpython-311/lxml |
---|
245 | :info:build copying src/lxml/lxml.etree.h -> build/lib.macosx-10.4-ppc-cpython-311/lxml |
---|
246 | :info:build copying src/lxml/lxml.etree_api.h -> build/lib.macosx-10.4-ppc-cpython-311/lxml |
---|
247 | :info:build copying src/lxml/etree.pyx -> build/lib.macosx-10.4-ppc-cpython-311/lxml |
---|
248 | :info:build copying src/lxml/objectify.pyx -> build/lib.macosx-10.4-ppc-cpython-311/lxml |
---|
249 | :info:build copying src/lxml/apihelpers.pxi -> build/lib.macosx-10.4-ppc-cpython-311/lxml |
---|
250 | :info:build copying src/lxml/classlookup.pxi -> build/lib.macosx-10.4-ppc-cpython-311/lxml |
---|
251 | :info:build copying src/lxml/cleanup.pxi -> build/lib.macosx-10.4-ppc-cpython-311/lxml |
---|
252 | :info:build copying src/lxml/debug.pxi -> build/lib.macosx-10.4-ppc-cpython-311/lxml |
---|
253 | :info:build copying src/lxml/docloader.pxi -> build/lib.macosx-10.4-ppc-cpython-311/lxml |
---|
254 | :info:build copying src/lxml/dtd.pxi -> build/lib.macosx-10.4-ppc-cpython-311/lxml |
---|
255 | :info:build copying src/lxml/extensions.pxi -> build/lib.macosx-10.4-ppc-cpython-311/lxml |
---|
256 | :info:build copying src/lxml/iterparse.pxi -> build/lib.macosx-10.4-ppc-cpython-311/lxml |
---|
257 | :info:build copying src/lxml/nsclasses.pxi -> build/lib.macosx-10.4-ppc-cpython-311/lxml |
---|
258 | :info:build copying src/lxml/objectpath.pxi -> build/lib.macosx-10.4-ppc-cpython-311/lxml |
---|
259 | :info:build copying src/lxml/parser.pxi -> build/lib.macosx-10.4-ppc-cpython-311/lxml |
---|
260 | :info:build copying src/lxml/parsertarget.pxi -> build/lib.macosx-10.4-ppc-cpython-311/lxml |
---|
261 | :info:build copying src/lxml/proxy.pxi -> build/lib.macosx-10.4-ppc-cpython-311/lxml |
---|
262 | :info:build copying src/lxml/public-api.pxi -> build/lib.macosx-10.4-ppc-cpython-311/lxml |
---|
263 | :info:build copying src/lxml/readonlytree.pxi -> build/lib.macosx-10.4-ppc-cpython-311/lxml |
---|
264 | :info:build copying src/lxml/relaxng.pxi -> build/lib.macosx-10.4-ppc-cpython-311/lxml |
---|
265 | :info:build copying src/lxml/saxparser.pxi -> build/lib.macosx-10.4-ppc-cpython-311/lxml |
---|
266 | :info:build copying src/lxml/schematron.pxi -> build/lib.macosx-10.4-ppc-cpython-311/lxml |
---|
267 | :info:build copying src/lxml/serializer.pxi -> build/lib.macosx-10.4-ppc-cpython-311/lxml |
---|
268 | :info:build copying src/lxml/xinclude.pxi -> build/lib.macosx-10.4-ppc-cpython-311/lxml |
---|
269 | :info:build copying src/lxml/xmlerror.pxi -> build/lib.macosx-10.4-ppc-cpython-311/lxml |
---|
270 | :info:build copying src/lxml/xmlid.pxi -> build/lib.macosx-10.4-ppc-cpython-311/lxml |
---|
271 | :info:build copying src/lxml/xmlschema.pxi -> build/lib.macosx-10.4-ppc-cpython-311/lxml |
---|
272 | :info:build copying src/lxml/xpath.pxi -> build/lib.macosx-10.4-ppc-cpython-311/lxml |
---|
273 | :info:build copying src/lxml/xslt.pxi -> build/lib.macosx-10.4-ppc-cpython-311/lxml |
---|
274 | :info:build copying src/lxml/xsltext.pxi -> build/lib.macosx-10.4-ppc-cpython-311/lxml |
---|
275 | :info:build copying src/lxml/includes/__init__.pxd -> build/lib.macosx-10.4-ppc-cpython-311/lxml/includes |
---|
276 | :info:build copying src/lxml/includes/c14n.pxd -> build/lib.macosx-10.4-ppc-cpython-311/lxml/includes |
---|
277 | :info:build copying src/lxml/includes/config.pxd -> build/lib.macosx-10.4-ppc-cpython-311/lxml/includes |
---|
278 | :info:build copying src/lxml/includes/dtdvalid.pxd -> build/lib.macosx-10.4-ppc-cpython-311/lxml/includes |
---|
279 | :info:build copying src/lxml/includes/etreepublic.pxd -> build/lib.macosx-10.4-ppc-cpython-311/lxml/includes |
---|
280 | :info:build copying src/lxml/includes/htmlparser.pxd -> build/lib.macosx-10.4-ppc-cpython-311/lxml/includes |
---|
281 | :info:build copying src/lxml/includes/relaxng.pxd -> build/lib.macosx-10.4-ppc-cpython-311/lxml/includes |
---|
282 | :info:build copying src/lxml/includes/schematron.pxd -> build/lib.macosx-10.4-ppc-cpython-311/lxml/includes |
---|
283 | :info:build copying src/lxml/includes/tree.pxd -> build/lib.macosx-10.4-ppc-cpython-311/lxml/includes |
---|
284 | :info:build copying src/lxml/includes/uri.pxd -> build/lib.macosx-10.4-ppc-cpython-311/lxml/includes |
---|
285 | :info:build copying src/lxml/includes/xinclude.pxd -> build/lib.macosx-10.4-ppc-cpython-311/lxml/includes |
---|
286 | :info:build copying src/lxml/includes/xmlerror.pxd -> build/lib.macosx-10.4-ppc-cpython-311/lxml/includes |
---|
287 | :info:build copying src/lxml/includes/xmlparser.pxd -> build/lib.macosx-10.4-ppc-cpython-311/lxml/includes |
---|
288 | :info:build copying src/lxml/includes/xmlschema.pxd -> build/lib.macosx-10.4-ppc-cpython-311/lxml/includes |
---|
289 | :info:build copying src/lxml/includes/xpath.pxd -> build/lib.macosx-10.4-ppc-cpython-311/lxml/includes |
---|
290 | :info:build copying src/lxml/includes/xslt.pxd -> build/lib.macosx-10.4-ppc-cpython-311/lxml/includes |
---|
291 | :info:build copying src/lxml/includes/etree_defs.h -> build/lib.macosx-10.4-ppc-cpython-311/lxml/includes |
---|
292 | :info:build copying src/lxml/includes/lxml-version.h -> build/lib.macosx-10.4-ppc-cpython-311/lxml/includes |
---|
293 | :info:build creating build/lib.macosx-10.4-ppc-cpython-311/lxml/isoschematron/resources |
---|
294 | :info:build creating build/lib.macosx-10.4-ppc-cpython-311/lxml/isoschematron/resources/rng |
---|
295 | :info:build copying src/lxml/isoschematron/resources/rng/iso-schematron.rng -> build/lib.macosx-10.4-ppc-cpython-311/lxml/isoschematron/resources/rng |
---|
296 | :info:build creating build/lib.macosx-10.4-ppc-cpython-311/lxml/isoschematron/resources/xsl |
---|
297 | :info:build copying src/lxml/isoschematron/resources/xsl/RNG2Schtrn.xsl -> build/lib.macosx-10.4-ppc-cpython-311/lxml/isoschematron/resources/xsl |
---|
298 | :info:build copying src/lxml/isoschematron/resources/xsl/XSD2Schtrn.xsl -> build/lib.macosx-10.4-ppc-cpython-311/lxml/isoschematron/resources/xsl |
---|
299 | :info:build creating build/lib.macosx-10.4-ppc-cpython-311/lxml/isoschematron/resources/xsl/iso-schematron-xslt1 |
---|
300 | :info:build copying src/lxml/isoschematron/resources/xsl/iso-schematron-xslt1/iso_abstract_expand.xsl -> build/lib.macosx-10.4-ppc-cpython-311/lxml/isoschematron/resources/xsl/iso-schematron-xslt1 |
---|
301 | :info:build copying src/lxml/isoschematron/resources/xsl/iso-schematron-xslt1/iso_dsdl_include.xsl -> build/lib.macosx-10.4-ppc-cpython-311/lxml/isoschematron/resources/xsl/iso-schematron-xslt1 |
---|
302 | :info:build copying src/lxml/isoschematron/resources/xsl/iso-schematron-xslt1/iso_schematron_message.xsl -> build/lib.macosx-10.4-ppc-cpython-311/lxml/isoschematron/resources/xsl/iso-schematron-xslt1 |
---|
303 | :info:build copying src/lxml/isoschematron/resources/xsl/iso-schematron-xslt1/iso_schematron_skeleton_for_xslt1.xsl -> build/lib.macosx-10.4-ppc-cpython-311/lxml/isoschematron/resources/xsl/iso-schematron-xslt1 |
---|
304 | :info:build copying src/lxml/isoschematron/resources/xsl/iso-schematron-xslt1/iso_svrl_for_xslt1.xsl -> build/lib.macosx-10.4-ppc-cpython-311/lxml/isoschematron/resources/xsl/iso-schematron-xslt1 |
---|
305 | :info:build copying src/lxml/isoschematron/resources/xsl/iso-schematron-xslt1/readme.txt -> build/lib.macosx-10.4-ppc-cpython-311/lxml/isoschematron/resources/xsl/iso-schematron-xslt1 |
---|
306 | :info:build running build_ext |
---|
307 | :info:build building 'lxml.etree' extension |
---|
308 | :info:build creating build/temp.macosx-10.4-ppc-cpython-311 |
---|
309 | :info:build creating build/temp.macosx-10.4-ppc-cpython-311/src |
---|
310 | :info:build creating build/temp.macosx-10.4-ppc-cpython-311/src/lxml |
---|
311 | :info:build /opt/local/bin/gcc-apple-4.2 -fno-common -dynamic -DNDEBUG -g -fwrapv -O3 -Wall -pipe -Os -std=gnu99 -arch ppc -isysroot/ -DCYTHON_CLINE_IN_TRACEBACK=0 -I/opt/local/include/libxml2 -Isrc -Isrc/lxml/includes -I/opt/local/Library/Frameworks/Python.framework/Versions/3.11/include/python3.11 -c src/lxml/etree.c -o build/temp.macosx-10.4-ppc-cpython-311/src/lxml/etree.o -w -flat_namespace |
---|
312 | :info:build src/lxml/etree.c: In function '__pyx_f_4lxml_5etree__fixCNs': |
---|
313 | :info:build src/lxml/etree.c:26826: error: #pragma GCC diagnostic not allowed inside functions |
---|
314 | :info:build src/lxml/etree.c:26827: error: #pragma GCC diagnostic not allowed inside functions |
---|
315 | :info:build src/lxml/etree.c:26829: error: #pragma GCC diagnostic not allowed inside functions |
---|
316 | :info:build src/lxml/etree.c: In function '__pyx_f_4lxml_5etree__rootNodeOrRaise': |
---|
317 | :info:build src/lxml/etree.c:29140: error: #pragma GCC diagnostic not allowed inside functions |
---|
318 | :info:build src/lxml/etree.c:29141: error: #pragma GCC diagnostic not allowed inside functions |
---|
319 | :info:build src/lxml/etree.c:29143: error: #pragma GCC diagnostic not allowed inside functions |
---|
320 | :info:build src/lxml/etree.c: In function '__pyx_f_4lxml_5etree__setNodeNamespaces': |
---|
321 | :info:build src/lxml/etree.c:31079: error: #pragma GCC diagnostic not allowed inside functions |
---|
322 | :info:build src/lxml/etree.c:31080: error: #pragma GCC diagnostic not allowed inside functions |
---|
323 | :info:build src/lxml/etree.c:31082: error: #pragma GCC diagnostic not allowed inside functions |
---|
324 | :info:build src/lxml/etree.c: In function '__pyx_f_4lxml_5etree__addAttributeToNode': |
---|
325 | :info:build src/lxml/etree.c:32473: error: #pragma GCC diagnostic not allowed inside functions |
---|
326 | :info:build src/lxml/etree.c:32474: error: #pragma GCC diagnostic not allowed inside functions |
---|
327 | :info:build src/lxml/etree.c:32476: error: #pragma GCC diagnostic not allowed inside functions |
---|
328 | :info:build src/lxml/etree.c: In function '__pyx_f_4lxml_5etree__setAttributeValue': |
---|
329 | :info:build src/lxml/etree.c:35140: error: #pragma GCC diagnostic not allowed inside functions |
---|
330 | :info:build src/lxml/etree.c:35141: error: #pragma GCC diagnostic not allowed inside functions |
---|
331 | :info:build src/lxml/etree.c:35143: error: #pragma GCC diagnostic not allowed inside functions |
---|
332 | :info:build src/lxml/etree.c: In function '__pyx_f_4lxml_5etree__resolveQNameText': |
---|
333 | :info:build src/lxml/etree.c:37099: error: #pragma GCC diagnostic not allowed inside functions |
---|
334 | :info:build src/lxml/etree.c:37100: error: #pragma GCC diagnostic not allowed inside functions |
---|
335 | :info:build src/lxml/etree.c:37102: error: #pragma GCC diagnostic not allowed inside functions |
---|
336 | :info:build src/lxml/etree.c: In function '__pyx_f_4lxml_5etree_13_BaseErrorLog__receive': |
---|
337 | :info:build src/lxml/etree.c:50867: error: #pragma GCC diagnostic not allowed inside functions |
---|
338 | :info:build src/lxml/etree.c:50868: error: #pragma GCC diagnostic not allowed inside functions |
---|
339 | :info:build src/lxml/etree.c:50870: error: #pragma GCC diagnostic not allowed inside functions |
---|
340 | :info:build src/lxml/etree.c: In function '__pyx_f_4lxml_5etree_13_BaseErrorLog__receiveGeneric': |
---|
341 | :info:build src/lxml/etree.c:51083: error: #pragma GCC diagnostic not allowed inside functions |
---|
342 | :info:build src/lxml/etree.c:51084: error: #pragma GCC diagnostic not allowed inside functions |
---|
343 | :info:build src/lxml/etree.c:51086: error: #pragma GCC diagnostic not allowed inside functions |
---|
344 | :info:build src/lxml/etree.c: In function '__pyx_f_4lxml_5etree_9_ErrorLog___enter__': |
---|
345 | :info:build src/lxml/etree.c:55097: error: #pragma GCC diagnostic not allowed inside functions |
---|
346 | :info:build src/lxml/etree.c:55098: error: #pragma GCC diagnostic not allowed inside functions |
---|
347 | :info:build src/lxml/etree.c:55100: error: #pragma GCC diagnostic not allowed inside functions |
---|
348 | :info:build src/lxml/etree.c: In function '__pyx_pf_4lxml_5etree_9_ErrorLog_4__exit__': |
---|
349 | :info:build src/lxml/etree.c:55171: error: #pragma GCC diagnostic not allowed inside functions |
---|
350 | :info:build src/lxml/etree.c:55172: error: #pragma GCC diagnostic not allowed inside functions |
---|
351 | :info:build src/lxml/etree.c:55174: error: #pragma GCC diagnostic not allowed inside functions |
---|
352 | :info:build src/lxml/etree.c: In function '__pyx_f_4lxml_5etree_9_ErrorLog_connect': |
---|
353 | :info:build src/lxml/etree.c:55261: error: #pragma GCC diagnostic not allowed inside functions |
---|
354 | :info:build src/lxml/etree.c:55262: error: #pragma GCC diagnostic not allowed inside functions |
---|
355 | :info:build src/lxml/etree.c:55264: error: #pragma GCC diagnostic not allowed inside functions |
---|
356 | :info:build src/lxml/etree.c: In function '__pyx_f_4lxml_5etree_9_ErrorLog_disconnect': |
---|
357 | :info:build src/lxml/etree.c:55351: error: #pragma GCC diagnostic not allowed inside functions |
---|
358 | :info:build src/lxml/etree.c:55352: error: #pragma GCC diagnostic not allowed inside functions |
---|
359 | :info:build src/lxml/etree.c:55354: error: #pragma GCC diagnostic not allowed inside functions |
---|
360 | :info:build src/lxml/etree.c: In function '__pyx_f_4lxml_5etree__forwardError': |
---|
361 | :info:build src/lxml/etree.c:58943: error: #pragma GCC diagnostic not allowed inside functions |
---|
362 | :info:build src/lxml/etree.c:58944: error: #pragma GCC diagnostic not allowed inside functions |
---|
363 | :info:build src/lxml/etree.c:58946: error: #pragma GCC diagnostic not allowed inside functions |
---|
364 | :info:build src/lxml/etree.c: In function '__pyx_f_4lxml_5etree_9_Document__findOrBuildNodeNs': |
---|
365 | :info:build src/lxml/etree.c:61936: error: #pragma GCC diagnostic not allowed inside functions |
---|
366 | :info:build src/lxml/etree.c:61937: error: #pragma GCC diagnostic not allowed inside functions |
---|
367 | :info:build src/lxml/etree.c:61939: error: #pragma GCC diagnostic not allowed inside functions |
---|
368 | :info:build src/lxml/etree.c:61982: error: #pragma GCC diagnostic not allowed inside functions |
---|
369 | :info:build src/lxml/etree.c:61983: error: #pragma GCC diagnostic not allowed inside functions |
---|
370 | :info:build src/lxml/etree.c:61985: error: #pragma GCC diagnostic not allowed inside functions |
---|
371 | :info:build src/lxml/etree.c: In function '__pyx_f_4lxml_5etree_9_Document__setNodeNs': |
---|
372 | :info:build src/lxml/etree.c:62090: error: #pragma GCC diagnostic not allowed inside functions |
---|
373 | :info:build src/lxml/etree.c:62091: error: #pragma GCC diagnostic not allowed inside functions |
---|
374 | :info:build src/lxml/etree.c:62093: error: #pragma GCC diagnostic not allowed inside functions |
---|
375 | :info:build src/lxml/etree.c: In function '__pyx_f_4lxml_5etree__documentFactory': |
---|
376 | :info:build src/lxml/etree.c:62285: error: #pragma GCC diagnostic not allowed inside functions |
---|
377 | :info:build src/lxml/etree.c:62286: error: #pragma GCC diagnostic not allowed inside functions |
---|
378 | :info:build src/lxml/etree.c:62288: error: #pragma GCC diagnostic not allowed inside functions |
---|
379 | :info:build src/lxml/etree.c: In function '__pyx_pf_4lxml_5etree_7DocInfo___cinit__': |
---|
380 | :info:build src/lxml/etree.c:62477: error: #pragma GCC diagnostic not allowed inside functions |
---|
381 | :info:build src/lxml/etree.c:62478: error: #pragma GCC diagnostic not allowed inside functions |
---|
382 | :info:build src/lxml/etree.c:62480: error: #pragma GCC diagnostic not allowed inside functions |
---|
383 | :info:build src/lxml/etree.c: In function '__pyx_pf_4lxml_5etree_7DocInfo_9root_name___get__': |
---|
384 | :info:build src/lxml/etree.c:62660: error: #pragma GCC diagnostic not allowed inside functions |
---|
385 | :info:build src/lxml/etree.c:62661: error: #pragma GCC diagnostic not allowed inside functions |
---|
386 | :info:build src/lxml/etree.c:62663: error: #pragma GCC diagnostic not allowed inside functions |
---|
387 | :info:build src/lxml/etree.c: In function '__pyx_pf_4lxml_5etree_7DocInfo_9public_id___get__': |
---|
388 | :info:build src/lxml/etree.c:63055: error: #pragma GCC diagnostic not allowed inside functions |
---|
389 | :info:build src/lxml/etree.c:63056: error: #pragma GCC diagnostic not allowed inside functions |
---|
390 | :info:build src/lxml/etree.c:63058: error: #pragma GCC diagnostic not allowed inside functions |
---|
391 | :info:build src/lxml/etree.c: In function '__pyx_pf_4lxml_5etree_7DocInfo_9public_id_2__set__': |
---|
392 | :info:build src/lxml/etree.c:63396: error: #pragma GCC diagnostic not allowed inside functions |
---|
393 | :info:build src/lxml/etree.c:63397: error: #pragma GCC diagnostic not allowed inside functions |
---|
394 | :info:build src/lxml/etree.c:63399: error: #pragma GCC diagnostic not allowed inside functions |
---|
395 | :info:build src/lxml/etree.c: In function '__pyx_pf_4lxml_5etree_7DocInfo_10system_url___get__': |
---|
396 | :info:build src/lxml/etree.c:63548: error: #pragma GCC diagnostic not allowed inside functions |
---|
397 | :info:build src/lxml/etree.c:63549: error: #pragma GCC diagnostic not allowed inside functions |
---|
398 | :info:build src/lxml/etree.c:63551: error: #pragma GCC diagnostic not allowed inside functions |
---|
399 | :info:build src/lxml/etree.c: In function '__pyx_pf_4lxml_5etree_7DocInfo_10system_url_2__set__': |
---|
400 | :info:build src/lxml/etree.c:63813: error: #pragma GCC diagnostic not allowed inside functions |
---|
401 | :info:build src/lxml/etree.c:63814: error: #pragma GCC diagnostic not allowed inside functions |
---|
402 | :info:build src/lxml/etree.c:63816: error: #pragma GCC diagnostic not allowed inside functions |
---|
403 | :info:build src/lxml/etree.c: In function '__pyx_pf_4lxml_5etree_7DocInfo_11xml_version___get__': |
---|
404 | :info:build src/lxml/etree.c:63959: error: #pragma GCC diagnostic not allowed inside functions |
---|
405 | :info:build src/lxml/etree.c:63960: error: #pragma GCC diagnostic not allowed inside functions |
---|
406 | :info:build src/lxml/etree.c:63962: error: #pragma GCC diagnostic not allowed inside functions |
---|
407 | :info:build src/lxml/etree.c: In function '__pyx_pf_4lxml_5etree_7DocInfo_8encoding___get__': |
---|
408 | :info:build src/lxml/etree.c:64096: error: #pragma GCC diagnostic not allowed inside functions |
---|
409 | :info:build src/lxml/etree.c:64097: error: #pragma GCC diagnostic not allowed inside functions |
---|
410 | :info:build src/lxml/etree.c:64099: error: #pragma GCC diagnostic not allowed inside functions |
---|
411 | :info:build src/lxml/etree.c: In function '__pyx_pf_4lxml_5etree_7DocInfo_10standalone___get__': |
---|
412 | :info:build src/lxml/etree.c:64228: error: #pragma GCC diagnostic not allowed inside functions |
---|
413 | :info:build src/lxml/etree.c:64229: error: #pragma GCC diagnostic not allowed inside functions |
---|
414 | :info:build src/lxml/etree.c:64231: error: #pragma GCC diagnostic not allowed inside functions |
---|
415 | :info:build src/lxml/etree.c: In function '__pyx_pf_4lxml_5etree_7DocInfo_7doctype___get__': |
---|
416 | :info:build src/lxml/etree.c:64551: error: #pragma GCC diagnostic not allowed inside functions |
---|
417 | :info:build src/lxml/etree.c:64552: error: #pragma GCC diagnostic not allowed inside functions |
---|
418 | :info:build src/lxml/etree.c:64554: error: #pragma GCC diagnostic not allowed inside functions |
---|
419 | :info:build src/lxml/etree.c: In function '__pyx_pf_4lxml_5etree_8_Element_10__copy__': |
---|
420 | :info:build src/lxml/etree.c:66268: error: #pragma GCC diagnostic not allowed inside functions |
---|
421 | :info:build src/lxml/etree.c:66269: error: #pragma GCC diagnostic not allowed inside functions |
---|
422 | :info:build src/lxml/etree.c:66271: error: #pragma GCC diagnostic not allowed inside functions |
---|
423 | :info:build src/lxml/etree.c: In function '__pyx_pf_4lxml_5etree_8_Element_3tag_2__set__': |
---|
424 | :info:build src/lxml/etree.c:69086: error: #pragma GCC diagnostic not allowed inside functions |
---|
425 | :info:build src/lxml/etree.c:69087: error: #pragma GCC diagnostic not allowed inside functions |
---|
426 | :info:build src/lxml/etree.c:69089: error: #pragma GCC diagnostic not allowed inside functions |
---|
427 | :info:build src/lxml/etree.c: In function '__pyx_pf_4lxml_5etree_12_ElementTree_parse': |
---|
428 | :info:build src/lxml/etree.c:81248: error: #pragma GCC diagnostic not allowed inside functions |
---|
429 | :info:build src/lxml/etree.c:81249: error: #pragma GCC diagnostic not allowed inside functions |
---|
430 | :info:build src/lxml/etree.c:81251: error: #pragma GCC diagnostic not allowed inside functions |
---|
431 | :info:build src/lxml/etree.c: In function '__pyx_pf_4lxml_5etree_12_ElementTree_7docinfo___get__': |
---|
432 | :info:build src/lxml/etree.c:82226: error: #pragma GCC diagnostic not allowed inside functions |
---|
433 | :info:build src/lxml/etree.c:82227: error: #pragma GCC diagnostic not allowed inside functions |
---|
434 | :info:build src/lxml/etree.c:82229: error: #pragma GCC diagnostic not allowed inside functions |
---|
435 | :info:build src/lxml/etree.c: In function '__pyx_pf_4lxml_5etree_12_ElementTree_10write': |
---|
436 | :info:build src/lxml/etree.c:82672: error: #pragma GCC diagnostic not allowed inside functions |
---|
437 | :info:build src/lxml/etree.c:82673: error: #pragma GCC diagnostic not allowed inside functions |
---|
438 | :info:build src/lxml/etree.c:82675: error: #pragma GCC diagnostic not allowed inside functions |
---|
439 | :info:build src/lxml/etree.c: In function '__pyx_pf_4lxml_5etree_12_ElementTree_12getpath': |
---|
440 | :info:build src/lxml/etree.c:83763: error: #pragma GCC diagnostic not allowed inside functions |
---|
441 | :info:build src/lxml/etree.c:83764: error: #pragma GCC diagnostic not allowed inside functions |
---|
442 | :info:build src/lxml/etree.c:83766: error: #pragma GCC diagnostic not allowed inside functions |
---|
443 | :info:build src/lxml/etree.c: In function '__pyx_pf_4lxml_5etree_12_ElementTree_14getelementpath': |
---|
444 | :info:build src/lxml/etree.c:84176: error: #pragma GCC diagnostic not allowed inside functions |
---|
445 | :info:build src/lxml/etree.c:84177: error: #pragma GCC diagnostic not allowed inside functions |
---|
446 | :info:build src/lxml/etree.c:84179: error: #pragma GCC diagnostic not allowed inside functions |
---|
447 | :info:build src/lxml/etree.c: In function '__pyx_pf_4lxml_5etree_12_ElementTree_20find': |
---|
448 | :info:build src/lxml/etree.c:85400: error: #pragma GCC diagnostic not allowed inside functions |
---|
449 | :info:build src/lxml/etree.c:85401: error: #pragma GCC diagnostic not allowed inside functions |
---|
450 | :info:build src/lxml/etree.c:85403: error: #pragma GCC diagnostic not allowed inside functions |
---|
451 | :info:build src/lxml/etree.c: In function '__pyx_pf_4lxml_5etree_12_ElementTree_22findtext': |
---|
452 | :info:build src/lxml/etree.c:85793: error: #pragma GCC diagnostic not allowed inside functions |
---|
453 | :info:build src/lxml/etree.c:85794: error: #pragma GCC diagnostic not allowed inside functions |
---|
454 | :info:build src/lxml/etree.c:85796: error: #pragma GCC diagnostic not allowed inside functions |
---|
455 | :info:build src/lxml/etree.c: In function '__pyx_pf_4lxml_5etree_12_ElementTree_24findall': |
---|
456 | :info:build src/lxml/etree.c:86172: error: #pragma GCC diagnostic not allowed inside functions |
---|
457 | :info:build src/lxml/etree.c:86173: error: #pragma GCC diagnostic not allowed inside functions |
---|
458 | :info:build src/lxml/etree.c:86175: error: #pragma GCC diagnostic not allowed inside functions |
---|
459 | :info:build src/lxml/etree.c: In function '__pyx_pf_4lxml_5etree_12_ElementTree_26iterfind': |
---|
460 | :info:build src/lxml/etree.c:86550: error: #pragma GCC diagnostic not allowed inside functions |
---|
461 | :info:build src/lxml/etree.c:86551: error: #pragma GCC diagnostic not allowed inside functions |
---|
462 | :info:build src/lxml/etree.c:86553: error: #pragma GCC diagnostic not allowed inside functions |
---|
463 | :info:build src/lxml/etree.c: In function '__pyx_pf_4lxml_5etree_12_ElementTree_28xpath': |
---|
464 | :info:build src/lxml/etree.c:86935: error: #pragma GCC diagnostic not allowed inside functions |
---|
465 | :info:build src/lxml/etree.c:86936: error: #pragma GCC diagnostic not allowed inside functions |
---|
466 | :info:build src/lxml/etree.c:86938: error: #pragma GCC diagnostic not allowed inside functions |
---|
467 | :info:build src/lxml/etree.c: In function '__pyx_pf_4lxml_5etree_12_ElementTree_30xslt': |
---|
468 | :info:build src/lxml/etree.c:87193: error: #pragma GCC diagnostic not allowed inside functions |
---|
469 | :info:build src/lxml/etree.c:87194: error: #pragma GCC diagnostic not allowed inside functions |
---|
470 | :info:build src/lxml/etree.c:87196: error: #pragma GCC diagnostic not allowed inside functions |
---|
471 | :info:build src/lxml/etree.c: In function '__pyx_pf_4lxml_5etree_12_ElementTree_32relaxng': |
---|
472 | :info:build src/lxml/etree.c:87407: error: #pragma GCC diagnostic not allowed inside functions |
---|
473 | :info:build src/lxml/etree.c:87408: error: #pragma GCC diagnostic not allowed inside functions |
---|
474 | :info:build src/lxml/etree.c:87410: error: #pragma GCC diagnostic not allowed inside functions |
---|
475 | :info:build src/lxml/etree.c: In function '__pyx_pf_4lxml_5etree_12_ElementTree_34xmlschema': |
---|
476 | :info:build src/lxml/etree.c:87607: error: #pragma GCC diagnostic not allowed inside functions |
---|
477 | :info:build src/lxml/etree.c:87608: error: #pragma GCC diagnostic not allowed inside functions |
---|
478 | :info:build src/lxml/etree.c:87610: error: #pragma GCC diagnostic not allowed inside functions |
---|
479 | :info:build src/lxml/etree.c: In function '__pyx_pf_4lxml_5etree_12_ElementTree_36xinclude': |
---|
480 | :info:build src/lxml/etree.c:87751: error: #pragma GCC diagnostic not allowed inside functions |
---|
481 | :info:build src/lxml/etree.c:87752: error: #pragma GCC diagnostic not allowed inside functions |
---|
482 | :info:build src/lxml/etree.c:87754: error: #pragma GCC diagnostic not allowed inside functions |
---|
483 | :info:build src/lxml/etree.c: In function '__pyx_pf_4lxml_5etree_12_ElementTree_38write_c14n': |
---|
484 | :info:build src/lxml/etree.c:87980: error: #pragma GCC diagnostic not allowed inside functions |
---|
485 | :info:build src/lxml/etree.c:87981: error: #pragma GCC diagnostic not allowed inside functions |
---|
486 | :info:build src/lxml/etree.c:87983: error: #pragma GCC diagnostic not allowed inside functions |
---|
487 | :info:build src/lxml/etree.c: In function '__pyx_f_4lxml_5etree__newElementTree': |
---|
488 | :info:build src/lxml/etree.c:88223: error: #pragma GCC diagnostic not allowed inside functions |
---|
489 | :info:build src/lxml/etree.c:88224: error: #pragma GCC diagnostic not allowed inside functions |
---|
490 | :info:build src/lxml/etree.c:88226: error: #pragma GCC diagnostic not allowed inside functions |
---|
491 | :info:build src/lxml/etree.c: In function '__pyx_pf_4lxml_5etree_16_MultiTagMatcher___cinit__': |
---|
492 | :info:build src/lxml/etree.c:92912: error: #pragma GCC diagnostic not allowed inside functions |
---|
493 | :info:build src/lxml/etree.c:92913: error: #pragma GCC diagnostic not allowed inside functions |
---|
494 | :info:build src/lxml/etree.c:92915: error: #pragma GCC diagnostic not allowed inside functions |
---|
495 | :info:build src/lxml/etree.c: In function '__pyx_f_4lxml_5etree_16_MultiTagMatcher_initTagMatch': |
---|
496 | :info:build src/lxml/etree.c:93352: error: #pragma GCC diagnostic not allowed inside functions |
---|
497 | :info:build src/lxml/etree.c:93353: error: #pragma GCC diagnostic not allowed inside functions |
---|
498 | :info:build src/lxml/etree.c:93355: error: #pragma GCC diagnostic not allowed inside functions |
---|
499 | :info:build src/lxml/etree.c: In function '__pyx_f_4lxml_5etree_16_MultiTagMatcher__storeTags': |
---|
500 | :info:build src/lxml/etree.c:93817: error: #pragma GCC diagnostic not allowed inside functions |
---|
501 | :info:build src/lxml/etree.c:93818: error: #pragma GCC diagnostic not allowed inside functions |
---|
502 | :info:build src/lxml/etree.c:93820: error: #pragma GCC diagnostic not allowed inside functions |
---|
503 | :info:build src/lxml/etree.c:93905: error: #pragma GCC diagnostic not allowed inside functions |
---|
504 | :info:build src/lxml/etree.c:93906: error: #pragma GCC diagnostic not allowed inside functions |
---|
505 | :info:build src/lxml/etree.c:93908: error: #pragma GCC diagnostic not allowed inside functions |
---|
506 | :info:build src/lxml/etree.c: In function '__pyx_f_4lxml_5etree_21_ElementMatchIterator__storeNext': |
---|
507 | :info:build src/lxml/etree.c:94701: error: #pragma GCC diagnostic not allowed inside functions |
---|
508 | :info:build src/lxml/etree.c:94702: error: #pragma GCC diagnostic not allowed inside functions |
---|
509 | :info:build src/lxml/etree.c:94704: error: #pragma GCC diagnostic not allowed inside functions |
---|
510 | :info:build src/lxml/etree.c: In function '__pyx_pf_4lxml_5etree_21_ElementMatchIterator_2__next__': |
---|
511 | :info:build src/lxml/etree.c:94888: error: #pragma GCC diagnostic not allowed inside functions |
---|
512 | :info:build src/lxml/etree.c:94889: error: #pragma GCC diagnostic not allowed inside functions |
---|
513 | :info:build src/lxml/etree.c:94891: error: #pragma GCC diagnostic not allowed inside functions |
---|
514 | :info:build src/lxml/etree.c: In function '__pyx_pf_4lxml_5etree_20ElementChildIterator___cinit__': |
---|
515 | :info:build src/lxml/etree.c:95079: error: #pragma GCC diagnostic not allowed inside functions |
---|
516 | :info:build src/lxml/etree.c:95080: error: #pragma GCC diagnostic not allowed inside functions |
---|
517 | :info:build src/lxml/etree.c:95082: error: #pragma GCC diagnostic not allowed inside functions |
---|
518 | :info:build src/lxml/etree.c:95153: error: #pragma GCC diagnostic not allowed inside functions |
---|
519 | :info:build src/lxml/etree.c:95154: error: #pragma GCC diagnostic not allowed inside functions |
---|
520 | :info:build src/lxml/etree.c:95156: error: #pragma GCC diagnostic not allowed inside functions |
---|
521 | :info:build src/lxml/etree.c: In function '__pyx_pf_4lxml_5etree_16SiblingsIterator___cinit__': |
---|
522 | :info:build src/lxml/etree.c:95384: error: #pragma GCC diagnostic not allowed inside functions |
---|
523 | :info:build src/lxml/etree.c:95385: error: #pragma GCC diagnostic not allowed inside functions |
---|
524 | :info:build src/lxml/etree.c:95387: error: #pragma GCC diagnostic not allowed inside functions |
---|
525 | :info:build src/lxml/etree.c:95438: error: #pragma GCC diagnostic not allowed inside functions |
---|
526 | :info:build src/lxml/etree.c:95439: error: #pragma GCC diagnostic not allowed inside functions |
---|
527 | :info:build src/lxml/etree.c:95441: error: #pragma GCC diagnostic not allowed inside functions |
---|
528 | :info:build src/lxml/etree.c: In function '__pyx_pf_4lxml_5etree_17AncestorsIterator___cinit__': |
---|
529 | :info:build src/lxml/etree.c:95597: error: #pragma GCC diagnostic not allowed inside functions |
---|
530 | :info:build src/lxml/etree.c:95598: error: #pragma GCC diagnostic not allowed inside functions |
---|
531 | :info:build src/lxml/etree.c:95600: error: #pragma GCC diagnostic not allowed inside functions |
---|
532 | :info:build src/lxml/etree.c:95620: error: #pragma GCC diagnostic not allowed inside functions |
---|
533 | :info:build src/lxml/etree.c:95621: error: #pragma GCC diagnostic not allowed inside functions |
---|
534 | :info:build src/lxml/etree.c:95623: error: #pragma GCC diagnostic not allowed inside functions |
---|
535 | :info:build src/lxml/etree.c: In function '__pyx_pf_4lxml_5etree_25ElementDepthFirstIterator___cinit__': |
---|
536 | :info:build src/lxml/etree.c:95843: error: #pragma GCC diagnostic not allowed inside functions |
---|
537 | :info:build src/lxml/etree.c:95844: error: #pragma GCC diagnostic not allowed inside functions |
---|
538 | :info:build src/lxml/etree.c:95846: error: #pragma GCC diagnostic not allowed inside functions |
---|
539 | :info:build src/lxml/etree.c: In function '__pyx_pf_4lxml_5etree_25ElementDepthFirstIterator_4__next__': |
---|
540 | :info:build src/lxml/etree.c:96062: error: #pragma GCC diagnostic not allowed inside functions |
---|
541 | :info:build src/lxml/etree.c:96063: error: #pragma GCC diagnostic not allowed inside functions |
---|
542 | :info:build src/lxml/etree.c:96065: error: #pragma GCC diagnostic not allowed inside functions |
---|
543 | :info:build src/lxml/etree.c: In function '__pyx_pf_4lxml_5etree_18HTML': |
---|
544 | :info:build src/lxml/etree.c:99352: error: #pragma GCC diagnostic not allowed inside functions |
---|
545 | :info:build src/lxml/etree.c:99353: error: #pragma GCC diagnostic not allowed inside functions |
---|
546 | :info:build src/lxml/etree.c:99355: error: #pragma GCC diagnostic not allowed inside functions |
---|
547 | :info:build src/lxml/etree.c:99435: error: #pragma GCC diagnostic not allowed inside functions |
---|
548 | :info:build src/lxml/etree.c:99436: error: #pragma GCC diagnostic not allowed inside functions |
---|
549 | :info:build src/lxml/etree.c:99438: error: #pragma GCC diagnostic not allowed inside functions |
---|
550 | :info:build src/lxml/etree.c: In function '__pyx_pf_4lxml_5etree_20XML': |
---|
551 | :info:build src/lxml/etree.c:99782: error: #pragma GCC diagnostic not allowed inside functions |
---|
552 | :info:build src/lxml/etree.c:99783: error: #pragma GCC diagnostic not allowed inside functions |
---|
553 | :info:build src/lxml/etree.c:99785: error: #pragma GCC diagnostic not allowed inside functions |
---|
554 | :info:build src/lxml/etree.c:99865: error: #pragma GCC diagnostic not allowed inside functions |
---|
555 | :info:build src/lxml/etree.c:99866: error: #pragma GCC diagnostic not allowed inside functions |
---|
556 | :info:build src/lxml/etree.c:99868: error: #pragma GCC diagnostic not allowed inside functions |
---|
557 | :info:build src/lxml/etree.c: In function '__pyx_pf_4lxml_5etree_22fromstring': |
---|
558 | :info:build src/lxml/etree.c:100228: error: #pragma GCC diagnostic not allowed inside functions |
---|
559 | :info:build src/lxml/etree.c:100229: error: #pragma GCC diagnostic not allowed inside functions |
---|
560 | :info:build src/lxml/etree.c:100231: error: #pragma GCC diagnostic not allowed inside functions |
---|
561 | :info:build src/lxml/etree.c: In function '__pyx_pf_4lxml_5etree_24fromstringlist': |
---|
562 | :info:build src/lxml/etree.c:100596: error: #pragma GCC diagnostic not allowed inside functions |
---|
563 | :info:build src/lxml/etree.c:100597: error: #pragma GCC diagnostic not allowed inside functions |
---|
564 | :info:build src/lxml/etree.c:100599: error: #pragma GCC diagnostic not allowed inside functions |
---|
565 | :info:build src/lxml/etree.c: In function '__pyx_f_4lxml_5etree_14_ReadOnlyProxy___copy__': |
---|
566 | :info:build src/lxml/etree.c:106004: error: #pragma GCC diagnostic not allowed inside functions |
---|
567 | :info:build src/lxml/etree.c:106005: error: #pragma GCC diagnostic not allowed inside functions |
---|
568 | :info:build src/lxml/etree.c:106007: error: #pragma GCC diagnostic not allowed inside functions |
---|
569 | :info:build src/lxml/etree.c: In function '__pyx_f_4lxml_5etree_22_OpaqueDocumentWrapper_append': |
---|
570 | :info:build src/lxml/etree.c:109154: error: #pragma GCC diagnostic not allowed inside functions |
---|
571 | :info:build src/lxml/etree.c:109155: error: #pragma GCC diagnostic not allowed inside functions |
---|
572 | :info:build src/lxml/etree.c:109157: error: #pragma GCC diagnostic not allowed inside functions |
---|
573 | :info:build src/lxml/etree.c: In function '__pyx_pf_4lxml_5etree_22_OpaqueDocumentWrapper_2extend': |
---|
574 | :info:build src/lxml/etree.c:109572: error: #pragma GCC diagnostic not allowed inside functions |
---|
575 | :info:build src/lxml/etree.c:109573: error: #pragma GCC diagnostic not allowed inside functions |
---|
576 | :info:build src/lxml/etree.c:109575: error: #pragma GCC diagnostic not allowed inside functions |
---|
577 | :info:build src/lxml/etree.c:109646: error: #pragma GCC diagnostic not allowed inside functions |
---|
578 | :info:build src/lxml/etree.c:109647: error: #pragma GCC diagnostic not allowed inside functions |
---|
579 | :info:build src/lxml/etree.c:109649: error: #pragma GCC diagnostic not allowed inside functions |
---|
580 | :info:build src/lxml/etree.c: In function '__pyx_pf_4lxml_5etree_23_AppendOnlyElementProxy_2extend': |
---|
581 | :info:build src/lxml/etree.c:110838: error: #pragma GCC diagnostic not allowed inside functions |
---|
582 | :info:build src/lxml/etree.c:110839: error: #pragma GCC diagnostic not allowed inside functions |
---|
583 | :info:build src/lxml/etree.c:110841: error: #pragma GCC diagnostic not allowed inside functions |
---|
584 | :info:build src/lxml/etree.c: In function '__pyx_pf_4lxml_5etree_17_ResolverRegistry_6copy': |
---|
585 | :info:build src/lxml/etree.c:123392: error: #pragma GCC diagnostic not allowed inside functions |
---|
586 | :info:build src/lxml/etree.c:123393: error: #pragma GCC diagnostic not allowed inside functions |
---|
587 | :info:build src/lxml/etree.c:123395: error: #pragma GCC diagnostic not allowed inside functions |
---|
588 | :info:build src/lxml/etree.c: In function '__pyx_f_4lxml_5etree_16_ResolverContext_clear': |
---|
589 | :info:build src/lxml/etree.c:123902: error: #pragma GCC diagnostic not allowed inside functions |
---|
590 | :info:build src/lxml/etree.c:123903: error: #pragma GCC diagnostic not allowed inside functions |
---|
591 | :info:build src/lxml/etree.c:123905: error: #pragma GCC diagnostic not allowed inside functions |
---|
592 | :info:build src/lxml/etree.c: In function '__pyx_f_4lxml_5etree_24_ParserDictionaryContext_setDefaultParser': |
---|
593 | :info:build src/lxml/etree.c:125142: error: #pragma GCC diagnostic not allowed inside functions |
---|
594 | :info:build src/lxml/etree.c:125143: error: #pragma GCC diagnostic not allowed inside functions |
---|
595 | :info:build src/lxml/etree.c:125145: error: #pragma GCC diagnostic not allowed inside functions |
---|
596 | :info:build src/lxml/etree.c: In function '__pyx_f_4lxml_5etree_24_ParserDictionaryContext_getDefaultParser': |
---|
597 | :info:build src/lxml/etree.c:125210: error: #pragma GCC diagnostic not allowed inside functions |
---|
598 | :info:build src/lxml/etree.c:125211: error: #pragma GCC diagnostic not allowed inside functions |
---|
599 | :info:build src/lxml/etree.c:125213: error: #pragma GCC diagnostic not allowed inside functions |
---|
600 | :info:build src/lxml/etree.c: In function '__pyx_f_4lxml_5etree_24_ParserDictionaryContext__getThreadDict': |
---|
601 | :info:build src/lxml/etree.c:125363: error: #pragma GCC diagnostic not allowed inside functions |
---|
602 | :info:build src/lxml/etree.c:125364: error: #pragma GCC diagnostic not allowed inside functions |
---|
603 | :info:build src/lxml/etree.c:125366: error: #pragma GCC diagnostic not allowed inside functions |
---|
604 | :info:build src/lxml/etree.c: In function '__pyx_f_4lxml_5etree_24_ParserDictionaryContext_initThreadDictRef': |
---|
605 | :info:build src/lxml/etree.c:125556: error: #pragma GCC diagnostic not allowed inside functions |
---|
606 | :info:build src/lxml/etree.c:125557: error: #pragma GCC diagnostic not allowed inside functions |
---|
607 | :info:build src/lxml/etree.c:125559: error: #pragma GCC diagnostic not allowed inside functions |
---|
608 | :info:build src/lxml/etree.c: In function '__pyx_f_4lxml_5etree_24_ParserDictionaryContext_initParserDict': |
---|
609 | :info:build src/lxml/etree.c:125677: error: #pragma GCC diagnostic not allowed inside functions |
---|
610 | :info:build src/lxml/etree.c:125678: error: #pragma GCC diagnostic not allowed inside functions |
---|
611 | :info:build src/lxml/etree.c:125680: error: #pragma GCC diagnostic not allowed inside functions |
---|
612 | :info:build src/lxml/etree.c: In function '__pyx_f_4lxml_5etree_24_ParserDictionaryContext_initXPathParserDict': |
---|
613 | :info:build src/lxml/etree.c:125731: error: #pragma GCC diagnostic not allowed inside functions |
---|
614 | :info:build src/lxml/etree.c:125732: error: #pragma GCC diagnostic not allowed inside functions |
---|
615 | :info:build src/lxml/etree.c:125734: error: #pragma GCC diagnostic not allowed inside functions |
---|
616 | :info:build src/lxml/etree.c: In function '__pyx_f_4lxml_5etree_24_ParserDictionaryContext_initDocDict': |
---|
617 | :info:build src/lxml/etree.c:125776: error: #pragma GCC diagnostic not allowed inside functions |
---|
618 | :info:build src/lxml/etree.c:125777: error: #pragma GCC diagnostic not allowed inside functions |
---|
619 | :info:build src/lxml/etree.c:125779: error: #pragma GCC diagnostic not allowed inside functions |
---|
620 | :info:build src/lxml/etree.c: In function '__pyx_f_4lxml_5etree_24_ParserDictionaryContext_findImpliedContext': |
---|
621 | :info:build src/lxml/etree.c:125826: error: #pragma GCC diagnostic not allowed inside functions |
---|
622 | :info:build src/lxml/etree.c:125827: error: #pragma GCC diagnostic not allowed inside functions |
---|
623 | :info:build src/lxml/etree.c:125829: error: #pragma GCC diagnostic not allowed inside functions |
---|
624 | :info:build src/lxml/etree.c: In function '__pyx_f_4lxml_5etree_24_ParserDictionaryContext_pushImpliedContextFromParser': |
---|
625 | :info:build src/lxml/etree.c:125952: error: #pragma GCC diagnostic not allowed inside functions |
---|
626 | :info:build src/lxml/etree.c:125953: error: #pragma GCC diagnostic not allowed inside functions |
---|
627 | :info:build src/lxml/etree.c:125955: error: #pragma GCC diagnostic not allowed inside functions |
---|
628 | :info:build src/lxml/etree.c:125976: error: #pragma GCC diagnostic not allowed inside functions |
---|
629 | :info:build src/lxml/etree.c:125977: error: #pragma GCC diagnostic not allowed inside functions |
---|
630 | :info:build src/lxml/etree.c:125979: error: #pragma GCC diagnostic not allowed inside functions |
---|
631 | :info:build src/lxml/etree.c: In function '__pyx_f_4lxml_5etree_24_ParserDictionaryContext_pushImpliedContext': |
---|
632 | :info:build src/lxml/etree.c:126029: error: #pragma GCC diagnostic not allowed inside functions |
---|
633 | :info:build src/lxml/etree.c:126030: error: #pragma GCC diagnostic not allowed inside functions |
---|
634 | :info:build src/lxml/etree.c:126032: error: #pragma GCC diagnostic not allowed inside functions |
---|
635 | :info:build src/lxml/etree.c: In function '__pyx_f_4lxml_5etree_24_ParserDictionaryContext_popImpliedContext': |
---|
636 | :info:build src/lxml/etree.c:126096: error: #pragma GCC diagnostic not allowed inside functions |
---|
637 | :info:build src/lxml/etree.c:126097: error: #pragma GCC diagnostic not allowed inside functions |
---|
638 | :info:build src/lxml/etree.c:126099: error: #pragma GCC diagnostic not allowed inside functions |
---|
639 | :info:build src/lxml/etree.c: In function '__pyx_f_4lxml_5etree_18_FileReaderContext__readDoc': |
---|
640 | :info:build src/lxml/etree.c:128205: error: #pragma GCC diagnostic not allowed inside functions |
---|
641 | :info:build src/lxml/etree.c:128206: error: #pragma GCC diagnostic not allowed inside functions |
---|
642 | :info:build src/lxml/etree.c:128208: error: #pragma GCC diagnostic not allowed inside functions |
---|
643 | :info:build src/lxml/etree.c: In function '__pyx_f_4lxml_5etree_18_FileReaderContext_copyToBuffer': |
---|
644 | :info:build src/lxml/etree.c:128672: error: #pragma GCC diagnostic not allowed inside functions |
---|
645 | :info:build src/lxml/etree.c:128673: error: #pragma GCC diagnostic not allowed inside functions |
---|
646 | :info:build src/lxml/etree.c:128675: error: #pragma GCC diagnostic not allowed inside functions |
---|
647 | :info:build src/lxml/etree.c:128738: error: #pragma GCC diagnostic not allowed inside functions |
---|
648 | :info:build src/lxml/etree.c:128739: error: #pragma GCC diagnostic not allowed inside functions |
---|
649 | :info:build src/lxml/etree.c:128741: error: #pragma GCC diagnostic not allowed inside functions |
---|
650 | :info:build src/lxml/etree.c:128905: error: #pragma GCC diagnostic not allowed inside functions |
---|
651 | :info:build src/lxml/etree.c:128906: error: #pragma GCC diagnostic not allowed inside functions |
---|
652 | :info:build src/lxml/etree.c:128908: error: #pragma GCC diagnostic not allowed inside functions |
---|
653 | :info:build src/lxml/etree.c: In function '__pyx_f_4lxml_5etree__local_resolver': |
---|
654 | :info:build src/lxml/etree.c:129229: error: #pragma GCC diagnostic not allowed inside functions |
---|
655 | :info:build src/lxml/etree.c:129230: error: #pragma GCC diagnostic not allowed inside functions |
---|
656 | :info:build src/lxml/etree.c:129232: error: #pragma GCC diagnostic not allowed inside functions |
---|
657 | :info:build src/lxml/etree.c:130006: error: #pragma GCC diagnostic not allowed inside functions |
---|
658 | :info:build src/lxml/etree.c:130007: error: #pragma GCC diagnostic not allowed inside functions |
---|
659 | :info:build src/lxml/etree.c:130009: error: #pragma GCC diagnostic not allowed inside functions |
---|
660 | :info:build src/lxml/etree.c: In function '__pyx_f_4lxml_5etree_14_ParserContext__copy': |
---|
661 | :info:build src/lxml/etree.c:130609: error: #pragma GCC diagnostic not allowed inside functions |
---|
662 | :info:build src/lxml/etree.c:130610: error: #pragma GCC diagnostic not allowed inside functions |
---|
663 | :info:build src/lxml/etree.c:130612: error: #pragma GCC diagnostic not allowed inside functions |
---|
664 | :info:build src/lxml/etree.c:130627: error: #pragma GCC diagnostic not allowed inside functions |
---|
665 | :info:build src/lxml/etree.c:130628: error: #pragma GCC diagnostic not allowed inside functions |
---|
666 | :info:build src/lxml/etree.c:130630: error: #pragma GCC diagnostic not allowed inside functions |
---|
667 | :info:build src/lxml/etree.c: In function '__pyx_f_4lxml_5etree_14_ParserContext_prepare': |
---|
668 | :info:build src/lxml/etree.c:131003: error: #pragma GCC diagnostic not allowed inside functions |
---|
669 | :info:build src/lxml/etree.c:131004: error: #pragma GCC diagnostic not allowed inside functions |
---|
670 | :info:build src/lxml/etree.c:131006: error: #pragma GCC diagnostic not allowed inside functions |
---|
671 | :info:build src/lxml/etree.c: In function '__pyx_f_4lxml_5etree__forwardParserError': |
---|
672 | :info:build src/lxml/etree.c:131573: error: #pragma GCC diagnostic not allowed inside functions |
---|
673 | :info:build src/lxml/etree.c:131574: error: #pragma GCC diagnostic not allowed inside functions |
---|
674 | :info:build src/lxml/etree.c:131576: error: #pragma GCC diagnostic not allowed inside functions |
---|
675 | :info:build src/lxml/etree.c: In function '__pyx_f_4lxml_5etree__raiseParseError': |
---|
676 | :info:build src/lxml/etree.c:132056: error: #pragma GCC diagnostic not allowed inside functions |
---|
677 | :info:build src/lxml/etree.c:132057: error: #pragma GCC diagnostic not allowed inside functions |
---|
678 | :info:build src/lxml/etree.c:132059: error: #pragma GCC diagnostic not allowed inside functions |
---|
679 | :info:build src/lxml/etree.c: In function '__pyx_f_4lxml_5etree__handleParseResult': |
---|
680 | :info:build src/lxml/etree.c:132380: error: #pragma GCC diagnostic not allowed inside functions |
---|
681 | :info:build src/lxml/etree.c:132381: error: #pragma GCC diagnostic not allowed inside functions |
---|
682 | :info:build src/lxml/etree.c:132383: error: #pragma GCC diagnostic not allowed inside functions |
---|
683 | :info:build src/lxml/etree.c:132421: error: #pragma GCC diagnostic not allowed inside functions |
---|
684 | :info:build src/lxml/etree.c:132422: error: #pragma GCC diagnostic not allowed inside functions |
---|
685 | :info:build src/lxml/etree.c:132424: error: #pragma GCC diagnostic not allowed inside functions |
---|
686 | :info:build src/lxml/etree.c: In function '__pyx_f_4lxml_5etree_11_BaseParser__getParserContext': |
---|
687 | :info:build src/lxml/etree.c:134788: error: #pragma GCC diagnostic not allowed inside functions |
---|
688 | :info:build src/lxml/etree.c:134789: error: #pragma GCC diagnostic not allowed inside functions |
---|
689 | :info:build src/lxml/etree.c:134791: error: #pragma GCC diagnostic not allowed inside functions |
---|
690 | :info:build src/lxml/etree.c: In function '__pyx_f_4lxml_5etree_11_BaseParser__getPushParserContext': |
---|
691 | :info:build src/lxml/etree.c:134991: error: #pragma GCC diagnostic not allowed inside functions |
---|
692 | :info:build src/lxml/etree.c:134992: error: #pragma GCC diagnostic not allowed inside functions |
---|
693 | :info:build src/lxml/etree.c:134994: error: #pragma GCC diagnostic not allowed inside functions |
---|
694 | :info:build src/lxml/etree.c: In function '__pyx_f_4lxml_5etree_11_BaseParser__createContext': |
---|
695 | :info:build src/lxml/etree.c:135092: error: #pragma GCC diagnostic not allowed inside functions |
---|
696 | :info:build src/lxml/etree.c:135093: error: #pragma GCC diagnostic not allowed inside functions |
---|
697 | :info:build src/lxml/etree.c:135095: error: #pragma GCC diagnostic not allowed inside functions |
---|
698 | :info:build src/lxml/etree.c: In function '__pyx_f_4lxml_5etree_11_BaseParser__parseUnicodeDoc': |
---|
699 | :info:build src/lxml/etree.c:137262: error: #pragma GCC diagnostic not allowed inside functions |
---|
700 | :info:build src/lxml/etree.c:137263: error: #pragma GCC diagnostic not allowed inside functions |
---|
701 | :info:build src/lxml/etree.c:137265: error: #pragma GCC diagnostic not allowed inside functions |
---|
702 | :info:build src/lxml/etree.c: In function '__pyx_f_4lxml_5etree_11_BaseParser__parseDoc': |
---|
703 | :info:build src/lxml/etree.c:137603: error: #pragma GCC diagnostic not allowed inside functions |
---|
704 | :info:build src/lxml/etree.c:137604: error: #pragma GCC diagnostic not allowed inside functions |
---|
705 | :info:build src/lxml/etree.c:137606: error: #pragma GCC diagnostic not allowed inside functions |
---|
706 | :info:build src/lxml/etree.c: In function '__pyx_f_4lxml_5etree_11_BaseParser__parseDocFromFile': |
---|
707 | :info:build src/lxml/etree.c:138232: error: #pragma GCC diagnostic not allowed inside functions |
---|
708 | :info:build src/lxml/etree.c:138233: error: #pragma GCC diagnostic not allowed inside functions |
---|
709 | :info:build src/lxml/etree.c:138235: error: #pragma GCC diagnostic not allowed inside functions |
---|
710 | :info:build src/lxml/etree.c: In function '__pyx_f_4lxml_5etree_11_BaseParser__parseDocFromFilelike': |
---|
711 | :info:build src/lxml/etree.c:138648: error: #pragma GCC diagnostic not allowed inside functions |
---|
712 | :info:build src/lxml/etree.c:138649: error: #pragma GCC diagnostic not allowed inside functions |
---|
713 | :info:build src/lxml/etree.c:138651: error: #pragma GCC diagnostic not allowed inside functions |
---|
714 | :info:build src/lxml/etree.c: In function '__pyx_f_4lxml_5etree_11_FeedParser_feed': |
---|
715 | :info:build src/lxml/etree.c:140151: error: #pragma GCC diagnostic not allowed inside functions |
---|
716 | :info:build src/lxml/etree.c:140152: error: #pragma GCC diagnostic not allowed inside functions |
---|
717 | :info:build src/lxml/etree.c:140154: error: #pragma GCC diagnostic not allowed inside functions |
---|
718 | :info:build src/lxml/etree.c: In function '__pyx_f_4lxml_5etree_11_FeedParser_close': |
---|
719 | :info:build src/lxml/etree.c:141390: error: #pragma GCC diagnostic not allowed inside functions |
---|
720 | :info:build src/lxml/etree.c:141391: error: #pragma GCC diagnostic not allowed inside functions |
---|
721 | :info:build src/lxml/etree.c:141393: error: #pragma GCC diagnostic not allowed inside functions |
---|
722 | :info:build src/lxml/etree.c: In function '__pyx_pf_4lxml_5etree_46set_default_parser': |
---|
723 | :info:build src/lxml/etree.c:143395: error: #pragma GCC diagnostic not allowed inside functions |
---|
724 | :info:build src/lxml/etree.c:143396: error: #pragma GCC diagnostic not allowed inside functions |
---|
725 | :info:build src/lxml/etree.c:143398: error: #pragma GCC diagnostic not allowed inside functions |
---|
726 | :info:build src/lxml/etree.c: In function '__pyx_pf_4lxml_5etree_48get_default_parser': |
---|
727 | :info:build src/lxml/etree.c:143463: error: #pragma GCC diagnostic not allowed inside functions |
---|
728 | :info:build src/lxml/etree.c:143464: error: #pragma GCC diagnostic not allowed inside functions |
---|
729 | :info:build src/lxml/etree.c:143466: error: #pragma GCC diagnostic not allowed inside functions |
---|
730 | :info:build src/lxml/etree.c: In function '__pyx_f_4lxml_5etree__parseDoc': |
---|
731 | :info:build src/lxml/etree.c:144278: error: #pragma GCC diagnostic not allowed inside functions |
---|
732 | :info:build src/lxml/etree.c:144279: error: #pragma GCC diagnostic not allowed inside functions |
---|
733 | :info:build src/lxml/etree.c:144281: error: #pragma GCC diagnostic not allowed inside functions |
---|
734 | :info:build src/lxml/etree.c: In function '__pyx_f_4lxml_5etree__parseDocFromFile': |
---|
735 | :info:build src/lxml/etree.c:144634: error: #pragma GCC diagnostic not allowed inside functions |
---|
736 | :info:build src/lxml/etree.c:144635: error: #pragma GCC diagnostic not allowed inside functions |
---|
737 | :info:build src/lxml/etree.c:144637: error: #pragma GCC diagnostic not allowed inside functions |
---|
738 | :info:build src/lxml/etree.c: In function '__pyx_f_4lxml_5etree__parseDocFromFilelike': |
---|
739 | :info:build src/lxml/etree.c:144718: error: #pragma GCC diagnostic not allowed inside functions |
---|
740 | :info:build src/lxml/etree.c:144719: error: #pragma GCC diagnostic not allowed inside functions |
---|
741 | :info:build src/lxml/etree.c:144721: error: #pragma GCC diagnostic not allowed inside functions |
---|
742 | :info:build src/lxml/etree.c: In function '__pyx_f_4lxml_5etree__newXMLDoc': |
---|
743 | :info:build src/lxml/etree.c:144854: error: #pragma GCC diagnostic not allowed inside functions |
---|
744 | :info:build src/lxml/etree.c:144855: error: #pragma GCC diagnostic not allowed inside functions |
---|
745 | :info:build src/lxml/etree.c:144857: error: #pragma GCC diagnostic not allowed inside functions |
---|
746 | :info:build src/lxml/etree.c: In function '__pyx_f_4lxml_5etree__newHTMLDoc': |
---|
747 | :info:build src/lxml/etree.c:144946: error: #pragma GCC diagnostic not allowed inside functions |
---|
748 | :info:build src/lxml/etree.c:144947: error: #pragma GCC diagnostic not allowed inside functions |
---|
749 | :info:build src/lxml/etree.c:144949: error: #pragma GCC diagnostic not allowed inside functions |
---|
750 | :info:build src/lxml/etree.c: In function '__pyx_f_4lxml_5etree__copyDoc': |
---|
751 | :info:build src/lxml/etree.c:145106: error: #pragma GCC diagnostic not allowed inside functions |
---|
752 | :info:build src/lxml/etree.c:145107: error: #pragma GCC diagnostic not allowed inside functions |
---|
753 | :info:build src/lxml/etree.c:145109: error: #pragma GCC diagnostic not allowed inside functions |
---|
754 | :info:build src/lxml/etree.c: In function '__pyx_f_4lxml_5etree__copyDocRoot': |
---|
755 | :info:build src/lxml/etree.c:145171: error: #pragma GCC diagnostic not allowed inside functions |
---|
756 | :info:build src/lxml/etree.c:145172: error: #pragma GCC diagnostic not allowed inside functions |
---|
757 | :info:build src/lxml/etree.c:145174: error: #pragma GCC diagnostic not allowed inside functions |
---|
758 | :info:build src/lxml/etree.c: In function '__pyx_f_4lxml_5etree_17_SaxParserContext_startDocument': |
---|
759 | :info:build src/lxml/etree.c:148250: error: #pragma GCC diagnostic not allowed inside functions |
---|
760 | :info:build src/lxml/etree.c:148251: error: #pragma GCC diagnostic not allowed inside functions |
---|
761 | :info:build src/lxml/etree.c:148253: error: #pragma GCC diagnostic not allowed inside functions |
---|
762 | :info:build src/lxml/etree.c: In function '__pyx_f_4lxml_5etree_17_SaxParserContext_pushEvent': |
---|
763 | :info:build src/lxml/etree.c:148334: error: #pragma GCC diagnostic not allowed inside functions |
---|
764 | :info:build src/lxml/etree.c:148335: error: #pragma GCC diagnostic not allowed inside functions |
---|
765 | :info:build src/lxml/etree.c:148337: error: #pragma GCC diagnostic not allowed inside functions |
---|
766 | :info:build src/lxml/etree.c: In function '__pyx_f_4lxml_5etree_11TreeBuilder__handleSaxStart': |
---|
767 | :info:build src/lxml/etree.c:155494: error: #pragma GCC diagnostic not allowed inside functions |
---|
768 | :info:build src/lxml/etree.c:155495: error: #pragma GCC diagnostic not allowed inside functions |
---|
769 | :info:build src/lxml/etree.c:155497: error: #pragma GCC diagnostic not allowed inside functions |
---|
770 | :info:build src/lxml/etree.c: In function '__pyx_f_4lxml_5etree_11TreeBuilder__handleSaxEnd': |
---|
771 | :info:build src/lxml/etree.c:155768: error: #pragma GCC diagnostic not allowed inside functions |
---|
772 | :info:build src/lxml/etree.c:155769: error: #pragma GCC diagnostic not allowed inside functions |
---|
773 | :info:build src/lxml/etree.c:155771: error: #pragma GCC diagnostic not allowed inside functions |
---|
774 | :info:build src/lxml/etree.c: In function '__pyx_f_4lxml_5etree_11TreeBuilder__handleSaxPi': |
---|
775 | :info:build src/lxml/etree.c:155969: error: #pragma GCC diagnostic not allowed inside functions |
---|
776 | :info:build src/lxml/etree.c:155970: error: #pragma GCC diagnostic not allowed inside functions |
---|
777 | :info:build src/lxml/etree.c:155972: error: #pragma GCC diagnostic not allowed inside functions |
---|
778 | :info:build src/lxml/etree.c: In function '__pyx_f_4lxml_5etree_11TreeBuilder__handleSaxComment': |
---|
779 | :info:build src/lxml/etree.c:156152: error: #pragma GCC diagnostic not allowed inside functions |
---|
780 | :info:build src/lxml/etree.c:156153: error: #pragma GCC diagnostic not allowed inside functions |
---|
781 | :info:build src/lxml/etree.c:156155: error: #pragma GCC diagnostic not allowed inside functions |
---|
782 | :info:build src/lxml/etree.c: In function '__pyx_pf_4lxml_5etree_11TreeBuilder_4data': |
---|
783 | :info:build src/lxml/etree.c:156589: error: #pragma GCC diagnostic not allowed inside functions |
---|
784 | :info:build src/lxml/etree.c:156590: error: #pragma GCC diagnostic not allowed inside functions |
---|
785 | :info:build src/lxml/etree.c:156592: error: #pragma GCC diagnostic not allowed inside functions |
---|
786 | :info:build src/lxml/etree.c: In function '__pyx_pf_4lxml_5etree_11TreeBuilder_6start': |
---|
787 | :info:build src/lxml/etree.c:156798: error: #pragma GCC diagnostic not allowed inside functions |
---|
788 | :info:build src/lxml/etree.c:156799: error: #pragma GCC diagnostic not allowed inside functions |
---|
789 | :info:build src/lxml/etree.c:156801: error: #pragma GCC diagnostic not allowed inside functions |
---|
790 | :info:build src/lxml/etree.c: In function '__pyx_pf_4lxml_5etree_11TreeBuilder_8end': |
---|
791 | :info:build src/lxml/etree.c:156954: error: #pragma GCC diagnostic not allowed inside functions |
---|
792 | :info:build src/lxml/etree.c:156955: error: #pragma GCC diagnostic not allowed inside functions |
---|
793 | :info:build src/lxml/etree.c:156957: error: #pragma GCC diagnostic not allowed inside functions |
---|
794 | :info:build src/lxml/etree.c: In function '__pyx_pf_4lxml_5etree_11TreeBuilder_10pi': |
---|
795 | :info:build src/lxml/etree.c:157203: error: #pragma GCC diagnostic not allowed inside functions |
---|
796 | :info:build src/lxml/etree.c:157204: error: #pragma GCC diagnostic not allowed inside functions |
---|
797 | :info:build src/lxml/etree.c:157206: error: #pragma GCC diagnostic not allowed inside functions |
---|
798 | :info:build src/lxml/etree.c: In function '__pyx_pf_4lxml_5etree_11TreeBuilder_12comment': |
---|
799 | :info:build src/lxml/etree.c:157351: error: #pragma GCC diagnostic not allowed inside functions |
---|
800 | :info:build src/lxml/etree.c:157352: error: #pragma GCC diagnostic not allowed inside functions |
---|
801 | :info:build src/lxml/etree.c:157354: error: #pragma GCC diagnostic not allowed inside functions |
---|
802 | :info:build src/lxml/etree.c: In function '__pyx_f_4lxml_5etree_20_TargetParserContext__copy': |
---|
803 | :info:build src/lxml/etree.c:159556: error: #pragma GCC diagnostic not allowed inside functions |
---|
804 | :info:build src/lxml/etree.c:159557: error: #pragma GCC diagnostic not allowed inside functions |
---|
805 | :info:build src/lxml/etree.c:159559: error: #pragma GCC diagnostic not allowed inside functions |
---|
806 | :info:build src/lxml/etree.c: In function '__pyx_f_4lxml_5etree__create_output_buffer': |
---|
807 | :info:build src/lxml/etree.c:169249: error: #pragma GCC diagnostic not allowed inside functions |
---|
808 | :info:build src/lxml/etree.c:169250: error: #pragma GCC diagnostic not allowed inside functions |
---|
809 | :info:build src/lxml/etree.c:169252: error: #pragma GCC diagnostic not allowed inside functions |
---|
810 | :info:build src/lxml/etree.c: In function '__pyx_f_4lxml_5etree__tofilelikeC14N': |
---|
811 | :info:build src/lxml/etree.c:170068: error: #pragma GCC diagnostic not allowed inside functions |
---|
812 | :info:build src/lxml/etree.c:170069: error: #pragma GCC diagnostic not allowed inside functions |
---|
813 | :info:build src/lxml/etree.c:170071: error: #pragma GCC diagnostic not allowed inside functions |
---|
814 | :info:build src/lxml/etree.c:170093: error: #pragma GCC diagnostic not allowed inside functions |
---|
815 | :info:build src/lxml/etree.c:170094: error: #pragma GCC diagnostic not allowed inside functions |
---|
816 | :info:build src/lxml/etree.c:170096: error: #pragma GCC diagnostic not allowed inside functions |
---|
817 | :info:build src/lxml/etree.c: In function '__pyx_pf_4lxml_5etree_7xmlfile_4__exit__': |
---|
818 | :info:build src/lxml/etree.c:179894: error: #pragma GCC diagnostic not allowed inside functions |
---|
819 | :info:build src/lxml/etree.c:179895: error: #pragma GCC diagnostic not allowed inside functions |
---|
820 | :info:build src/lxml/etree.c:179897: error: #pragma GCC diagnostic not allowed inside functions |
---|
821 | :info:build src/lxml/etree.c: In function '__pyx_pf_4lxml_5etree_22_IncrementalFileWriter_4write_declaration': |
---|
822 | :info:build src/lxml/etree.c:181588: error: #pragma GCC diagnostic not allowed inside functions |
---|
823 | :info:build src/lxml/etree.c:181589: error: #pragma GCC diagnostic not allowed inside functions |
---|
824 | :info:build src/lxml/etree.c:181591: error: #pragma GCC diagnostic not allowed inside functions |
---|
825 | :info:build src/lxml/etree.c: In function '__pyx_pf_4lxml_5etree_22_IncrementalFileWriter_6write_doctype': |
---|
826 | :info:build src/lxml/etree.c:181907: error: #pragma GCC diagnostic not allowed inside functions |
---|
827 | :info:build src/lxml/etree.c:181908: error: #pragma GCC diagnostic not allowed inside functions |
---|
828 | :info:build src/lxml/etree.c:181910: error: #pragma GCC diagnostic not allowed inside functions |
---|
829 | :info:build src/lxml/etree.c: In function '__pyx_f_4lxml_5etree_22_IncrementalFileWriter__write_start_element': |
---|
830 | :info:build src/lxml/etree.c:183174: error: #pragma GCC diagnostic not allowed inside functions |
---|
831 | :info:build src/lxml/etree.c:183175: error: #pragma GCC diagnostic not allowed inside functions |
---|
832 | :info:build src/lxml/etree.c:183177: error: #pragma GCC diagnostic not allowed inside functions |
---|
833 | :info:build src/lxml/etree.c:183240: error: #pragma GCC diagnostic not allowed inside functions |
---|
834 | :info:build src/lxml/etree.c:183241: error: #pragma GCC diagnostic not allowed inside functions |
---|
835 | :info:build src/lxml/etree.c:183243: error: #pragma GCC diagnostic not allowed inside functions |
---|
836 | :info:build src/lxml/etree.c:183266: error: #pragma GCC diagnostic not allowed inside functions |
---|
837 | :info:build src/lxml/etree.c:183267: error: #pragma GCC diagnostic not allowed inside functions |
---|
838 | :info:build src/lxml/etree.c:183269: error: #pragma GCC diagnostic not allowed inside functions |
---|
839 | :info:build src/lxml/etree.c:183291: error: #pragma GCC diagnostic not allowed inside functions |
---|
840 | :info:build src/lxml/etree.c:183292: error: #pragma GCC diagnostic not allowed inside functions |
---|
841 | :info:build src/lxml/etree.c:183294: error: #pragma GCC diagnostic not allowed inside functions |
---|
842 | :info:build src/lxml/etree.c:183342: error: #pragma GCC diagnostic not allowed inside functions |
---|
843 | :info:build src/lxml/etree.c:183343: error: #pragma GCC diagnostic not allowed inside functions |
---|
844 | :info:build src/lxml/etree.c:183345: error: #pragma GCC diagnostic not allowed inside functions |
---|
845 | :info:build src/lxml/etree.c: In function '__pyx_f_4lxml_5etree_22_IncrementalFileWriter__write_attributes_and_namespaces': |
---|
846 | :info:build src/lxml/etree.c:183565: error: #pragma GCC diagnostic not allowed inside functions |
---|
847 | :info:build src/lxml/etree.c:183566: error: #pragma GCC diagnostic not allowed inside functions |
---|
848 | :info:build src/lxml/etree.c:183568: error: #pragma GCC diagnostic not allowed inside functions |
---|
849 | :info:build src/lxml/etree.c:183646: error: #pragma GCC diagnostic not allowed inside functions |
---|
850 | :info:build src/lxml/etree.c:183647: error: #pragma GCC diagnostic not allowed inside functions |
---|
851 | :info:build src/lxml/etree.c:183649: error: #pragma GCC diagnostic not allowed inside functions |
---|
852 | :info:build src/lxml/etree.c:183679: error: #pragma GCC diagnostic not allowed inside functions |
---|
853 | :info:build src/lxml/etree.c:183680: error: #pragma GCC diagnostic not allowed inside functions |
---|
854 | :info:build src/lxml/etree.c:183682: error: #pragma GCC diagnostic not allowed inside functions |
---|
855 | :info:build src/lxml/etree.c: In function '__pyx_f_4lxml_5etree_22_IncrementalFileWriter__write_attributes_list': |
---|
856 | :info:build src/lxml/etree.c:183858: error: #pragma GCC diagnostic not allowed inside functions |
---|
857 | :info:build src/lxml/etree.c:183859: error: #pragma GCC diagnostic not allowed inside functions |
---|
858 | :info:build src/lxml/etree.c:183861: error: #pragma GCC diagnostic not allowed inside functions |
---|
859 | :info:build src/lxml/etree.c: In function '__pyx_f_4lxml_5etree_22_IncrementalFileWriter__write_end_element': |
---|
860 | :info:build src/lxml/etree.c:184200: error: #pragma GCC diagnostic not allowed inside functions |
---|
861 | :info:build src/lxml/etree.c:184201: error: #pragma GCC diagnostic not allowed inside functions |
---|
862 | :info:build src/lxml/etree.c:184203: error: #pragma GCC diagnostic not allowed inside functions |
---|
863 | :info:build src/lxml/etree.c:184299: error: #pragma GCC diagnostic not allowed inside functions |
---|
864 | :info:build src/lxml/etree.c:184300: error: #pragma GCC diagnostic not allowed inside functions |
---|
865 | :info:build src/lxml/etree.c:184302: error: #pragma GCC diagnostic not allowed inside functions |
---|
866 | :info:build src/lxml/etree.c: In function '__pyx_pf_4lxml_5etree_22_IncrementalFileWriter_12write': |
---|
867 | :info:build src/lxml/etree.c:185663: error: #pragma GCC diagnostic not allowed inside functions |
---|
868 | :info:build src/lxml/etree.c:185664: error: #pragma GCC diagnostic not allowed inside functions |
---|
869 | :info:build src/lxml/etree.c:185666: error: #pragma GCC diagnostic not allowed inside functions |
---|
870 | :info:build src/lxml/etree.c:185707: error: #pragma GCC diagnostic not allowed inside functions |
---|
871 | :info:build src/lxml/etree.c:185708: error: #pragma GCC diagnostic not allowed inside functions |
---|
872 | :info:build src/lxml/etree.c:185710: error: #pragma GCC diagnostic not allowed inside functions |
---|
873 | :info:build src/lxml/etree.c: In function '__pyx_pf_4lxml_5etree_22_IncrementalFileWriter_14flush': |
---|
874 | :info:build src/lxml/etree.c:185850: error: #pragma GCC diagnostic not allowed inside functions |
---|
875 | :info:build src/lxml/etree.c:185851: error: #pragma GCC diagnostic not allowed inside functions |
---|
876 | :info:build src/lxml/etree.c:185853: error: #pragma GCC diagnostic not allowed inside functions |
---|
877 | :info:build src/lxml/etree.c: In function '__pyx_f_4lxml_5etree_22_IncrementalFileWriter__close': |
---|
878 | :info:build src/lxml/etree.c:186152: error: #pragma GCC diagnostic not allowed inside functions |
---|
879 | :info:build src/lxml/etree.c:186153: error: #pragma GCC diagnostic not allowed inside functions |
---|
880 | :info:build src/lxml/etree.c:186155: error: #pragma GCC diagnostic not allowed inside functions |
---|
881 | :info:build src/lxml/etree.c: In function '__pyx_f_4lxml_5etree_27_AsyncIncrementalFileWriter__flush': |
---|
882 | :info:build src/lxml/etree.c:187024: error: #pragma GCC diagnostic not allowed inside functions |
---|
883 | :info:build src/lxml/etree.c:187025: error: #pragma GCC diagnostic not allowed inside functions |
---|
884 | :info:build src/lxml/etree.c:187027: error: #pragma GCC diagnostic not allowed inside functions |
---|
885 | :info:build src/lxml/etree.c: In function '__pyx_gb_4lxml_5etree_27_AsyncIncrementalFileWriter_4generator4': |
---|
886 | :info:build src/lxml/etree.c:187222: error: #pragma GCC diagnostic not allowed inside functions |
---|
887 | :info:build src/lxml/etree.c:187223: error: #pragma GCC diagnostic not allowed inside functions |
---|
888 | :info:build src/lxml/etree.c:187225: error: #pragma GCC diagnostic not allowed inside functions |
---|
889 | :info:build src/lxml/etree.c: In function '__pyx_gb_4lxml_5etree_27_AsyncIncrementalFileWriter_7generator5': |
---|
890 | :info:build src/lxml/etree.c:187575: error: #pragma GCC diagnostic not allowed inside functions |
---|
891 | :info:build src/lxml/etree.c:187576: error: #pragma GCC diagnostic not allowed inside functions |
---|
892 | :info:build src/lxml/etree.c:187578: error: #pragma GCC diagnostic not allowed inside functions |
---|
893 | :info:build src/lxml/etree.c: In function '__pyx_gb_4lxml_5etree_27_AsyncIncrementalFileWriter_10generator6': |
---|
894 | :info:build src/lxml/etree.c:187891: error: #pragma GCC diagnostic not allowed inside functions |
---|
895 | :info:build src/lxml/etree.c:187892: error: #pragma GCC diagnostic not allowed inside functions |
---|
896 | :info:build src/lxml/etree.c:187894: error: #pragma GCC diagnostic not allowed inside functions |
---|
897 | :info:build src/lxml/etree.c: In function '__pyx_gb_4lxml_5etree_27_AsyncIncrementalFileWriter_13generator7': |
---|
898 | :info:build src/lxml/etree.c:188194: error: #pragma GCC diagnostic not allowed inside functions |
---|
899 | :info:build src/lxml/etree.c:188195: error: #pragma GCC diagnostic not allowed inside functions |
---|
900 | :info:build src/lxml/etree.c:188197: error: #pragma GCC diagnostic not allowed inside functions |
---|
901 | :info:build src/lxml/etree.c: In function '__pyx_gb_4lxml_5etree_27_AsyncIncrementalFileWriter_20generator8': |
---|
902 | :info:build src/lxml/etree.c:188894: error: #pragma GCC diagnostic not allowed inside functions |
---|
903 | :info:build src/lxml/etree.c:188895: error: #pragma GCC diagnostic not allowed inside functions |
---|
904 | :info:build src/lxml/etree.c:188897: error: #pragma GCC diagnostic not allowed inside functions |
---|
905 | :info:build src/lxml/etree.c:188908: error: #pragma GCC diagnostic not allowed inside functions |
---|
906 | :info:build src/lxml/etree.c:188909: error: #pragma GCC diagnostic not allowed inside functions |
---|
907 | :info:build src/lxml/etree.c:188911: error: #pragma GCC diagnostic not allowed inside functions |
---|
908 | :info:build src/lxml/etree.c: In function '__pyx_gb_4lxml_5etree_23_AsyncFileWriterElement_4generator9': |
---|
909 | :info:build src/lxml/etree.c:189388: error: #pragma GCC diagnostic not allowed inside functions |
---|
910 | :info:build src/lxml/etree.c:189389: error: #pragma GCC diagnostic not allowed inside functions |
---|
911 | :info:build src/lxml/etree.c:189391: error: #pragma GCC diagnostic not allowed inside functions |
---|
912 | :info:build src/lxml/etree.c: In function '__pyx_gb_4lxml_5etree_23_AsyncFileWriterElement_7generator10': |
---|
913 | :info:build src/lxml/etree.c:189616: error: #pragma GCC diagnostic not allowed inside functions |
---|
914 | :info:build src/lxml/etree.c:189617: error: #pragma GCC diagnostic not allowed inside functions |
---|
915 | :info:build src/lxml/etree.c:189619: error: #pragma GCC diagnostic not allowed inside functions |
---|
916 | :info:build src/lxml/etree.c: In function '__pyx_pf_4lxml_5etree_18_FileWriterElement_2__enter__': |
---|
917 | :info:build src/lxml/etree.c:189990: error: #pragma GCC diagnostic not allowed inside functions |
---|
918 | :info:build src/lxml/etree.c:189991: error: #pragma GCC diagnostic not allowed inside functions |
---|
919 | :info:build src/lxml/etree.c:189993: error: #pragma GCC diagnostic not allowed inside functions |
---|
920 | :info:build src/lxml/etree.c: In function '__pyx_pf_4lxml_5etree_18_FileWriterElement_4__exit__': |
---|
921 | :info:build src/lxml/etree.c:190174: error: #pragma GCC diagnostic not allowed inside functions |
---|
922 | :info:build src/lxml/etree.c:190175: error: #pragma GCC diagnostic not allowed inside functions |
---|
923 | :info:build src/lxml/etree.c:190177: error: #pragma GCC diagnostic not allowed inside functions |
---|
924 | :info:build src/lxml/etree.c: In function '__pyx_pf_4lxml_5etree_9iterparse_8__next__': |
---|
925 | :info:build src/lxml/etree.c:193323: error: #pragma GCC diagnostic not allowed inside functions |
---|
926 | :info:build src/lxml/etree.c:193324: error: #pragma GCC diagnostic not allowed inside functions |
---|
927 | :info:build src/lxml/etree.c:193326: error: #pragma GCC diagnostic not allowed inside functions |
---|
928 | :info:build src/lxml/etree.c:193409: error: #pragma GCC diagnostic not allowed inside functions |
---|
929 | :info:build src/lxml/etree.c:193410: error: #pragma GCC diagnostic not allowed inside functions |
---|
930 | :info:build src/lxml/etree.c:193412: error: #pragma GCC diagnostic not allowed inside functions |
---|
931 | :info:build src/lxml/etree.c: In function '__pyx_f_4lxml_5etree_9iterparse__read_more_events': |
---|
932 | :info:build src/lxml/etree.c:193885: error: #pragma GCC diagnostic not allowed inside functions |
---|
933 | :info:build src/lxml/etree.c:193886: error: #pragma GCC diagnostic not allowed inside functions |
---|
934 | :info:build src/lxml/etree.c:193888: error: #pragma GCC diagnostic not allowed inside functions |
---|
935 | :info:build src/lxml/etree.c:193959: error: #pragma GCC diagnostic not allowed inside functions |
---|
936 | :info:build src/lxml/etree.c:193960: error: #pragma GCC diagnostic not allowed inside functions |
---|
937 | :info:build src/lxml/etree.c:193962: error: #pragma GCC diagnostic not allowed inside functions |
---|
938 | :info:build src/lxml/etree.c:193985: error: #pragma GCC diagnostic not allowed inside functions |
---|
939 | :info:build src/lxml/etree.c:193986: error: #pragma GCC diagnostic not allowed inside functions |
---|
940 | :info:build src/lxml/etree.c:193988: error: #pragma GCC diagnostic not allowed inside functions |
---|
941 | :info:build src/lxml/etree.c: In function '__pyx_pf_4lxml_5etree_8iterwalk___init__': |
---|
942 | :info:build src/lxml/etree.c:194444: error: #pragma GCC diagnostic not allowed inside functions |
---|
943 | :info:build src/lxml/etree.c:194445: error: #pragma GCC diagnostic not allowed inside functions |
---|
944 | :info:build src/lxml/etree.c:194447: error: #pragma GCC diagnostic not allowed inside functions |
---|
945 | :info:build src/lxml/etree.c:194681: error: #pragma GCC diagnostic not allowed inside functions |
---|
946 | :info:build src/lxml/etree.c:194682: error: #pragma GCC diagnostic not allowed inside functions |
---|
947 | :info:build src/lxml/etree.c:194684: error: #pragma GCC diagnostic not allowed inside functions |
---|
948 | :info:build src/lxml/etree.c: In function '__pyx_pf_4lxml_5etree_8iterwalk_4__next__': |
---|
949 | :info:build src/lxml/etree.c:194882: error: #pragma GCC diagnostic not allowed inside functions |
---|
950 | :info:build src/lxml/etree.c:194883: error: #pragma GCC diagnostic not allowed inside functions |
---|
951 | :info:build src/lxml/etree.c:194885: error: #pragma GCC diagnostic not allowed inside functions |
---|
952 | :info:build src/lxml/etree.c:194947: error: #pragma GCC diagnostic not allowed inside functions |
---|
953 | :info:build src/lxml/etree.c:194948: error: #pragma GCC diagnostic not allowed inside functions |
---|
954 | :info:build src/lxml/etree.c:194950: error: #pragma GCC diagnostic not allowed inside functions |
---|
955 | :info:build src/lxml/etree.c:195048: error: #pragma GCC diagnostic not allowed inside functions |
---|
956 | :info:build src/lxml/etree.c:195049: error: #pragma GCC diagnostic not allowed inside functions |
---|
957 | :info:build src/lxml/etree.c:195051: error: #pragma GCC diagnostic not allowed inside functions |
---|
958 | :info:build src/lxml/etree.c:195093: error: #pragma GCC diagnostic not allowed inside functions |
---|
959 | :info:build src/lxml/etree.c:195094: error: #pragma GCC diagnostic not allowed inside functions |
---|
960 | :info:build src/lxml/etree.c:195096: error: #pragma GCC diagnostic not allowed inside functions |
---|
961 | :info:build src/lxml/etree.c:195146: error: #pragma GCC diagnostic not allowed inside functions |
---|
962 | :info:build src/lxml/etree.c:195147: error: #pragma GCC diagnostic not allowed inside functions |
---|
963 | :info:build src/lxml/etree.c:195149: error: #pragma GCC diagnostic not allowed inside functions |
---|
964 | :info:build src/lxml/etree.c:195197: error: #pragma GCC diagnostic not allowed inside functions |
---|
965 | :info:build src/lxml/etree.c:195198: error: #pragma GCC diagnostic not allowed inside functions |
---|
966 | :info:build src/lxml/etree.c:195200: error: #pragma GCC diagnostic not allowed inside functions |
---|
967 | :info:build src/lxml/etree.c:195302: error: #pragma GCC diagnostic not allowed inside functions |
---|
968 | :info:build src/lxml/etree.c:195303: error: #pragma GCC diagnostic not allowed inside functions |
---|
969 | :info:build src/lxml/etree.c:195305: error: #pragma GCC diagnostic not allowed inside functions |
---|
970 | :info:build src/lxml/etree.c:195360: error: #pragma GCC diagnostic not allowed inside functions |
---|
971 | :info:build src/lxml/etree.c:195361: error: #pragma GCC diagnostic not allowed inside functions |
---|
972 | :info:build src/lxml/etree.c:195363: error: #pragma GCC diagnostic not allowed inside functions |
---|
973 | :info:build src/lxml/etree.c:195384: error: #pragma GCC diagnostic not allowed inside functions |
---|
974 | :info:build src/lxml/etree.c:195385: error: #pragma GCC diagnostic not allowed inside functions |
---|
975 | :info:build src/lxml/etree.c:195387: error: #pragma GCC diagnostic not allowed inside functions |
---|
976 | :info:build src/lxml/etree.c: In function '__pyx_pf_4lxml_5etree_8XInclude_2__call__': |
---|
977 | :info:build src/lxml/etree.c:200349: error: #pragma GCC diagnostic not allowed inside functions |
---|
978 | :info:build src/lxml/etree.c:200350: error: #pragma GCC diagnostic not allowed inside functions |
---|
979 | :info:build src/lxml/etree.c:200352: error: #pragma GCC diagnostic not allowed inside functions |
---|
980 | :info:build src/lxml/etree.c:200379: error: #pragma GCC diagnostic not allowed inside functions |
---|
981 | :info:build src/lxml/etree.c:200380: error: #pragma GCC diagnostic not allowed inside functions |
---|
982 | :info:build src/lxml/etree.c:200382: error: #pragma GCC diagnostic not allowed inside functions |
---|
983 | :info:build src/lxml/etree.c:200513: error: #pragma GCC diagnostic not allowed inside functions |
---|
984 | :info:build src/lxml/etree.c:200514: error: #pragma GCC diagnostic not allowed inside functions |
---|
985 | :info:build src/lxml/etree.c:200516: error: #pragma GCC diagnostic not allowed inside functions |
---|
986 | :info:build src/lxml/etree.c:200534: error: #pragma GCC diagnostic not allowed inside functions |
---|
987 | :info:build src/lxml/etree.c:200535: error: #pragma GCC diagnostic not allowed inside functions |
---|
988 | :info:build src/lxml/etree.c:200537: error: #pragma GCC diagnostic not allowed inside functions |
---|
989 | :info:build src/lxml/etree.c:200556: error: #pragma GCC diagnostic not allowed inside functions |
---|
990 | :info:build src/lxml/etree.c:200557: error: #pragma GCC diagnostic not allowed inside functions |
---|
991 | :info:build src/lxml/etree.c:200559: error: #pragma GCC diagnostic not allowed inside functions |
---|
992 | :info:build src/lxml/etree.c: In function '__pyx_pf_4lxml_5etree_63strip_attributes': |
---|
993 | :info:build src/lxml/etree.c:201189: error: #pragma GCC diagnostic not allowed inside functions |
---|
994 | :info:build src/lxml/etree.c:201190: error: #pragma GCC diagnostic not allowed inside functions |
---|
995 | :info:build src/lxml/etree.c:201192: error: #pragma GCC diagnostic not allowed inside functions |
---|
996 | :info:build src/lxml/etree.c: In function '__pyx_pf_4lxml_5etree_65strip_elements': |
---|
997 | :info:build src/lxml/etree.c:201621: error: #pragma GCC diagnostic not allowed inside functions |
---|
998 | :info:build src/lxml/etree.c:201622: error: #pragma GCC diagnostic not allowed inside functions |
---|
999 | :info:build src/lxml/etree.c:201624: error: #pragma GCC diagnostic not allowed inside functions |
---|
1000 | :info:build src/lxml/etree.c: In function '__pyx_pf_4lxml_5etree_67strip_tags': |
---|
1001 | :info:build src/lxml/etree.c:202218: error: #pragma GCC diagnostic not allowed inside functions |
---|
1002 | :info:build src/lxml/etree.c:202219: error: #pragma GCC diagnostic not allowed inside functions |
---|
1003 | :info:build src/lxml/etree.c:202221: error: #pragma GCC diagnostic not allowed inside functions |
---|
1004 | :info:build src/lxml/etree.c: In function '__pyx_pf_4lxml_5etree_12_BaseContext_2__init__': |
---|
1005 | :info:build src/lxml/etree.c:203759: error: #pragma GCC diagnostic not allowed inside functions |
---|
1006 | :info:build src/lxml/etree.c:203760: error: #pragma GCC diagnostic not allowed inside functions |
---|
1007 | :info:build src/lxml/etree.c:203762: error: #pragma GCC diagnostic not allowed inside functions |
---|
1008 | :info:build src/lxml/etree.c: In function '__pyx_f_4lxml_5etree_12_BaseContext__release_temp_refs': |
---|
1009 | :info:build src/lxml/etree.c:207022: error: #pragma GCC diagnostic not allowed inside functions |
---|
1010 | :info:build src/lxml/etree.c:207023: error: #pragma GCC diagnostic not allowed inside functions |
---|
1011 | :info:build src/lxml/etree.c:207025: error: #pragma GCC diagnostic not allowed inside functions |
---|
1012 | :info:build src/lxml/etree.c: In function '__pyx_f_4lxml_5etree_12_BaseContext__hold': |
---|
1013 | :info:build src/lxml/etree.c:207102: error: #pragma GCC diagnostic not allowed inside functions |
---|
1014 | :info:build src/lxml/etree.c:207103: error: #pragma GCC diagnostic not allowed inside functions |
---|
1015 | :info:build src/lxml/etree.c:207105: error: #pragma GCC diagnostic not allowed inside functions |
---|
1016 | :info:build src/lxml/etree.c:207260: error: #pragma GCC diagnostic not allowed inside functions |
---|
1017 | :info:build src/lxml/etree.c:207261: error: #pragma GCC diagnostic not allowed inside functions |
---|
1018 | :info:build src/lxml/etree.c:207263: error: #pragma GCC diagnostic not allowed inside functions |
---|
1019 | :info:build src/lxml/etree.c: In function '__pyx_f_4lxml_5etree__forwardXPathError': |
---|
1020 | :info:build src/lxml/etree.c:207647: error: #pragma GCC diagnostic not allowed inside functions |
---|
1021 | :info:build src/lxml/etree.c:207648: error: #pragma GCC diagnostic not allowed inside functions |
---|
1022 | :info:build src/lxml/etree.c:207650: error: #pragma GCC diagnostic not allowed inside functions |
---|
1023 | :info:build src/lxml/etree.c: In function '__pyx_f_4lxml_5etree_12_ExsltRegExp__compile': |
---|
1024 | :info:build src/lxml/etree.c:208713: error: #pragma GCC diagnostic not allowed inside functions |
---|
1025 | :info:build src/lxml/etree.c:208714: error: #pragma GCC diagnostic not allowed inside functions |
---|
1026 | :info:build src/lxml/etree.c:208716: error: #pragma GCC diagnostic not allowed inside functions |
---|
1027 | :info:build src/lxml/etree.c: In function '__pyx_pf_4lxml_5etree_12_ExsltRegExp_2test': |
---|
1028 | :info:build src/lxml/etree.c:209085: error: #pragma GCC diagnostic not allowed inside functions |
---|
1029 | :info:build src/lxml/etree.c:209086: error: #pragma GCC diagnostic not allowed inside functions |
---|
1030 | :info:build src/lxml/etree.c:209088: error: #pragma GCC diagnostic not allowed inside functions |
---|
1031 | :info:build src/lxml/etree.c:209100: error: #pragma GCC diagnostic not allowed inside functions |
---|
1032 | :info:build src/lxml/etree.c:209101: error: #pragma GCC diagnostic not allowed inside functions |
---|
1033 | :info:build src/lxml/etree.c:209103: error: #pragma GCC diagnostic not allowed inside functions |
---|
1034 | :info:build src/lxml/etree.c:209118: error: #pragma GCC diagnostic not allowed inside functions |
---|
1035 | :info:build src/lxml/etree.c:209119: error: #pragma GCC diagnostic not allowed inside functions |
---|
1036 | :info:build src/lxml/etree.c:209121: error: #pragma GCC diagnostic not allowed inside functions |
---|
1037 | :info:build src/lxml/etree.c: In function '__pyx_pf_4lxml_5etree_12_ExsltRegExp_4match': |
---|
1038 | :info:build src/lxml/etree.c:209406: error: #pragma GCC diagnostic not allowed inside functions |
---|
1039 | :info:build src/lxml/etree.c:209407: error: #pragma GCC diagnostic not allowed inside functions |
---|
1040 | :info:build src/lxml/etree.c:209409: error: #pragma GCC diagnostic not allowed inside functions |
---|
1041 | :info:build src/lxml/etree.c:209421: error: #pragma GCC diagnostic not allowed inside functions |
---|
1042 | :info:build src/lxml/etree.c:209422: error: #pragma GCC diagnostic not allowed inside functions |
---|
1043 | :info:build src/lxml/etree.c:209424: error: #pragma GCC diagnostic not allowed inside functions |
---|
1044 | :info:build src/lxml/etree.c:209439: error: #pragma GCC diagnostic not allowed inside functions |
---|
1045 | :info:build src/lxml/etree.c:209440: error: #pragma GCC diagnostic not allowed inside functions |
---|
1046 | :info:build src/lxml/etree.c:209442: error: #pragma GCC diagnostic not allowed inside functions |
---|
1047 | :info:build src/lxml/etree.c: In function '__pyx_pf_4lxml_5etree_12_ExsltRegExp_6replace': |
---|
1048 | :info:build src/lxml/etree.c:210134: error: #pragma GCC diagnostic not allowed inside functions |
---|
1049 | :info:build src/lxml/etree.c:210135: error: #pragma GCC diagnostic not allowed inside functions |
---|
1050 | :info:build src/lxml/etree.c:210137: error: #pragma GCC diagnostic not allowed inside functions |
---|
1051 | :info:build src/lxml/etree.c:210149: error: #pragma GCC diagnostic not allowed inside functions |
---|
1052 | :info:build src/lxml/etree.c:210150: error: #pragma GCC diagnostic not allowed inside functions |
---|
1053 | :info:build src/lxml/etree.c:210152: error: #pragma GCC diagnostic not allowed inside functions |
---|
1054 | :info:build src/lxml/etree.c:210164: error: #pragma GCC diagnostic not allowed inside functions |
---|
1055 | :info:build src/lxml/etree.c:210165: error: #pragma GCC diagnostic not allowed inside functions |
---|
1056 | :info:build src/lxml/etree.c:210167: error: #pragma GCC diagnostic not allowed inside functions |
---|
1057 | :info:build src/lxml/etree.c:210182: error: #pragma GCC diagnostic not allowed inside functions |
---|
1058 | :info:build src/lxml/etree.c:210183: error: #pragma GCC diagnostic not allowed inside functions |
---|
1059 | :info:build src/lxml/etree.c:210185: error: #pragma GCC diagnostic not allowed inside functions |
---|
1060 | :info:build src/lxml/etree.c: In function '__pyx_f_4lxml_5etree__wrapXPathObject': |
---|
1061 | :info:build src/lxml/etree.c:210707: error: #pragma GCC diagnostic not allowed inside functions |
---|
1062 | :info:build src/lxml/etree.c:210708: error: #pragma GCC diagnostic not allowed inside functions |
---|
1063 | :info:build src/lxml/etree.c:210710: error: #pragma GCC diagnostic not allowed inside functions |
---|
1064 | :info:build src/lxml/etree.c:210856: error: #pragma GCC diagnostic not allowed inside functions |
---|
1065 | :info:build src/lxml/etree.c:210857: error: #pragma GCC diagnostic not allowed inside functions |
---|
1066 | :info:build src/lxml/etree.c:210859: error: #pragma GCC diagnostic not allowed inside functions |
---|
1067 | :info:build src/lxml/etree.c:210929: error: #pragma GCC diagnostic not allowed inside functions |
---|
1068 | :info:build src/lxml/etree.c:210930: error: #pragma GCC diagnostic not allowed inside functions |
---|
1069 | :info:build src/lxml/etree.c:210932: error: #pragma GCC diagnostic not allowed inside functions |
---|
1070 | :info:build src/lxml/etree.c: In function '__pyx_f_4lxml_5etree__instantiateElementFromXPath': |
---|
1071 | :info:build src/lxml/etree.c:212191: error: #pragma GCC diagnostic not allowed inside functions |
---|
1072 | :info:build src/lxml/etree.c:212192: error: #pragma GCC diagnostic not allowed inside functions |
---|
1073 | :info:build src/lxml/etree.c:212194: error: #pragma GCC diagnostic not allowed inside functions |
---|
1074 | :info:build src/lxml/etree.c: In function '__pyx_f_4lxml_5etree__extension_function_call': |
---|
1075 | :info:build src/lxml/etree.c:213267: error: #pragma GCC diagnostic not allowed inside functions |
---|
1076 | :info:build src/lxml/etree.c:213268: error: #pragma GCC diagnostic not allowed inside functions |
---|
1077 | :info:build src/lxml/etree.c:213270: error: #pragma GCC diagnostic not allowed inside functions |
---|
1078 | :info:build src/lxml/etree.c: In function '__pyx_f_4lxml_5etree__xpath_function_call': |
---|
1079 | :info:build src/lxml/etree.c:213502: error: #pragma GCC diagnostic not allowed inside functions |
---|
1080 | :info:build src/lxml/etree.c:213503: error: #pragma GCC diagnostic not allowed inside functions |
---|
1081 | :info:build src/lxml/etree.c:213505: error: #pragma GCC diagnostic not allowed inside functions |
---|
1082 | :info:build src/lxml/etree.c: In function '__pyx_f_4lxml_5etree_13_XPathContext_register_context': |
---|
1083 | :info:build src/lxml/etree.c:214227: error: #pragma GCC diagnostic not allowed inside functions |
---|
1084 | :info:build src/lxml/etree.c:214228: error: #pragma GCC diagnostic not allowed inside functions |
---|
1085 | :info:build src/lxml/etree.c:214230: error: #pragma GCC diagnostic not allowed inside functions |
---|
1086 | :info:build src/lxml/etree.c:214284: error: #pragma GCC diagnostic not allowed inside functions |
---|
1087 | :info:build src/lxml/etree.c:214285: error: #pragma GCC diagnostic not allowed inside functions |
---|
1088 | :info:build src/lxml/etree.c:214287: error: #pragma GCC diagnostic not allowed inside functions |
---|
1089 | :info:build src/lxml/etree.c: In function '__pyx_f_4lxml_5etree_13_XPathContext_unregister_context': |
---|
1090 | :info:build src/lxml/etree.c:214378: error: #pragma GCC diagnostic not allowed inside functions |
---|
1091 | :info:build src/lxml/etree.c:214379: error: #pragma GCC diagnostic not allowed inside functions |
---|
1092 | :info:build src/lxml/etree.c:214381: error: #pragma GCC diagnostic not allowed inside functions |
---|
1093 | :info:build src/lxml/etree.c: In function '__pyx_f_4lxml_5etree_19_XPathEvaluatorBase_set_context': |
---|
1094 | :info:build src/lxml/etree.c:215375: error: #pragma GCC diagnostic not allowed inside functions |
---|
1095 | :info:build src/lxml/etree.c:215376: error: #pragma GCC diagnostic not allowed inside functions |
---|
1096 | :info:build src/lxml/etree.c:215378: error: #pragma GCC diagnostic not allowed inside functions |
---|
1097 | :info:build src/lxml/etree.c: In function '__pyx_f_4lxml_5etree_19_XPathEvaluatorBase__build_parse_error': |
---|
1098 | :info:build src/lxml/etree.c:215792: error: #pragma GCC diagnostic not allowed inside functions |
---|
1099 | :info:build src/lxml/etree.c:215793: error: #pragma GCC diagnostic not allowed inside functions |
---|
1100 | :info:build src/lxml/etree.c:215795: error: #pragma GCC diagnostic not allowed inside functions |
---|
1101 | :info:build src/lxml/etree.c:215882: error: #pragma GCC diagnostic not allowed inside functions |
---|
1102 | :info:build src/lxml/etree.c:215883: error: #pragma GCC diagnostic not allowed inside functions |
---|
1103 | :info:build src/lxml/etree.c:215885: error: #pragma GCC diagnostic not allowed inside functions |
---|
1104 | :info:build src/lxml/etree.c: In function '__pyx_f_4lxml_5etree_19_XPathEvaluatorBase__build_eval_error': |
---|
1105 | :info:build src/lxml/etree.c:216077: error: #pragma GCC diagnostic not allowed inside functions |
---|
1106 | :info:build src/lxml/etree.c:216078: error: #pragma GCC diagnostic not allowed inside functions |
---|
1107 | :info:build src/lxml/etree.c:216080: error: #pragma GCC diagnostic not allowed inside functions |
---|
1108 | :info:build src/lxml/etree.c:216152: error: #pragma GCC diagnostic not allowed inside functions |
---|
1109 | :info:build src/lxml/etree.c:216153: error: #pragma GCC diagnostic not allowed inside functions |
---|
1110 | :info:build src/lxml/etree.c:216155: error: #pragma GCC diagnostic not allowed inside functions |
---|
1111 | :info:build src/lxml/etree.c: In function '__pyx_f_4lxml_5etree_19_XPathEvaluatorBase__handle_result': |
---|
1112 | :info:build src/lxml/etree.c:216286: error: #pragma GCC diagnostic not allowed inside functions |
---|
1113 | :info:build src/lxml/etree.c:216287: error: #pragma GCC diagnostic not allowed inside functions |
---|
1114 | :info:build src/lxml/etree.c:216289: error: #pragma GCC diagnostic not allowed inside functions |
---|
1115 | :info:build src/lxml/etree.c:216328: error: #pragma GCC diagnostic not allowed inside functions |
---|
1116 | :info:build src/lxml/etree.c:216329: error: #pragma GCC diagnostic not allowed inside functions |
---|
1117 | :info:build src/lxml/etree.c:216331: error: #pragma GCC diagnostic not allowed inside functions |
---|
1118 | :info:build src/lxml/etree.c:216400: error: #pragma GCC diagnostic not allowed inside functions |
---|
1119 | :info:build src/lxml/etree.c:216401: error: #pragma GCC diagnostic not allowed inside functions |
---|
1120 | :info:build src/lxml/etree.c:216403: error: #pragma GCC diagnostic not allowed inside functions |
---|
1121 | :info:build src/lxml/etree.c:216442: error: #pragma GCC diagnostic not allowed inside functions |
---|
1122 | :info:build src/lxml/etree.c:216443: error: #pragma GCC diagnostic not allowed inside functions |
---|
1123 | :info:build src/lxml/etree.c:216445: error: #pragma GCC diagnostic not allowed inside functions |
---|
1124 | :info:build src/lxml/etree.c: In function '__pyx_pf_4lxml_5etree_21XPathElementEvaluator_6__call__': |
---|
1125 | :info:build src/lxml/etree.c:217372: error: #pragma GCC diagnostic not allowed inside functions |
---|
1126 | :info:build src/lxml/etree.c:217373: error: #pragma GCC diagnostic not allowed inside functions |
---|
1127 | :info:build src/lxml/etree.c:217375: error: #pragma GCC diagnostic not allowed inside functions |
---|
1128 | :info:build src/lxml/etree.c:217403: error: #pragma GCC diagnostic not allowed inside functions |
---|
1129 | :info:build src/lxml/etree.c:217404: error: #pragma GCC diagnostic not allowed inside functions |
---|
1130 | :info:build src/lxml/etree.c:217406: error: #pragma GCC diagnostic not allowed inside functions |
---|
1131 | :info:build src/lxml/etree.c:217417: error: #pragma GCC diagnostic not allowed inside functions |
---|
1132 | :info:build src/lxml/etree.c:217418: error: #pragma GCC diagnostic not allowed inside functions |
---|
1133 | :info:build src/lxml/etree.c:217420: error: #pragma GCC diagnostic not allowed inside functions |
---|
1134 | :info:build src/lxml/etree.c:217500: error: #pragma GCC diagnostic not allowed inside functions |
---|
1135 | :info:build src/lxml/etree.c:217501: error: #pragma GCC diagnostic not allowed inside functions |
---|
1136 | :info:build src/lxml/etree.c:217503: error: #pragma GCC diagnostic not allowed inside functions |
---|
1137 | :info:build src/lxml/etree.c:217541: error: #pragma GCC diagnostic not allowed inside functions |
---|
1138 | :info:build src/lxml/etree.c:217542: error: #pragma GCC diagnostic not allowed inside functions |
---|
1139 | :info:build src/lxml/etree.c:217544: error: #pragma GCC diagnostic not allowed inside functions |
---|
1140 | :info:build src/lxml/etree.c: In function '__pyx_pf_4lxml_5etree_22XPathDocumentEvaluator_2__call__': |
---|
1141 | :info:build src/lxml/etree.c:218018: error: #pragma GCC diagnostic not allowed inside functions |
---|
1142 | :info:build src/lxml/etree.c:218019: error: #pragma GCC diagnostic not allowed inside functions |
---|
1143 | :info:build src/lxml/etree.c:218021: error: #pragma GCC diagnostic not allowed inside functions |
---|
1144 | :info:build src/lxml/etree.c:218039: error: #pragma GCC diagnostic not allowed inside functions |
---|
1145 | :info:build src/lxml/etree.c:218040: error: #pragma GCC diagnostic not allowed inside functions |
---|
1146 | :info:build src/lxml/etree.c:218042: error: #pragma GCC diagnostic not allowed inside functions |
---|
1147 | :info:build src/lxml/etree.c:218072: error: #pragma GCC diagnostic not allowed inside functions |
---|
1148 | :info:build src/lxml/etree.c:218073: error: #pragma GCC diagnostic not allowed inside functions |
---|
1149 | :info:build src/lxml/etree.c:218075: error: #pragma GCC diagnostic not allowed inside functions |
---|
1150 | :info:build src/lxml/etree.c:218182: error: #pragma GCC diagnostic not allowed inside functions |
---|
1151 | :info:build src/lxml/etree.c:218183: error: #pragma GCC diagnostic not allowed inside functions |
---|
1152 | :info:build src/lxml/etree.c:218185: error: #pragma GCC diagnostic not allowed inside functions |
---|
1153 | :info:build src/lxml/etree.c:218223: error: #pragma GCC diagnostic not allowed inside functions |
---|
1154 | :info:build src/lxml/etree.c:218224: error: #pragma GCC diagnostic not allowed inside functions |
---|
1155 | :info:build src/lxml/etree.c:218226: error: #pragma GCC diagnostic not allowed inside functions |
---|
1156 | :info:build src/lxml/etree.c: In function '__pyx_pf_4lxml_5etree_5XPath_4__call__': |
---|
1157 | :info:build src/lxml/etree.c:219173: error: #pragma GCC diagnostic not allowed inside functions |
---|
1158 | :info:build src/lxml/etree.c:219174: error: #pragma GCC diagnostic not allowed inside functions |
---|
1159 | :info:build src/lxml/etree.c:219176: error: #pragma GCC diagnostic not allowed inside functions |
---|
1160 | :info:build src/lxml/etree.c:219214: error: #pragma GCC diagnostic not allowed inside functions |
---|
1161 | :info:build src/lxml/etree.c:219215: error: #pragma GCC diagnostic not allowed inside functions |
---|
1162 | :info:build src/lxml/etree.c:219217: error: #pragma GCC diagnostic not allowed inside functions |
---|
1163 | :info:build src/lxml/etree.c:219228: error: #pragma GCC diagnostic not allowed inside functions |
---|
1164 | :info:build src/lxml/etree.c:219229: error: #pragma GCC diagnostic not allowed inside functions |
---|
1165 | :info:build src/lxml/etree.c:219231: error: #pragma GCC diagnostic not allowed inside functions |
---|
1166 | :info:build src/lxml/etree.c:219302: error: #pragma GCC diagnostic not allowed inside functions |
---|
1167 | :info:build src/lxml/etree.c:219303: error: #pragma GCC diagnostic not allowed inside functions |
---|
1168 | :info:build src/lxml/etree.c:219305: error: #pragma GCC diagnostic not allowed inside functions |
---|
1169 | :info:build src/lxml/etree.c:219343: error: #pragma GCC diagnostic not allowed inside functions |
---|
1170 | :info:build src/lxml/etree.c:219344: error: #pragma GCC diagnostic not allowed inside functions |
---|
1171 | :info:build src/lxml/etree.c:219346: error: #pragma GCC diagnostic not allowed inside functions |
---|
1172 | :info:build src/lxml/etree.c: In function '__pyx_pf_4lxml_5etree_17XSLTAccessControl_2__init__': |
---|
1173 | :info:build src/lxml/etree.c:221896: error: #pragma GCC diagnostic not allowed inside functions |
---|
1174 | :info:build src/lxml/etree.c:221897: error: #pragma GCC diagnostic not allowed inside functions |
---|
1175 | :info:build src/lxml/etree.c:221899: error: #pragma GCC diagnostic not allowed inside functions |
---|
1176 | :info:build src/lxml/etree.c:221910: error: #pragma GCC diagnostic not allowed inside functions |
---|
1177 | :info:build src/lxml/etree.c:221911: error: #pragma GCC diagnostic not allowed inside functions |
---|
1178 | :info:build src/lxml/etree.c:221913: error: #pragma GCC diagnostic not allowed inside functions |
---|
1179 | :info:build src/lxml/etree.c:221924: error: #pragma GCC diagnostic not allowed inside functions |
---|
1180 | :info:build src/lxml/etree.c:221925: error: #pragma GCC diagnostic not allowed inside functions |
---|
1181 | :info:build src/lxml/etree.c:221927: error: #pragma GCC diagnostic not allowed inside functions |
---|
1182 | :info:build src/lxml/etree.c:221938: error: #pragma GCC diagnostic not allowed inside functions |
---|
1183 | :info:build src/lxml/etree.c:221939: error: #pragma GCC diagnostic not allowed inside functions |
---|
1184 | :info:build src/lxml/etree.c:221941: error: #pragma GCC diagnostic not allowed inside functions |
---|
1185 | :info:build src/lxml/etree.c:221952: error: #pragma GCC diagnostic not allowed inside functions |
---|
1186 | :info:build src/lxml/etree.c:221953: error: #pragma GCC diagnostic not allowed inside functions |
---|
1187 | :info:build src/lxml/etree.c:221955: error: #pragma GCC diagnostic not allowed inside functions |
---|
1188 | :info:build src/lxml/etree.c: In function '__pyx_pf_4lxml_5etree_17XSLTAccessControl_7options___get__': |
---|
1189 | :info:build src/lxml/etree.c:222201: error: #pragma GCC diagnostic not allowed inside functions |
---|
1190 | :info:build src/lxml/etree.c:222202: error: #pragma GCC diagnostic not allowed inside functions |
---|
1191 | :info:build src/lxml/etree.c:222204: error: #pragma GCC diagnostic not allowed inside functions |
---|
1192 | :info:build src/lxml/etree.c:222216: error: #pragma GCC diagnostic not allowed inside functions |
---|
1193 | :info:build src/lxml/etree.c:222217: error: #pragma GCC diagnostic not allowed inside functions |
---|
1194 | :info:build src/lxml/etree.c:222219: error: #pragma GCC diagnostic not allowed inside functions |
---|
1195 | :info:build src/lxml/etree.c:222231: error: #pragma GCC diagnostic not allowed inside functions |
---|
1196 | :info:build src/lxml/etree.c:222232: error: #pragma GCC diagnostic not allowed inside functions |
---|
1197 | :info:build src/lxml/etree.c:222234: error: #pragma GCC diagnostic not allowed inside functions |
---|
1198 | :info:build src/lxml/etree.c:222246: error: #pragma GCC diagnostic not allowed inside functions |
---|
1199 | :info:build src/lxml/etree.c:222247: error: #pragma GCC diagnostic not allowed inside functions |
---|
1200 | :info:build src/lxml/etree.c:222249: error: #pragma GCC diagnostic not allowed inside functions |
---|
1201 | :info:build src/lxml/etree.c:222261: error: #pragma GCC diagnostic not allowed inside functions |
---|
1202 | :info:build src/lxml/etree.c:222262: error: #pragma GCC diagnostic not allowed inside functions |
---|
1203 | :info:build src/lxml/etree.c:222264: error: #pragma GCC diagnostic not allowed inside functions |
---|
1204 | :info:build src/lxml/etree.c: In function '__pyx_f_4lxml_5etree_12_XSLTContext_register_context': |
---|
1205 | :info:build src/lxml/etree.c:223365: error: #pragma GCC diagnostic not allowed inside functions |
---|
1206 | :info:build src/lxml/etree.c:223366: error: #pragma GCC diagnostic not allowed inside functions |
---|
1207 | :info:build src/lxml/etree.c:223368: error: #pragma GCC diagnostic not allowed inside functions |
---|
1208 | :info:build src/lxml/etree.c: In function '__pyx_f_4lxml_5etree_12_XSLTContext_free_context': |
---|
1209 | :info:build src/lxml/etree.c:223455: error: #pragma GCC diagnostic not allowed inside functions |
---|
1210 | :info:build src/lxml/etree.c:223456: error: #pragma GCC diagnostic not allowed inside functions |
---|
1211 | :info:build src/lxml/etree.c:223458: error: #pragma GCC diagnostic not allowed inside functions |
---|
1212 | :info:build src/lxml/etree.c:223469: error: #pragma GCC diagnostic not allowed inside functions |
---|
1213 | :info:build src/lxml/etree.c:223470: error: #pragma GCC diagnostic not allowed inside functions |
---|
1214 | :info:build src/lxml/etree.c:223472: error: #pragma GCC diagnostic not allowed inside functions |
---|
1215 | :info:build src/lxml/etree.c:223520: error: #pragma GCC diagnostic not allowed inside functions |
---|
1216 | :info:build src/lxml/etree.c:223521: error: #pragma GCC diagnostic not allowed inside functions |
---|
1217 | :info:build src/lxml/etree.c:223523: error: #pragma GCC diagnostic not allowed inside functions |
---|
1218 | :info:build src/lxml/etree.c: In function '__pyx_pf_4lxml_5etree_4XSLT_2__init__': |
---|
1219 | :info:build src/lxml/etree.c:224092: error: #pragma GCC diagnostic not allowed inside functions |
---|
1220 | :info:build src/lxml/etree.c:224093: error: #pragma GCC diagnostic not allowed inside functions |
---|
1221 | :info:build src/lxml/etree.c:224095: error: #pragma GCC diagnostic not allowed inside functions |
---|
1222 | :info:build src/lxml/etree.c:224324: error: #pragma GCC diagnostic not allowed inside functions |
---|
1223 | :info:build src/lxml/etree.c:224325: error: #pragma GCC diagnostic not allowed inside functions |
---|
1224 | :info:build src/lxml/etree.c:224327: error: #pragma GCC diagnostic not allowed inside functions |
---|
1225 | :info:build src/lxml/etree.c: In function '__pyx_pf_4lxml_5etree_4XSLT_16__call__': |
---|
1226 | :info:build src/lxml/etree.c:225812: error: #pragma GCC diagnostic not allowed inside functions |
---|
1227 | :info:build src/lxml/etree.c:225813: error: #pragma GCC diagnostic not allowed inside functions |
---|
1228 | :info:build src/lxml/etree.c:225815: error: #pragma GCC diagnostic not allowed inside functions |
---|
1229 | :info:build src/lxml/etree.c:225828: error: #pragma GCC diagnostic not allowed inside functions |
---|
1230 | :info:build src/lxml/etree.c:225829: error: #pragma GCC diagnostic not allowed inside functions |
---|
1231 | :info:build src/lxml/etree.c:225831: error: #pragma GCC diagnostic not allowed inside functions |
---|
1232 | :info:build src/lxml/etree.c:225842: error: #pragma GCC diagnostic not allowed inside functions |
---|
1233 | :info:build src/lxml/etree.c:225843: error: #pragma GCC diagnostic not allowed inside functions |
---|
1234 | :info:build src/lxml/etree.c:225845: error: #pragma GCC diagnostic not allowed inside functions |
---|
1235 | :info:build src/lxml/etree.c:226054: error: #pragma GCC diagnostic not allowed inside functions |
---|
1236 | :info:build src/lxml/etree.c:226055: error: #pragma GCC diagnostic not allowed inside functions |
---|
1237 | :info:build src/lxml/etree.c:226057: error: #pragma GCC diagnostic not allowed inside functions |
---|
1238 | :info:build src/lxml/etree.c:226115: error: #pragma GCC diagnostic not allowed inside functions |
---|
1239 | :info:build src/lxml/etree.c:226116: error: #pragma GCC diagnostic not allowed inside functions |
---|
1240 | :info:build src/lxml/etree.c:226118: error: #pragma GCC diagnostic not allowed inside functions |
---|
1241 | :info:build src/lxml/etree.c:226686: error: #pragma GCC diagnostic not allowed inside functions |
---|
1242 | :info:build src/lxml/etree.c:226687: error: #pragma GCC diagnostic not allowed inside functions |
---|
1243 | :info:build src/lxml/etree.c:226689: error: #pragma GCC diagnostic not allowed inside functions |
---|
1244 | :info:build src/lxml/etree.c: In function '__pyx_f_4lxml_5etree_4XSLT__run_transform': |
---|
1245 | :info:build src/lxml/etree.c:226991: error: #pragma GCC diagnostic not allowed inside functions |
---|
1246 | :info:build src/lxml/etree.c:226992: error: #pragma GCC diagnostic not allowed inside functions |
---|
1247 | :info:build src/lxml/etree.c:226994: error: #pragma GCC diagnostic not allowed inside functions |
---|
1248 | :info:build src/lxml/etree.c: In function '__pyx_f_4lxml_5etree__copyXSLT': |
---|
1249 | :info:build src/lxml/etree.c:227650: error: #pragma GCC diagnostic not allowed inside functions |
---|
1250 | :info:build src/lxml/etree.c:227651: error: #pragma GCC diagnostic not allowed inside functions |
---|
1251 | :info:build src/lxml/etree.c:227653: error: #pragma GCC diagnostic not allowed inside functions |
---|
1252 | :info:build src/lxml/etree.c:227669: error: #pragma GCC diagnostic not allowed inside functions |
---|
1253 | :info:build src/lxml/etree.c:227670: error: #pragma GCC diagnostic not allowed inside functions |
---|
1254 | :info:build src/lxml/etree.c:227672: error: #pragma GCC diagnostic not allowed inside functions |
---|
1255 | :info:build src/lxml/etree.c: In function '__pyx_pf_4lxml_5etree_15_XSLTResultTree_2__str__': |
---|
1256 | :info:build src/lxml/etree.c:228591: error: #pragma GCC diagnostic not allowed inside functions |
---|
1257 | :info:build src/lxml/etree.c:228592: error: #pragma GCC diagnostic not allowed inside functions |
---|
1258 | :info:build src/lxml/etree.c:228594: error: #pragma GCC diagnostic not allowed inside functions |
---|
1259 | :info:build src/lxml/etree.c: In function '__pyx_pf_4lxml_5etree_15_XSLTResultTree_4__getbuffer__': |
---|
1260 | :info:build src/lxml/etree.c:228883: error: #pragma GCC diagnostic not allowed inside functions |
---|
1261 | :info:build src/lxml/etree.c:228884: error: #pragma GCC diagnostic not allowed inside functions |
---|
1262 | :info:build src/lxml/etree.c:228886: error: #pragma GCC diagnostic not allowed inside functions |
---|
1263 | :info:build src/lxml/etree.c: In function '__pyx_pf_4lxml_5etree_15_XSLTResultTree_12xslt_profile___get__': |
---|
1264 | :info:build src/lxml/etree.c:229418: error: #pragma GCC diagnostic not allowed inside functions |
---|
1265 | :info:build src/lxml/etree.c:229419: error: #pragma GCC diagnostic not allowed inside functions |
---|
1266 | :info:build src/lxml/etree.c:229421: error: #pragma GCC diagnostic not allowed inside functions |
---|
1267 | :info:build src/lxml/etree.c: In function '__pyx_pf_4lxml_5etree_10_Validator_4assertValid': |
---|
1268 | :info:build src/lxml/etree.c:233936: error: #pragma GCC diagnostic not allowed inside functions |
---|
1269 | :info:build src/lxml/etree.c:233937: error: #pragma GCC diagnostic not allowed inside functions |
---|
1270 | :info:build src/lxml/etree.c:233939: error: #pragma GCC diagnostic not allowed inside functions |
---|
1271 | :info:build src/lxml/etree.c: In function '__pyx_pf_4lxml_5etree_10_Validator_6assert_': |
---|
1272 | :info:build src/lxml/etree.c:234165: error: #pragma GCC diagnostic not allowed inside functions |
---|
1273 | :info:build src/lxml/etree.c:234166: error: #pragma GCC diagnostic not allowed inside functions |
---|
1274 | :info:build src/lxml/etree.c:234168: error: #pragma GCC diagnostic not allowed inside functions |
---|
1275 | :info:build src/lxml/etree.c: In function '__pyx_f_4lxml_5etree_10_Validator__append_log_message': |
---|
1276 | :info:build src/lxml/etree.c:234310: error: #pragma GCC diagnostic not allowed inside functions |
---|
1277 | :info:build src/lxml/etree.c:234311: error: #pragma GCC diagnostic not allowed inside functions |
---|
1278 | :info:build src/lxml/etree.c:234313: error: #pragma GCC diagnostic not allowed inside functions |
---|
1279 | :info:build src/lxml/etree.c: In function '__pyx_pf_4lxml_5etree_3DTD___init__': |
---|
1280 | :info:build src/lxml/etree.c:238826: error: #pragma GCC diagnostic not allowed inside functions |
---|
1281 | :info:build src/lxml/etree.c:238827: error: #pragma GCC diagnostic not allowed inside functions |
---|
1282 | :info:build src/lxml/etree.c:238829: error: #pragma GCC diagnostic not allowed inside functions |
---|
1283 | :info:build src/lxml/etree.c:238993: error: #pragma GCC diagnostic not allowed inside functions |
---|
1284 | :info:build src/lxml/etree.c:238994: error: #pragma GCC diagnostic not allowed inside functions |
---|
1285 | :info:build src/lxml/etree.c:238996: error: #pragma GCC diagnostic not allowed inside functions |
---|
1286 | :info:build src/lxml/etree.c:239155: error: #pragma GCC diagnostic not allowed inside functions |
---|
1287 | :info:build src/lxml/etree.c:239156: error: #pragma GCC diagnostic not allowed inside functions |
---|
1288 | :info:build src/lxml/etree.c:239158: error: #pragma GCC diagnostic not allowed inside functions |
---|
1289 | :info:build src/lxml/etree.c: In function '__pyx_pf_4lxml_5etree_3DTD_14__call__': |
---|
1290 | :info:build src/lxml/etree.c:240529: error: #pragma GCC diagnostic not allowed inside functions |
---|
1291 | :info:build src/lxml/etree.c:240530: error: #pragma GCC diagnostic not allowed inside functions |
---|
1292 | :info:build src/lxml/etree.c:240532: error: #pragma GCC diagnostic not allowed inside functions |
---|
1293 | :info:build src/lxml/etree.c: In function '__pyx_f_4lxml_5etree__parseDtdFromFilelike': |
---|
1294 | :info:build src/lxml/etree.c:240874: error: #pragma GCC diagnostic not allowed inside functions |
---|
1295 | :info:build src/lxml/etree.c:240875: error: #pragma GCC diagnostic not allowed inside functions |
---|
1296 | :info:build src/lxml/etree.c:240877: error: #pragma GCC diagnostic not allowed inside functions |
---|
1297 | :info:build src/lxml/etree.c: In function '__pyx_pf_4lxml_5etree_7RelaxNG_2__init__': |
---|
1298 | :info:build src/lxml/etree.c:242273: error: #pragma GCC diagnostic not allowed inside functions |
---|
1299 | :info:build src/lxml/etree.c:242274: error: #pragma GCC diagnostic not allowed inside functions |
---|
1300 | :info:build src/lxml/etree.c:242276: error: #pragma GCC diagnostic not allowed inside functions |
---|
1301 | :info:build src/lxml/etree.c:242631: error: #pragma GCC diagnostic not allowed inside functions |
---|
1302 | :info:build src/lxml/etree.c:242632: error: #pragma GCC diagnostic not allowed inside functions |
---|
1303 | :info:build src/lxml/etree.c:242634: error: #pragma GCC diagnostic not allowed inside functions |
---|
1304 | :info:build src/lxml/etree.c:242763: error: #pragma GCC diagnostic not allowed inside functions |
---|
1305 | :info:build src/lxml/etree.c:242764: error: #pragma GCC diagnostic not allowed inside functions |
---|
1306 | :info:build src/lxml/etree.c:242766: error: #pragma GCC diagnostic not allowed inside functions |
---|
1307 | :info:build src/lxml/etree.c: In function '__pyx_pf_4lxml_5etree_9XMLSchema_2__init__': |
---|
1308 | :info:build src/lxml/etree.c:244142: error: #pragma GCC diagnostic not allowed inside functions |
---|
1309 | :info:build src/lxml/etree.c:244143: error: #pragma GCC diagnostic not allowed inside functions |
---|
1310 | :info:build src/lxml/etree.c:244145: error: #pragma GCC diagnostic not allowed inside functions |
---|
1311 | :info:build src/lxml/etree.c:244237: error: #pragma GCC diagnostic not allowed inside functions |
---|
1312 | :info:build src/lxml/etree.c:244238: error: #pragma GCC diagnostic not allowed inside functions |
---|
1313 | :info:build src/lxml/etree.c:244240: error: #pragma GCC diagnostic not allowed inside functions |
---|
1314 | :info:build src/lxml/etree.c:244277: error: #pragma GCC diagnostic not allowed inside functions |
---|
1315 | :info:build src/lxml/etree.c:244278: error: #pragma GCC diagnostic not allowed inside functions |
---|
1316 | :info:build src/lxml/etree.c:244280: error: #pragma GCC diagnostic not allowed inside functions |
---|
1317 | :info:build src/lxml/etree.c: In function '__pyx_pf_4lxml_5etree_10Schematron_2__init__': |
---|
1318 | :info:build src/lxml/etree.c:246047: error: #pragma GCC diagnostic not allowed inside functions |
---|
1319 | :info:build src/lxml/etree.c:246048: error: #pragma GCC diagnostic not allowed inside functions |
---|
1320 | :info:build src/lxml/etree.c:246050: error: #pragma GCC diagnostic not allowed inside functions |
---|
1321 | :info:build src/lxml/etree.c:246220: error: #pragma GCC diagnostic not allowed inside functions |
---|
1322 | :info:build src/lxml/etree.c:246221: error: #pragma GCC diagnostic not allowed inside functions |
---|
1323 | :info:build src/lxml/etree.c:246223: error: #pragma GCC diagnostic not allowed inside functions |
---|
1324 | :info:build src/lxml/etree.c: In function 'findOrBuildNodeNsPrefix': |
---|
1325 | :info:build src/lxml/etree.c:249320: error: #pragma GCC diagnostic not allowed inside functions |
---|
1326 | :info:build src/lxml/etree.c:249321: error: #pragma GCC diagnostic not allowed inside functions |
---|
1327 | :info:build src/lxml/etree.c:249323: error: #pragma GCC diagnostic not allowed inside functions |
---|
1328 | :info:build src/lxml/etree.c: In function '__pyx_pf_4lxml_5etree_9_MemDebug_4dict_size': |
---|
1329 | :info:build src/lxml/etree.c:249596: error: #pragma GCC diagnostic not allowed inside functions |
---|
1330 | :info:build src/lxml/etree.c:249597: error: #pragma GCC diagnostic not allowed inside functions |
---|
1331 | :info:build src/lxml/etree.c:249599: error: #pragma GCC diagnostic not allowed inside functions |
---|
1332 | :info:build src/lxml/etree.c: In function '__pyx_pymod_exec_etree': |
---|
1333 | :info:build src/lxml/etree.c:290621: error: #pragma GCC diagnostic not allowed inside functions |
---|
1334 | :info:build src/lxml/etree.c:290622: error: #pragma GCC diagnostic not allowed inside functions |
---|
1335 | :info:build src/lxml/etree.c:290624: error: #pragma GCC diagnostic not allowed inside functions |
---|
1336 | :info:build src/lxml/etree.c:290805: error: #pragma GCC diagnostic not allowed inside functions |
---|
1337 | :info:build src/lxml/etree.c:290806: error: #pragma GCC diagnostic not allowed inside functions |
---|
1338 | :info:build src/lxml/etree.c:290808: error: #pragma GCC diagnostic not allowed inside functions |
---|
1339 | :info:build Compile failed: command '/opt/local/bin/gcc-apple-4.2' failed with exit code 1 |
---|
1340 | :info:build creating opt |
---|
1341 | :info:build creating opt/local |
---|
1342 | :info:build creating opt/local/var |
---|
1343 | :info:build creating opt/local/var/macports |
---|
1344 | :info:build creating opt/local/var/macports/build |
---|
1345 | :info:build creating opt/local/var/macports/build/_opt_local_var_macports_sources_nue.de.rsync.macports.org_macports_release_tarballs_ports_python_py-lxml |
---|
1346 | :info:build creating opt/local/var/macports/build/_opt_local_var_macports_sources_nue.de.rsync.macports.org_macports_release_tarballs_ports_python_py-lxml/py311-lxml |
---|
1347 | :info:build creating opt/local/var/macports/build/_opt_local_var_macports_sources_nue.de.rsync.macports.org_macports_release_tarballs_ports_python_py-lxml/py311-lxml/work |
---|
1348 | :info:build creating opt/local/var/macports/build/_opt_local_var_macports_sources_nue.de.rsync.macports.org_macports_release_tarballs_ports_python_py-lxml/py311-lxml/work/.tmp |
---|
1349 | :info:build cc -I/opt/local/include/libxml2 -I/usr/include/libxml2 -c /opt/local/var/macports/build/_opt_local_var_macports_sources_nue.de.rsync.macports.org_macports_release_tarballs_ports_python_py-lxml/py311-lxml/work/.tmp/xmlXPathInitsppf3n86.c -o opt/local/var/macports/build/_opt_local_var_macports_sources_nue.de.rsync.macports.org_macports_release_tarballs_ports_python_py-lxml/py311-lxml/work/.tmp/xmlXPathInitsppf3n86.o |
---|
1350 | :info:build /opt/local/var/macports/build/_opt_local_var_macports_sources_nue.de.rsync.macports.org_macports_release_tarballs_ports_python_py-lxml/py311-lxml/work/.tmp/xmlXPathInitsppf3n86.c: In function ‘main’: |
---|
1351 | :info:build /opt/local/var/macports/build/_opt_local_var_macports_sources_nue.de.rsync.macports.org_macports_release_tarballs_ports_python_py-lxml/py311-lxml/work/.tmp/xmlXPathInitsppf3n86.c:3: warning: ‘xmlXPathInit’ is deprecated (declared at /opt/local/include/libxml2/libxml/xpath.h:564) |
---|
1352 | :info:build cc opt/local/var/macports/build/_opt_local_var_macports_sources_nue.de.rsync.macports.org_macports_release_tarballs_ports_python_py-lxml/py311-lxml/work/.tmp/xmlXPathInitsppf3n86.o -L/opt/local/lib -lxml2 -o a.out |
---|
1353 | :info:build error: command '/opt/local/bin/gcc-apple-4.2' failed with exit code 1 |
---|
1354 | :info:build ERROR Backend subprocess exited when trying to invoke build_wheel |
---|
1355 | :info:build Command failed: cd "/opt/local/var/macports/build/_opt_local_var_macports_sources_nue.de.rsync.macports.org_macports_release_tarballs_ports_python_py-lxml/py311-lxml/work/lxml-5.1.1" && /opt/local/Library/Frameworks/Python.framework/Versions/3.11/bin/python3.11 -m build --no-isolation --wheel --outdir /opt/local/var/macports/build/_opt_local_var_macports_sources_nue.de.rsync.macports.org_macports_release_tarballs_ports_python_py-lxml/py311-lxml/work |
---|
1356 | :info:build Exit code: 1 |
---|
1357 | :error:build Failed to build py311-lxml: command execution failed |
---|
1358 | :debug:build Error code: CHILDSTATUS 11810 1 |
---|
1359 | :debug:build Backtrace: command execution failed |
---|
1360 | :debug:build while executing |
---|
1361 | :debug:build "system {*}$notty {*}$callback {*}$nice $fullcmdstring" |
---|
1362 | :debug:build invoked from within |
---|
1363 | :debug:build "command_exec -callback portprogress::target_progress_callback build" |
---|
1364 | :debug:build (procedure "portbuild::build_main" line 10) |
---|
1365 | :debug:build invoked from within |
---|
1366 | :debug:build "$procedure $targetname" |
---|
1367 | :error:build See /opt/local/var/macports/logs/_opt_local_var_macports_sources_nue.de.rsync.macports.org_macports_release_tarballs_ports_python_py-lxml/py311-lxml/main.log for details. |
---|