1 | version:1 |
---|
2 | :debug:clean Starting logging for libedit @20210910-3.1_0 |
---|
3 | :debug:sysinfo Mac OS X 10.4.11 (darwin/8.11.0) arch powerpc |
---|
4 | :debug:sysinfo MacPorts 2.7.1 |
---|
5 | :debug:sysinfo Xcode 2.5 |
---|
6 | :debug:sysinfo SDK 10.4 |
---|
7 | :debug:sysinfo MACOSX_DEPLOYMENT_TARGET: 10.4 |
---|
8 | :msg:clean ---> Computing dependencies for libedit:info:clean .:debug:clean libedit has no conflicts |
---|
9 | :debug:clean Searching for dependency: apple-gcc42 |
---|
10 | :debug:clean Found Dependency: receipt exists for apple-gcc42 |
---|
11 | :debug:clean Searching for dependency: ncurses |
---|
12 | :debug:clean Found Dependency: receipt exists for ncurses |
---|
13 | :debug:main Executing org.macports.main (libedit) |
---|
14 | :debug:main dropping privileges: euid changed to 502, egid changed to 500. |
---|
15 | :debug:archivefetch archivefetch phase started at Tue Nov 9 17:27:07 EST 2021 |
---|
16 | :msg:archivefetch ---> Fetching archive for libedit |
---|
17 | :debug:archivefetch Executing org.macports.archivefetch (libedit) |
---|
18 | :debug:archivefetch euid/egid changed to: 0/0 |
---|
19 | :debug:archivefetch chowned /opt/local/var/macports/incoming to macports |
---|
20 | :debug:archivefetch euid/egid changed to: 502/500 |
---|
21 | :info:archivefetch ---> libedit-20210910-3.1_0.darwin_8.ppc.tbz2 doesn't seem to exist in /opt/local/var/macports/incoming/verified |
---|
22 | :msg:archivefetch ---> Attempting to fetch libedit-20210910-3.1_0.darwin_8.ppc.tbz2 from http://packages.macports.org/libedit |
---|
23 | :debug:archivefetch Fetching archive failed: The requested URL returned error: 404 |
---|
24 | :msg:archivefetch ---> Attempting to fetch libedit-20210910-3.1_0.darwin_8.ppc.tbz2 from http://ywg.ca.packages.macports.org/mirror/macports/packages/libedit |
---|
25 | :debug:archivefetch Fetching archive failed: The requested URL returned error: 404 |
---|
26 | :msg:archivefetch ---> Attempting to fetch libedit-20210910-3.1_0.darwin_8.ppc.tbz2 from http://mse.uk.packages.macports.org/libedit |
---|
27 | :debug:archivefetch Fetching archive failed: The requested URL returned error: 404 |
---|
28 | :debug:archivefetch Privilege de-escalation not attempted as not running as root. |
---|
29 | :debug:fetch fetch phase started at Tue Nov 9 17:27:08 EST 2021 |
---|
30 | :notice:fetch ---> Fetching distfiles for libedit |
---|
31 | :debug:fetch Executing org.macports.fetch (libedit) |
---|
32 | :info:fetch ---> libedit-20210910-3.1.tar.gz does not exist in /opt/local/var/macports/distfiles/libedit |
---|
33 | :notice:fetch ---> Attempting to fetch libedit-20210910-3.1.tar.gz from http://distfiles.macports.org/libedit |
---|
34 | :debug:fetch Privilege de-escalation not attempted as not running as root. |
---|
35 | :debug:checksum checksum phase started at Tue Nov 9 17:27:09 EST 2021 |
---|
36 | :notice:checksum ---> Verifying checksums for libedit |
---|
37 | :debug:checksum Executing org.macports.checksum (libedit) |
---|
38 | :info:checksum ---> Checksumming libedit-20210910-3.1.tar.gz |
---|
39 | :debug:checksum Calculated (rmd160) is 79bfc27859bab1a7ed0102a5ef8f907590ce22c6 |
---|
40 | :debug:checksum Correct (rmd160) checksum for libedit-20210910-3.1.tar.gz |
---|
41 | :debug:checksum Calculated (sha256) is 6792a6a992050762edcca28ff3318cdb7de37dccf7bc30db59fcd7017eed13c5 |
---|
42 | :debug:checksum Correct (sha256) checksum for libedit-20210910-3.1.tar.gz |
---|
43 | :debug:checksum Calculated (size) is 524722 |
---|
44 | :debug:checksum Correct (size) checksum for libedit-20210910-3.1.tar.gz |
---|
45 | :debug:checksum Privilege de-escalation not attempted as not running as root. |
---|
46 | :debug:extract extract phase started at Tue Nov 9 17:27:09 EST 2021 |
---|
47 | :notice:extract ---> Extracting libedit |
---|
48 | :debug:extract Executing org.macports.extract (libedit) |
---|
49 | :info:extract ---> Extracting libedit-20210910-3.1.tar.gz |
---|
50 | :debug:extract setting option extract.args to '/opt/local/var/macports/distfiles/libedit/libedit-20210910-3.1.tar.gz' |
---|
51 | :debug:extract Environment: |
---|
52 | :debug:extract CC_PRINT_OPTIONS='YES' |
---|
53 | :debug:extract CC_PRINT_OPTIONS_FILE='/opt/local/var/macports/build/_opt_local_var_macports_sources_rsync.macports.org_macports_release_tarballs_ports_devel_libedit/libedit/work/.CC_PRINT_OPTIONS' |
---|
54 | :debug:extract CPATH='/opt/local/include' |
---|
55 | :debug:extract DEVELOPER_DIR='/Developer' |
---|
56 | :debug:extract LIBRARY_PATH='/opt/local/lib' |
---|
57 | :debug:extract MACOSX_DEPLOYMENT_TARGET='10.4' |
---|
58 | :info:extract Executing: cd "/opt/local/var/macports/build/_opt_local_var_macports_sources_rsync.macports.org_macports_release_tarballs_ports_devel_libedit/libedit/work" && /usr/bin/gzip -dc '/opt/local/var/macports/distfiles/libedit/libedit-20210910-3.1.tar.gz' | /usr/bin/gnutar --no-same-owner -xf - |
---|
59 | :debug:extract system: cd "/opt/local/var/macports/build/_opt_local_var_macports_sources_rsync.macports.org_macports_release_tarballs_ports_devel_libedit/libedit/work" && /usr/bin/gzip -dc '/opt/local/var/macports/distfiles/libedit/libedit-20210910-3.1.tar.gz' | /usr/bin/gnutar --no-same-owner -xf - |
---|
60 | :debug:extract euid/egid changed to: 0/0 |
---|
61 | :debug:extract chowned /opt/local/var/macports/build/_opt_local_var_macports_sources_rsync.macports.org_macports_release_tarballs_ports_devel_libedit/libedit/work to macports |
---|
62 | :debug:extract euid/egid changed to: 502/500 |
---|
63 | :debug:extract Privilege de-escalation not attempted as not running as root. |
---|
64 | :debug:patch patch phase started at Tue Nov 9 17:27:10 EST 2021 |
---|
65 | :debug:patch Executing org.macports.patch (libedit) |
---|
66 | :notice:patch ---> Applying patches to libedit |
---|
67 | :info:patch ---> Applying doc__Makefile.in.patch |
---|
68 | :debug:patch Environment: |
---|
69 | :debug:patch CC_PRINT_OPTIONS='YES' |
---|
70 | :debug:patch CC_PRINT_OPTIONS_FILE='/opt/local/var/macports/build/_opt_local_var_macports_sources_rsync.macports.org_macports_release_tarballs_ports_devel_libedit/libedit/work/.CC_PRINT_OPTIONS' |
---|
71 | :debug:patch CPATH='/opt/local/include' |
---|
72 | :debug:patch DEVELOPER_DIR='/Developer' |
---|
73 | :debug:patch LIBRARY_PATH='/opt/local/lib' |
---|
74 | :debug:patch MACOSX_DEPLOYMENT_TARGET='10.4' |
---|
75 | :info:patch Executing: cd "/opt/local/var/macports/build/_opt_local_var_macports_sources_rsync.macports.org_macports_release_tarballs_ports_devel_libedit/libedit/work/libedit-20210910-3.1" && /usr/bin/patch -p0 < '/opt/local/var/macports/sources/rsync.macports.org/macports/release/tarballs/ports/devel/libedit/files/doc__Makefile.in.patch' |
---|
76 | :debug:patch system: cd "/opt/local/var/macports/build/_opt_local_var_macports_sources_rsync.macports.org_macports_release_tarballs_ports_devel_libedit/libedit/work/libedit-20210910-3.1" && /usr/bin/patch -p0 < '/opt/local/var/macports/sources/rsync.macports.org/macports/release/tarballs/ports/devel/libedit/files/doc__Makefile.in.patch' |
---|
77 | :info:patch patching file doc/Makefile.in |
---|
78 | :info:patch Hunk #1 succeeded at 282 (offset 4 lines). |
---|
79 | :info:patch ---> Applying wcsdup.patch |
---|
80 | :debug:patch Environment: |
---|
81 | :debug:patch CC_PRINT_OPTIONS='YES' |
---|
82 | :debug:patch CC_PRINT_OPTIONS_FILE='/opt/local/var/macports/build/_opt_local_var_macports_sources_rsync.macports.org_macports_release_tarballs_ports_devel_libedit/libedit/work/.CC_PRINT_OPTIONS' |
---|
83 | :debug:patch CPATH='/opt/local/include' |
---|
84 | :debug:patch DEVELOPER_DIR='/Developer' |
---|
85 | :debug:patch LIBRARY_PATH='/opt/local/lib' |
---|
86 | :debug:patch MACOSX_DEPLOYMENT_TARGET='10.4' |
---|
87 | :info:patch Executing: cd "/opt/local/var/macports/build/_opt_local_var_macports_sources_rsync.macports.org_macports_release_tarballs_ports_devel_libedit/libedit/work/libedit-20210910-3.1" && /usr/bin/patch -p0 < '/opt/local/var/macports/sources/rsync.macports.org/macports/release/tarballs/ports/devel/libedit/files/wcsdup.patch' |
---|
88 | :debug:patch system: cd "/opt/local/var/macports/build/_opt_local_var_macports_sources_rsync.macports.org_macports_release_tarballs_ports_devel_libedit/libedit/work/libedit-20210910-3.1" && /usr/bin/patch -p0 < '/opt/local/var/macports/sources/rsync.macports.org/macports/release/tarballs/ports/devel/libedit/files/wcsdup.patch' |
---|
89 | :info:patch patching file src/sys.h |
---|
90 | :info:patch Hunk #1 succeeded at 97 (offset 1 line). |
---|
91 | :info:patch ---> Applying src__Makefile.in.patch |
---|
92 | :debug:patch Environment: |
---|
93 | :debug:patch CC_PRINT_OPTIONS='YES' |
---|
94 | :debug:patch CC_PRINT_OPTIONS_FILE='/opt/local/var/macports/build/_opt_local_var_macports_sources_rsync.macports.org_macports_release_tarballs_ports_devel_libedit/libedit/work/.CC_PRINT_OPTIONS' |
---|
95 | :debug:patch CPATH='/opt/local/include' |
---|
96 | :debug:patch DEVELOPER_DIR='/Developer' |
---|
97 | :debug:patch LIBRARY_PATH='/opt/local/lib' |
---|
98 | :debug:patch MACOSX_DEPLOYMENT_TARGET='10.4' |
---|
99 | :info:patch Executing: cd "/opt/local/var/macports/build/_opt_local_var_macports_sources_rsync.macports.org_macports_release_tarballs_ports_devel_libedit/libedit/work/libedit-20210910-3.1" && /usr/bin/patch -p0 < '/opt/local/var/macports/sources/rsync.macports.org/macports/release/tarballs/ports/devel/libedit/files/src__Makefile.in.patch' |
---|
100 | :debug:patch system: cd "/opt/local/var/macports/build/_opt_local_var_macports_sources_rsync.macports.org_macports_release_tarballs_ports_devel_libedit/libedit/work/libedit-20210910-3.1" && /usr/bin/patch -p0 < '/opt/local/var/macports/sources/rsync.macports.org/macports/release/tarballs/ports/devel/libedit/files/src__Makefile.in.patch' |
---|
101 | :info:patch patching file src/Makefile.in |
---|
102 | :info:patch ---> Applying src__sys.h.patch |
---|
103 | :debug:patch Environment: |
---|
104 | :debug:patch CC_PRINT_OPTIONS='YES' |
---|
105 | :debug:patch CC_PRINT_OPTIONS_FILE='/opt/local/var/macports/build/_opt_local_var_macports_sources_rsync.macports.org_macports_release_tarballs_ports_devel_libedit/libedit/work/.CC_PRINT_OPTIONS' |
---|
106 | :debug:patch CPATH='/opt/local/include' |
---|
107 | :debug:patch DEVELOPER_DIR='/Developer' |
---|
108 | :debug:patch LIBRARY_PATH='/opt/local/lib' |
---|
109 | :debug:patch MACOSX_DEPLOYMENT_TARGET='10.4' |
---|
110 | :info:patch Executing: cd "/opt/local/var/macports/build/_opt_local_var_macports_sources_rsync.macports.org_macports_release_tarballs_ports_devel_libedit/libedit/work/libedit-20210910-3.1" && /usr/bin/patch -p0 < '/opt/local/var/macports/sources/rsync.macports.org/macports/release/tarballs/ports/devel/libedit/files/src__sys.h.patch' |
---|
111 | :debug:patch system: cd "/opt/local/var/macports/build/_opt_local_var_macports_sources_rsync.macports.org_macports_release_tarballs_ports_devel_libedit/libedit/work/libedit-20210910-3.1" && /usr/bin/patch -p0 < '/opt/local/var/macports/sources/rsync.macports.org/macports/release/tarballs/ports/devel/libedit/files/src__sys.h.patch' |
---|
112 | :info:patch patching file src/sys.h |
---|
113 | :info:patch Hunk #1 succeeded at 81 with fuzz 1 (offset 1 line). |
---|
114 | :info:patch ---> Applying configure.patch |
---|
115 | :debug:patch Environment: |
---|
116 | :debug:patch CC_PRINT_OPTIONS='YES' |
---|
117 | :debug:patch CC_PRINT_OPTIONS_FILE='/opt/local/var/macports/build/_opt_local_var_macports_sources_rsync.macports.org_macports_release_tarballs_ports_devel_libedit/libedit/work/.CC_PRINT_OPTIONS' |
---|
118 | :debug:patch CPATH='/opt/local/include' |
---|
119 | :debug:patch DEVELOPER_DIR='/Developer' |
---|
120 | :debug:patch LIBRARY_PATH='/opt/local/lib' |
---|
121 | :debug:patch MACOSX_DEPLOYMENT_TARGET='10.4' |
---|
122 | :info:patch Executing: cd "/opt/local/var/macports/build/_opt_local_var_macports_sources_rsync.macports.org_macports_release_tarballs_ports_devel_libedit/libedit/work/libedit-20210910-3.1" && /usr/bin/patch -p0 < '/opt/local/var/macports/sources/rsync.macports.org/macports/release/tarballs/ports/devel/libedit/files/configure.patch' |
---|
123 | :debug:patch system: cd "/opt/local/var/macports/build/_opt_local_var_macports_sources_rsync.macports.org_macports_release_tarballs_ports_devel_libedit/libedit/work/libedit-20210910-3.1" && /usr/bin/patch -p0 < '/opt/local/var/macports/sources/rsync.macports.org/macports/release/tarballs/ports/devel/libedit/files/configure.patch' |
---|
124 | :info:patch patching file configure |
---|
125 | :info:patch Hunk #1 succeeded at 670 with fuzz 2 (offset 30 lines). |
---|
126 | :info:patch Hunk #2 succeeded at 14513 with fuzz 1 (offset 889 lines). |
---|
127 | :info:patch ---> Applying patch-non_ascii.diff |
---|
128 | :debug:patch Environment: |
---|
129 | :debug:patch CC_PRINT_OPTIONS='YES' |
---|
130 | :debug:patch CC_PRINT_OPTIONS_FILE='/opt/local/var/macports/build/_opt_local_var_macports_sources_rsync.macports.org_macports_release_tarballs_ports_devel_libedit/libedit/work/.CC_PRINT_OPTIONS' |
---|
131 | :debug:patch CPATH='/opt/local/include' |
---|
132 | :debug:patch DEVELOPER_DIR='/Developer' |
---|
133 | :debug:patch LIBRARY_PATH='/opt/local/lib' |
---|
134 | :debug:patch MACOSX_DEPLOYMENT_TARGET='10.4' |
---|
135 | :info:patch Executing: cd "/opt/local/var/macports/build/_opt_local_var_macports_sources_rsync.macports.org_macports_release_tarballs_ports_devel_libedit/libedit/work/libedit-20210910-3.1" && /usr/bin/patch -p0 < '/opt/local/var/macports/sources/rsync.macports.org/macports/release/tarballs/ports/devel/libedit/files/patch-non_ascii.diff' |
---|
136 | :debug:patch system: cd "/opt/local/var/macports/build/_opt_local_var_macports_sources_rsync.macports.org_macports_release_tarballs_ports_devel_libedit/libedit/work/libedit-20210910-3.1" && /usr/bin/patch -p0 < '/opt/local/var/macports/sources/rsync.macports.org/macports/release/tarballs/ports/devel/libedit/files/patch-non_ascii.diff' |
---|
137 | :info:patch patching file src/el.c |
---|
138 | :info:patch ---> Applying patch-no_escaping.diff |
---|
139 | :debug:patch Environment: |
---|
140 | :debug:patch CC_PRINT_OPTIONS='YES' |
---|
141 | :debug:patch CC_PRINT_OPTIONS_FILE='/opt/local/var/macports/build/_opt_local_var_macports_sources_rsync.macports.org_macports_release_tarballs_ports_devel_libedit/libedit/work/.CC_PRINT_OPTIONS' |
---|
142 | :debug:patch CPATH='/opt/local/include' |
---|
143 | :debug:patch DEVELOPER_DIR='/Developer' |
---|
144 | :debug:patch LIBRARY_PATH='/opt/local/lib' |
---|
145 | :debug:patch MACOSX_DEPLOYMENT_TARGET='10.4' |
---|
146 | :info:patch Executing: cd "/opt/local/var/macports/build/_opt_local_var_macports_sources_rsync.macports.org_macports_release_tarballs_ports_devel_libedit/libedit/work/libedit-20210910-3.1" && /usr/bin/patch -p0 < '/opt/local/var/macports/sources/rsync.macports.org/macports/release/tarballs/ports/devel/libedit/files/patch-no_escaping.diff' |
---|
147 | :debug:patch system: cd "/opt/local/var/macports/build/_opt_local_var_macports_sources_rsync.macports.org_macports_release_tarballs_ports_devel_libedit/libedit/work/libedit-20210910-3.1" && /usr/bin/patch -p0 < '/opt/local/var/macports/sources/rsync.macports.org/macports/release/tarballs/ports/devel/libedit/files/patch-no_escaping.diff' |
---|
148 | :info:patch patching file src/filecomplete.c |
---|
149 | :debug:patch Privilege de-escalation not attempted as not running as root. |
---|
150 | :debug:configure configure phase started at Tue Nov 9 17:27:11 EST 2021 |
---|
151 | :notice:configure ---> Configuring libedit |
---|
152 | :debug:configure Preferred compilers: apple-gcc-4.2 gcc-4.0 macports-gcc-7 macports-gcc-6 macports-gcc-5 macports-clang-3.4 macports-clang-3.3 |
---|
153 | :debug:configure Using compiler 'MacPorts Apple GCC 4.2' |
---|
154 | :debug:configure Executing org.macports.configure (libedit) |
---|
155 | :debug:configure Environment: |
---|
156 | :debug:configure CC='/opt/local/bin/gcc-apple-4.2' |
---|
157 | :debug:configure CC_PRINT_OPTIONS='YES' |
---|
158 | :debug:configure CC_PRINT_OPTIONS_FILE='/opt/local/var/macports/build/_opt_local_var_macports_sources_rsync.macports.org_macports_release_tarballs_ports_devel_libedit/libedit/work/.CC_PRINT_OPTIONS' |
---|
159 | :debug:configure CFLAGS='-pipe -Os -arch ppc' |
---|
160 | :debug:configure CPATH='/opt/local/include' |
---|
161 | :debug:configure CPPFLAGS='-I/opt/local/include' |
---|
162 | :debug:configure CXX='/opt/local/bin/g++-apple-4.2' |
---|
163 | :debug:configure CXXFLAGS='-pipe -Os -arch ppc' |
---|
164 | :debug:configure DEVELOPER_DIR='/Developer' |
---|
165 | :debug:configure F90FLAGS='-pipe -Os -m32' |
---|
166 | :debug:configure FCFLAGS='-pipe -Os -m32' |
---|
167 | :debug:configure FFLAGS='-pipe -Os -m32' |
---|
168 | :debug:configure INSTALL='/usr/bin/install -c' |
---|
169 | :debug:configure LDFLAGS='-L/opt/local/lib -Wl,-headerpad_max_install_names -arch ppc' |
---|
170 | :debug:configure LIBRARY_PATH='/opt/local/lib' |
---|
171 | :debug:configure MACOSX_DEPLOYMENT_TARGET='10.4' |
---|
172 | :debug:configure OBJC='/opt/local/bin/gcc-apple-4.2' |
---|
173 | :debug:configure OBJCFLAGS='-pipe -Os -arch ppc' |
---|
174 | :debug:configure OBJCXX='/opt/local/bin/g++-apple-4.2' |
---|
175 | :debug:configure OBJCXXFLAGS='-pipe -Os -arch ppc' |
---|
176 | :info:configure Executing: cd "/opt/local/var/macports/build/_opt_local_var_macports_sources_rsync.macports.org_macports_release_tarballs_ports_devel_libedit/libedit/work/libedit-20210910-3.1" && ./configure --prefix=/opt/local --disable-silent-rules --disable-examples |
---|
177 | :debug:configure system: cd "/opt/local/var/macports/build/_opt_local_var_macports_sources_rsync.macports.org_macports_release_tarballs_ports_devel_libedit/libedit/work/libedit-20210910-3.1" && ./configure --prefix=/opt/local --disable-silent-rules --disable-examples |
---|
178 | :info:configure checking for gcc... /opt/local/bin/gcc-apple-4.2 |
---|
179 | :info:configure checking whether the C compiler works... yes |
---|
180 | :info:configure checking for C compiler default output file name... a.out |
---|
181 | :info:configure checking for suffix of executables... |
---|
182 | :info:configure checking whether we are cross compiling... no |
---|
183 | :info:configure checking for suffix of object files... o |
---|
184 | :info:configure checking whether the compiler supports GNU C... yes |
---|
185 | :info:configure checking whether /opt/local/bin/gcc-apple-4.2 accepts -g... yes |
---|
186 | :info:configure checking for /opt/local/bin/gcc-apple-4.2 option to enable C11 features... unsupported |
---|
187 | :info:configure checking for /opt/local/bin/gcc-apple-4.2 option to enable C99 features... -std=gnu99 |
---|
188 | :info:configure checking whether /opt/local/bin/gcc-apple-4.2 -std=gnu99 understands -c and -o together... yes |
---|
189 | :info:configure checking for stdio.h... yes |
---|
190 | :info:configure checking for stdlib.h... yes |
---|
191 | :info:configure checking for string.h... yes |
---|
192 | :info:configure checking for inttypes.h... yes |
---|
193 | :info:configure checking for stdint.h... yes |
---|
194 | :info:configure checking for strings.h... yes |
---|
195 | :info:configure checking for sys/stat.h... yes |
---|
196 | :info:configure checking for sys/types.h... yes |
---|
197 | :info:configure checking for unistd.h... yes |
---|
198 | :info:configure checking for wchar.h... yes |
---|
199 | :info:configure checking for minix/config.h... no |
---|
200 | :info:configure checking for vfork.h... no |
---|
201 | :info:configure checking whether it is safe to define __EXTENSIONS__... yes |
---|
202 | :info:configure checking whether _XOPEN_SOURCE should be defined... no |
---|
203 | :info:configure checking for a BSD-compatible install... /usr/bin/install -c |
---|
204 | :info:configure checking whether build environment is sane... yes |
---|
205 | :info:configure checking for a race-free mkdir -p... /opt/local/bin/gmkdir -p |
---|
206 | :info:configure checking for gawk... gawk |
---|
207 | :info:configure checking whether make sets $(MAKE)... yes |
---|
208 | :info:configure checking whether make supports the include directive... yes (GNU style) |
---|
209 | :info:configure checking whether make supports nested variables... yes |
---|
210 | :info:configure checking dependency style of /opt/local/bin/gcc-apple-4.2 -std=gnu99... gcc3 |
---|
211 | :info:configure checking build system type... powerpc-apple-darwin8.11.0 |
---|
212 | :info:configure checking host system type... powerpc-apple-darwin8.11.0 |
---|
213 | :info:configure checking how to print strings... printf |
---|
214 | :info:configure checking for a sed that does not truncate output... /opt/local/bin/gsed |
---|
215 | :info:configure checking for grep that handles long lines and -e... /opt/local/bin/ggrep |
---|
216 | :info:configure checking for egrep... /opt/local/bin/ggrep -E |
---|
217 | :info:configure checking for fgrep... /opt/local/bin/ggrep -F |
---|
218 | :info:configure checking for ld used by /opt/local/bin/gcc-apple-4.2 -std=gnu99... /opt/local/libexec/apple-gcc42/gcc/powerpc-apple-darwin8/4.2.1/ld |
---|
219 | :info:configure checking if the linker (/opt/local/libexec/apple-gcc42/gcc/powerpc-apple-darwin8/4.2.1/ld) is GNU ld... no |
---|
220 | :info:configure checking for BSD- or MS-compatible name lister (nm)... /usr/bin/nm -p |
---|
221 | :info:configure checking the name lister (/usr/bin/nm -p) interface... BSD nm |
---|
222 | :info:configure checking whether ln -s works... yes |
---|
223 | :info:configure checking the maximum length of command line arguments... 196608 |
---|
224 | :info:configure checking how to convert powerpc-apple-darwin8.11.0 file names to powerpc-apple-darwin8.11.0 format... func_convert_file_noop |
---|
225 | :info:configure checking how to convert powerpc-apple-darwin8.11.0 file names to toolchain format... func_convert_file_noop |
---|
226 | :info:configure checking for /opt/local/libexec/apple-gcc42/gcc/powerpc-apple-darwin8/4.2.1/ld option to reload object files... -r |
---|
227 | :info:configure checking for objdump... no |
---|
228 | :info:configure checking how to recognize dependent libraries... pass_all |
---|
229 | :info:configure checking for dlltool... no |
---|
230 | :info:configure checking how to associate runtime and link libraries... printf %s\n |
---|
231 | :info:configure checking for ar... ar |
---|
232 | :info:configure checking for archiver @FILE support... no |
---|
233 | :info:configure checking for strip... strip |
---|
234 | :info:configure checking for ranlib... ranlib |
---|
235 | :info:configure checking command to parse /usr/bin/nm -p output from /opt/local/bin/gcc-apple-4.2 -std=gnu99 object... ok |
---|
236 | :info:configure checking for sysroot... no |
---|
237 | :info:configure checking for a working dd... /bin/dd |
---|
238 | :info:configure checking how to truncate binary pipes... /bin/dd bs=4096 count=1 |
---|
239 | :info:configure checking for mt... no |
---|
240 | :info:configure checking if : is a manifest tool... no |
---|
241 | :info:configure checking for dsymutil... dsymutil |
---|
242 | :info:configure checking for nmedit... nmedit |
---|
243 | :info:configure checking for lipo... lipo |
---|
244 | :info:configure checking for otool... otool |
---|
245 | :info:configure checking for otool64... otool64 |
---|
246 | :info:configure checking for -single_module linker flag... yes |
---|
247 | :info:configure checking for -exported_symbols_list linker flag... yes |
---|
248 | :info:configure checking for -force_load linker flag... yes |
---|
249 | :info:configure checking for dlfcn.h... yes |
---|
250 | :info:configure checking for objdir... .libs |
---|
251 | :info:configure checking if /opt/local/bin/gcc-apple-4.2 -std=gnu99 supports -fno-rtti -fno-exceptions... no |
---|
252 | :info:configure checking for /opt/local/bin/gcc-apple-4.2 -std=gnu99 option to produce PIC... -fno-common -DPIC |
---|
253 | :info:configure checking if /opt/local/bin/gcc-apple-4.2 -std=gnu99 PIC flag -fno-common -DPIC works... yes |
---|
254 | :info:configure checking if /opt/local/bin/gcc-apple-4.2 -std=gnu99 static flag -static works... no |
---|
255 | :info:configure checking if /opt/local/bin/gcc-apple-4.2 -std=gnu99 supports -c -o file.o... yes |
---|
256 | :info:configure checking if /opt/local/bin/gcc-apple-4.2 -std=gnu99 supports -c -o file.o... (cached) yes |
---|
257 | :info:configure checking whether the /opt/local/bin/gcc-apple-4.2 -std=gnu99 linker (/opt/local/libexec/apple-gcc42/gcc/powerpc-apple-darwin8/4.2.1/ld) supports shared libraries... yes |
---|
258 | :info:configure checking dynamic linker characteristics... darwin8.11.0 dyld |
---|
259 | :info:configure checking how to hardcode library paths into programs... immediate |
---|
260 | :info:configure checking whether stripping libraries is possible... yes |
---|
261 | :info:configure checking if libtool supports shared libraries... yes |
---|
262 | :info:configure checking whether to build shared libraries... yes |
---|
263 | :info:configure checking whether to build static libraries... yes |
---|
264 | :info:configure checking whether make supports nested variables... (cached) yes |
---|
265 | :info:configure checking whether ln -s works... yes |
---|
266 | :info:configure checking for gawk... (cached) gawk |
---|
267 | :info:configure checking for nroff... /usr/bin/nroff |
---|
268 | :info:configure checking for tgetent in -lncurses... yes |
---|
269 | :info:configure checking if you want wide-character code... no |
---|
270 | :info:configure configure: WARNING: --enable-widec is deprecated, wide-character/UTF-8 is always enabled |
---|
271 | :info:configure checking for dirent.h that defines DIR... yes |
---|
272 | :info:configure checking for library containing opendir... none required |
---|
273 | :info:configure checking for egrep... (cached) /opt/local/bin/ggrep -E |
---|
274 | :info:configure checking for sys/wait.h that is POSIX.1 compatible... yes |
---|
275 | :info:configure checking for fcntl.h... yes |
---|
276 | :info:configure checking for limits.h... yes |
---|
277 | :info:configure checking for malloc.h... no |
---|
278 | :info:configure checking for stdlib.h... (cached) yes |
---|
279 | :info:configure checking for string.h... (cached) yes |
---|
280 | :info:configure checking for sys/ioctl.h... yes |
---|
281 | :info:configure checking for sys/param.h... yes |
---|
282 | :info:configure checking for unistd.h... (cached) yes |
---|
283 | :info:configure checking for curses.h... yes |
---|
284 | :info:configure checking for ncurses.h... yes |
---|
285 | :info:configure checking for sys/cdefs.h... yes |
---|
286 | :info:configure checking for termcap.h... yes |
---|
287 | :info:configure checking for ncurses.h... (cached) yes |
---|
288 | :info:configure checking for termios.h... yes |
---|
289 | :info:configure checking for term.h... yes |
---|
290 | :info:configure checking for struct dirent.d_namlen... yes |
---|
291 | :info:configure checking for an ANSI C-conforming const... yes |
---|
292 | :info:configure checking for pid_t... yes |
---|
293 | :info:configure checking for size_t... yes |
---|
294 | :info:configure checking for u_int32_t... yes |
---|
295 | :info:configure checking whether closedir returns void... no |
---|
296 | :info:configure checking for fork... yes |
---|
297 | :info:configure checking for vfork... yes |
---|
298 | :info:configure checking for working fork... yes |
---|
299 | :info:configure checking for working vfork... (cached) yes |
---|
300 | :info:configure checking how to run the C preprocessor... /opt/local/bin/gcc-apple-4.2 -std=gnu99 -E |
---|
301 | :info:configure checking whether /opt/local/bin/gcc-apple-4.2 -std=gnu99 needs -traditional... no |
---|
302 | :info:configure checking return type of signal handlers... void |
---|
303 | :info:configure checking whether lstat correctly handles trailing slash... no |
---|
304 | :info:configure checking whether stat accepts an empty string... no |
---|
305 | :info:configure checking for endpwent... yes |
---|
306 | :info:configure checking for isascii... yes |
---|
307 | :info:configure checking for memchr... yes |
---|
308 | :info:configure checking for memset... yes |
---|
309 | :info:configure checking for re_comp... no |
---|
310 | :info:configure checking for regcomp... yes |
---|
311 | :info:configure checking for strcasecmp... yes |
---|
312 | :info:configure checking for strchr... yes |
---|
313 | :info:configure checking for strcspn... yes |
---|
314 | :info:configure checking for strdup... yes |
---|
315 | :info:configure checking for strerror... yes |
---|
316 | :info:configure checking for strrchr... yes |
---|
317 | :info:configure checking for strstr... yes |
---|
318 | :info:configure checking for strtol... yes |
---|
319 | :info:configure checking for issetugid... yes |
---|
320 | :info:configure checking for wcsdup... no |
---|
321 | :info:configure checking for strlcpy... yes |
---|
322 | :info:configure checking for strlcat... yes |
---|
323 | :info:configure checking for vis... yes |
---|
324 | :info:configure checking for strvis... yes |
---|
325 | :info:configure checking for strunvis... yes |
---|
326 | :info:configure checking for __secure_getenv... no |
---|
327 | :info:configure checking for secure_getenv... no |
---|
328 | :info:configure checking for strlcpy... (cached) yes |
---|
329 | :info:configure checking for strlcat... (cached) yes |
---|
330 | :info:configure checking for getline... no |
---|
331 | :info:configure checking for getline... (cached) no |
---|
332 | :info:configure checking for vis... (cached) yes |
---|
333 | :info:configure checking for unvis... yes |
---|
334 | :info:configure checking whether getpwnam_r and getpwuid_r are posix like... yes |
---|
335 | :info:configure checking whether getpwnam_r and getpwuid_r are posix _draft_ like... no |
---|
336 | :info:configure checking that generated files are newer than configure... done |
---|
337 | :info:configure configure: creating ./config.status |
---|
338 | :info:configure config.status: creating Makefile |
---|
339 | :info:configure config.status: creating libedit.pc |
---|
340 | :info:configure config.status: creating src/Makefile |
---|
341 | :info:configure config.status: creating doc/Makefile |
---|
342 | :info:configure config.status: creating examples/Makefile |
---|
343 | :info:configure config.status: creating config.h |
---|
344 | :info:configure config.status: executing depfiles commands |
---|
345 | :info:configure config.status: executing libtool commands |
---|
346 | :debug:configure Executing portconfigure::configure_finish |
---|
347 | :debug:configure Privilege de-escalation not attempted as not running as root. |
---|
348 | :debug:build build phase started at Tue Nov 9 17:28:08 EST 2021 |
---|
349 | :notice:build ---> Building libedit |
---|
350 | :debug:build Executing org.macports.build (libedit) |
---|
351 | :debug:build Environment: |
---|
352 | :debug:build CC_PRINT_OPTIONS='YES' |
---|
353 | :debug:build CC_PRINT_OPTIONS_FILE='/opt/local/var/macports/build/_opt_local_var_macports_sources_rsync.macports.org_macports_release_tarballs_ports_devel_libedit/libedit/work/.CC_PRINT_OPTIONS' |
---|
354 | :debug:build CPATH='/opt/local/include' |
---|
355 | :debug:build DEVELOPER_DIR='/Developer' |
---|
356 | :debug:build LIBRARY_PATH='/opt/local/lib' |
---|
357 | :debug:build MACOSX_DEPLOYMENT_TARGET='10.4' |
---|
358 | :info:build Executing: cd "/opt/local/var/macports/build/_opt_local_var_macports_sources_rsync.macports.org_macports_release_tarballs_ports_devel_libedit/libedit/work/libedit-20210910-3.1" && /usr/bin/make -j1 -w all |
---|
359 | :debug:build system: cd "/opt/local/var/macports/build/_opt_local_var_macports_sources_rsync.macports.org_macports_release_tarballs_ports_devel_libedit/libedit/work/libedit-20210910-3.1" && /usr/bin/make -j1 -w all |
---|
360 | :info:build make: Entering directory `/opt/local/var/macports/build/_opt_local_var_macports_sources_rsync.macports.org_macports_release_tarballs_ports_devel_libedit/libedit/work/libedit-20210910-3.1' |
---|
361 | :info:build /usr/bin/make all-recursive |
---|
362 | :info:build make[1]: Entering directory `/opt/local/var/macports/build/_opt_local_var_macports_sources_rsync.macports.org_macports_release_tarballs_ports_devel_libedit/libedit/work/libedit-20210910-3.1' |
---|
363 | :info:build Making all in src |
---|
364 | :info:build make[2]: Entering directory `/opt/local/var/macports/build/_opt_local_var_macports_sources_rsync.macports.org_macports_release_tarballs_ports_devel_libedit/libedit/work/libedit-20210910-3.1/src' |
---|
365 | :info:build AWK=gawk sh ./makelist -h ./vi.c > vi.h |
---|
366 | :info:build AWK=gawk sh ./makelist -h ./emacs.c > emacs.h |
---|
367 | :info:build AWK=gawk sh ./makelist -h ./common.c > common.h |
---|
368 | :info:build AWK=gawk sh ./makelist -fh vi.h emacs.h common.h > fcns.h |
---|
369 | :info:build AWK=gawk sh ./makelist -bh ./vi.c ./emacs.c ./common.c > help.h |
---|
370 | :info:build AWK=gawk sh ./makelist -fc vi.h emacs.h common.h > func.h |
---|
371 | :info:build /usr/bin/make all-am |
---|
372 | :info:build make[3]: Entering directory `/opt/local/var/macports/build/_opt_local_var_macports_sources_rsync.macports.org_macports_release_tarballs_ports_devel_libedit/libedit/work/libedit-20210910-3.1/src' |
---|
373 | :info:build /bin/sh ../libtool --tag=CC --mode=compile /opt/local/bin/gcc-apple-4.2 -std=gnu99 -DHAVE_CONFIG_H -I. -I.. -I/opt/local/include -pipe -Os -arch ppc -MT chared.lo -MD -MP -MF .deps/chared.Tpo -c -o chared.lo chared.c |
---|
374 | :info:build libtool: compile: /opt/local/bin/gcc-apple-4.2 -std=gnu99 -DHAVE_CONFIG_H -I. -I.. -I/opt/local/include -pipe -Os -arch ppc -MT chared.lo -MD -MP -MF .deps/chared.Tpo -c chared.c -fno-common -DPIC -o .libs/chared.o |
---|
375 | :info:build In file included from ../config.h:345, |
---|
376 | :info:build from chared.c:35: |
---|
377 | :info:build ./sys.h:119:1: warning: "SIZE_MAX" redefined |
---|
378 | :info:build In file included from /usr/include/sys/_endian.h:88, |
---|
379 | :info:build from /usr/include/ppc/endian.h:107, |
---|
380 | :info:build from /usr/include/machine/endian.h:30, |
---|
381 | :info:build from /usr/include/sys/types.h:75, |
---|
382 | :info:build from ./sys.h:46, |
---|
383 | :info:build from ../config.h:345, |
---|
384 | :info:build from chared.c:35: |
---|
385 | :info:build /opt/local/lib/apple-gcc42/gcc/powerpc-apple-darwin8/4.2.1/include/stdint.h:210:1: warning: this is the location of the previous definition |
---|
386 | :info:build libtool: compile: /opt/local/bin/gcc-apple-4.2 -std=gnu99 -DHAVE_CONFIG_H -I. -I.. -I/opt/local/include -pipe -Os -arch ppc -MT chared.lo -MD -MP -MF .deps/chared.Tpo -c chared.c -o chared.o >/dev/null 2>&1 |
---|
387 | :info:build mv -f .deps/chared.Tpo .deps/chared.Plo |
---|
388 | :info:build /bin/sh ../libtool --tag=CC --mode=compile /opt/local/bin/gcc-apple-4.2 -std=gnu99 -DHAVE_CONFIG_H -I. -I.. -I/opt/local/include -pipe -Os -arch ppc -MT common.lo -MD -MP -MF .deps/common.Tpo -c -o common.lo common.c |
---|
389 | :info:build libtool: compile: /opt/local/bin/gcc-apple-4.2 -std=gnu99 -DHAVE_CONFIG_H -I. -I.. -I/opt/local/include -pipe -Os -arch ppc -MT common.lo -MD -MP -MF .deps/common.Tpo -c common.c -fno-common -DPIC -o .libs/common.o |
---|
390 | :info:build In file included from ../config.h:345, |
---|
391 | :info:build from common.c:35: |
---|
392 | :info:build ./sys.h:119:1: warning: "SIZE_MAX" redefined |
---|
393 | :info:build In file included from /usr/include/sys/_endian.h:88, |
---|
394 | :info:build from /usr/include/ppc/endian.h:107, |
---|
395 | :info:build from /usr/include/machine/endian.h:30, |
---|
396 | :info:build from /usr/include/sys/types.h:75, |
---|
397 | :info:build from ./sys.h:46, |
---|
398 | :info:build from ../config.h:345, |
---|
399 | :info:build from common.c:35: |
---|
400 | :info:build /opt/local/lib/apple-gcc42/gcc/powerpc-apple-darwin8/4.2.1/include/stdint.h:210:1: warning: this is the location of the previous definition |
---|
401 | :info:build libtool: compile: /opt/local/bin/gcc-apple-4.2 -std=gnu99 -DHAVE_CONFIG_H -I. -I.. -I/opt/local/include -pipe -Os -arch ppc -MT common.lo -MD -MP -MF .deps/common.Tpo -c common.c -o common.o >/dev/null 2>&1 |
---|
402 | :info:build mv -f .deps/common.Tpo .deps/common.Plo |
---|
403 | :info:build /bin/sh ../libtool --tag=CC --mode=compile /opt/local/bin/gcc-apple-4.2 -std=gnu99 -DHAVE_CONFIG_H -I. -I.. -I/opt/local/include -pipe -Os -arch ppc -MT el.lo -MD -MP -MF .deps/el.Tpo -c -o el.lo el.c |
---|
404 | :info:build libtool: compile: /opt/local/bin/gcc-apple-4.2 -std=gnu99 -DHAVE_CONFIG_H -I. -I.. -I/opt/local/include -pipe -Os -arch ppc -MT el.lo -MD -MP -MF .deps/el.Tpo -c el.c -fno-common -DPIC -o .libs/el.o |
---|
405 | :info:build In file included from ../config.h:345, |
---|
406 | :info:build from el.c:35: |
---|
407 | :info:build ./sys.h:119:1: warning: "SIZE_MAX" redefined |
---|
408 | :info:build In file included from /usr/include/sys/_endian.h:88, |
---|
409 | :info:build from /usr/include/ppc/endian.h:107, |
---|
410 | :info:build from /usr/include/machine/endian.h:30, |
---|
411 | :info:build from /usr/include/sys/types.h:75, |
---|
412 | :info:build from ./sys.h:46, |
---|
413 | :info:build from ../config.h:345, |
---|
414 | :info:build from el.c:35: |
---|
415 | :info:build /opt/local/lib/apple-gcc42/gcc/powerpc-apple-darwin8/4.2.1/include/stdint.h:210:1: warning: this is the location of the previous definition |
---|
416 | :info:build libtool: compile: /opt/local/bin/gcc-apple-4.2 -std=gnu99 -DHAVE_CONFIG_H -I. -I.. -I/opt/local/include -pipe -Os -arch ppc -MT el.lo -MD -MP -MF .deps/el.Tpo -c el.c -o el.o >/dev/null 2>&1 |
---|
417 | :info:build mv -f .deps/el.Tpo .deps/el.Plo |
---|
418 | :info:build /bin/sh ../libtool --tag=CC --mode=compile /opt/local/bin/gcc-apple-4.2 -std=gnu99 -DHAVE_CONFIG_H -I. -I.. -I/opt/local/include -pipe -Os -arch ppc -MT eln.lo -MD -MP -MF .deps/eln.Tpo -c -o eln.lo eln.c |
---|
419 | :info:build libtool: compile: /opt/local/bin/gcc-apple-4.2 -std=gnu99 -DHAVE_CONFIG_H -I. -I.. -I/opt/local/include -pipe -Os -arch ppc -MT eln.lo -MD -MP -MF .deps/eln.Tpo -c eln.c -fno-common -DPIC -o .libs/eln.o |
---|
420 | :info:build In file included from ../config.h:345, |
---|
421 | :info:build from eln.c:28: |
---|
422 | :info:build ./sys.h:119:1: warning: "SIZE_MAX" redefined |
---|
423 | :info:build In file included from /usr/include/sys/_endian.h:88, |
---|
424 | :info:build from /usr/include/ppc/endian.h:107, |
---|
425 | :info:build from /usr/include/machine/endian.h:30, |
---|
426 | :info:build from /usr/include/sys/types.h:75, |
---|
427 | :info:build from ./sys.h:46, |
---|
428 | :info:build from ../config.h:345, |
---|
429 | :info:build from eln.c:28: |
---|
430 | :info:build /opt/local/lib/apple-gcc42/gcc/powerpc-apple-darwin8/4.2.1/include/stdint.h:210:1: warning: this is the location of the previous definition |
---|
431 | :info:build libtool: compile: /opt/local/bin/gcc-apple-4.2 -std=gnu99 -DHAVE_CONFIG_H -I. -I.. -I/opt/local/include -pipe -Os -arch ppc -MT eln.lo -MD -MP -MF .deps/eln.Tpo -c eln.c -o eln.o >/dev/null 2>&1 |
---|
432 | :info:build mv -f .deps/eln.Tpo .deps/eln.Plo |
---|
433 | :info:build /bin/sh ../libtool --tag=CC --mode=compile /opt/local/bin/gcc-apple-4.2 -std=gnu99 -DHAVE_CONFIG_H -I. -I.. -I/opt/local/include -pipe -Os -arch ppc -MT emacs.lo -MD -MP -MF .deps/emacs.Tpo -c -o emacs.lo emacs.c |
---|
434 | :info:build libtool: compile: /opt/local/bin/gcc-apple-4.2 -std=gnu99 -DHAVE_CONFIG_H -I. -I.. -I/opt/local/include -pipe -Os -arch ppc -MT emacs.lo -MD -MP -MF .deps/emacs.Tpo -c emacs.c -fno-common -DPIC -o .libs/emacs.o |
---|
435 | :info:build In file included from ../config.h:345, |
---|
436 | :info:build from emacs.c:35: |
---|
437 | :info:build ./sys.h:119:1: warning: "SIZE_MAX" redefined |
---|
438 | :info:build In file included from /usr/include/sys/_endian.h:88, |
---|
439 | :info:build from /usr/include/ppc/endian.h:107, |
---|
440 | :info:build from /usr/include/machine/endian.h:30, |
---|
441 | :info:build from /usr/include/sys/types.h:75, |
---|
442 | :info:build from ./sys.h:46, |
---|
443 | :info:build from ../config.h:345, |
---|
444 | :info:build from emacs.c:35: |
---|
445 | :info:build /opt/local/lib/apple-gcc42/gcc/powerpc-apple-darwin8/4.2.1/include/stdint.h:210:1: warning: this is the location of the previous definition |
---|
446 | :info:build libtool: compile: /opt/local/bin/gcc-apple-4.2 -std=gnu99 -DHAVE_CONFIG_H -I. -I.. -I/opt/local/include -pipe -Os -arch ppc -MT emacs.lo -MD -MP -MF .deps/emacs.Tpo -c emacs.c -o emacs.o >/dev/null 2>&1 |
---|
447 | :info:build mv -f .deps/emacs.Tpo .deps/emacs.Plo |
---|
448 | :info:build /bin/sh ../libtool --tag=CC --mode=compile /opt/local/bin/gcc-apple-4.2 -std=gnu99 -DHAVE_CONFIG_H -I. -I.. -I/opt/local/include -pipe -Os -arch ppc -MT hist.lo -MD -MP -MF .deps/hist.Tpo -c -o hist.lo hist.c |
---|
449 | :info:build libtool: compile: /opt/local/bin/gcc-apple-4.2 -std=gnu99 -DHAVE_CONFIG_H -I. -I.. -I/opt/local/include -pipe -Os -arch ppc -MT hist.lo -MD -MP -MF .deps/hist.Tpo -c hist.c -fno-common -DPIC -o .libs/hist.o |
---|
450 | :info:build In file included from ../config.h:345, |
---|
451 | :info:build from hist.c:35: |
---|
452 | :info:build ./sys.h:119:1: warning: "SIZE_MAX" redefined |
---|
453 | :info:build In file included from /usr/include/sys/_endian.h:88, |
---|
454 | :info:build from /usr/include/ppc/endian.h:107, |
---|
455 | :info:build from /usr/include/machine/endian.h:30, |
---|
456 | :info:build from /usr/include/sys/types.h:75, |
---|
457 | :info:build from ./sys.h:46, |
---|
458 | :info:build from ../config.h:345, |
---|
459 | :info:build from hist.c:35: |
---|
460 | :info:build /opt/local/lib/apple-gcc42/gcc/powerpc-apple-darwin8/4.2.1/include/stdint.h:210:1: warning: this is the location of the previous definition |
---|
461 | :info:build libtool: compile: /opt/local/bin/gcc-apple-4.2 -std=gnu99 -DHAVE_CONFIG_H -I. -I.. -I/opt/local/include -pipe -Os -arch ppc -MT hist.lo -MD -MP -MF .deps/hist.Tpo -c hist.c -o hist.o >/dev/null 2>&1 |
---|
462 | :info:build mv -f .deps/hist.Tpo .deps/hist.Plo |
---|
463 | :info:build /bin/sh ../libtool --tag=CC --mode=compile /opt/local/bin/gcc-apple-4.2 -std=gnu99 -DHAVE_CONFIG_H -I. -I.. -I/opt/local/include -pipe -Os -arch ppc -MT keymacro.lo -MD -MP -MF .deps/keymacro.Tpo -c -o keymacro.lo keymacro.c |
---|
464 | :info:build libtool: compile: /opt/local/bin/gcc-apple-4.2 -std=gnu99 -DHAVE_CONFIG_H -I. -I.. -I/opt/local/include -pipe -Os -arch ppc -MT keymacro.lo -MD -MP -MF .deps/keymacro.Tpo -c keymacro.c -fno-common -DPIC -o .libs/keymacro.o |
---|
465 | :info:build In file included from ../config.h:345, |
---|
466 | :info:build from keymacro.c:35: |
---|
467 | :info:build ./sys.h:119:1: warning: "SIZE_MAX" redefined |
---|
468 | :info:build In file included from /usr/include/sys/_endian.h:88, |
---|
469 | :info:build from /usr/include/ppc/endian.h:107, |
---|
470 | :info:build from /usr/include/machine/endian.h:30, |
---|
471 | :info:build from /usr/include/sys/types.h:75, |
---|
472 | :info:build from ./sys.h:46, |
---|
473 | :info:build from ../config.h:345, |
---|
474 | :info:build from keymacro.c:35: |
---|
475 | :info:build /opt/local/lib/apple-gcc42/gcc/powerpc-apple-darwin8/4.2.1/include/stdint.h:210:1: warning: this is the location of the previous definition |
---|
476 | :info:build libtool: compile: /opt/local/bin/gcc-apple-4.2 -std=gnu99 -DHAVE_CONFIG_H -I. -I.. -I/opt/local/include -pipe -Os -arch ppc -MT keymacro.lo -MD -MP -MF .deps/keymacro.Tpo -c keymacro.c -o keymacro.o >/dev/null 2>&1 |
---|
477 | :info:build mv -f .deps/keymacro.Tpo .deps/keymacro.Plo |
---|
478 | :info:build /bin/sh ../libtool --tag=CC --mode=compile /opt/local/bin/gcc-apple-4.2 -std=gnu99 -DHAVE_CONFIG_H -I. -I.. -I/opt/local/include -pipe -Os -arch ppc -MT map.lo -MD -MP -MF .deps/map.Tpo -c -o map.lo map.c |
---|
479 | :info:build libtool: compile: /opt/local/bin/gcc-apple-4.2 -std=gnu99 -DHAVE_CONFIG_H -I. -I.. -I/opt/local/include -pipe -Os -arch ppc -MT map.lo -MD -MP -MF .deps/map.Tpo -c map.c -fno-common -DPIC -o .libs/map.o |
---|
480 | :info:build In file included from ../config.h:345, |
---|
481 | :info:build from map.c:35: |
---|
482 | :info:build ./sys.h:119:1: warning: "SIZE_MAX" redefined |
---|
483 | :info:build In file included from /usr/include/sys/_endian.h:88, |
---|
484 | :info:build from /usr/include/ppc/endian.h:107, |
---|
485 | :info:build from /usr/include/machine/endian.h:30, |
---|
486 | :info:build from /usr/include/sys/types.h:75, |
---|
487 | :info:build from ./sys.h:46, |
---|
488 | :info:build from ../config.h:345, |
---|
489 | :info:build from map.c:35: |
---|
490 | :info:build /opt/local/lib/apple-gcc42/gcc/powerpc-apple-darwin8/4.2.1/include/stdint.h:210:1: warning: this is the location of the previous definition |
---|
491 | :info:build libtool: compile: /opt/local/bin/gcc-apple-4.2 -std=gnu99 -DHAVE_CONFIG_H -I. -I.. -I/opt/local/include -pipe -Os -arch ppc -MT map.lo -MD -MP -MF .deps/map.Tpo -c map.c -o map.o >/dev/null 2>&1 |
---|
492 | :info:build mv -f .deps/map.Tpo .deps/map.Plo |
---|
493 | :info:build /bin/sh ../libtool --tag=CC --mode=compile /opt/local/bin/gcc-apple-4.2 -std=gnu99 -DHAVE_CONFIG_H -I. -I.. -I/opt/local/include -pipe -Os -arch ppc -MT chartype.lo -MD -MP -MF .deps/chartype.Tpo -c -o chartype.lo chartype.c |
---|
494 | :info:build libtool: compile: /opt/local/bin/gcc-apple-4.2 -std=gnu99 -DHAVE_CONFIG_H -I. -I.. -I/opt/local/include -pipe -Os -arch ppc -MT chartype.lo -MD -MP -MF .deps/chartype.Tpo -c chartype.c -fno-common -DPIC -o .libs/chartype.o |
---|
495 | :info:build In file included from ../config.h:345, |
---|
496 | :info:build from chartype.c:32: |
---|
497 | :info:build ./sys.h:119:1: warning: "SIZE_MAX" redefined |
---|
498 | :info:build In file included from /usr/include/sys/_endian.h:88, |
---|
499 | :info:build from /usr/include/ppc/endian.h:107, |
---|
500 | :info:build from /usr/include/machine/endian.h:30, |
---|
501 | :info:build from /usr/include/sys/types.h:75, |
---|
502 | :info:build from ./sys.h:46, |
---|
503 | :info:build from ../config.h:345, |
---|
504 | :info:build from chartype.c:32: |
---|
505 | :info:build /opt/local/lib/apple-gcc42/gcc/powerpc-apple-darwin8/4.2.1/include/stdint.h:210:1: warning: this is the location of the previous definition |
---|
506 | :info:build libtool: compile: /opt/local/bin/gcc-apple-4.2 -std=gnu99 -DHAVE_CONFIG_H -I. -I.. -I/opt/local/include -pipe -Os -arch ppc -MT chartype.lo -MD -MP -MF .deps/chartype.Tpo -c chartype.c -o chartype.o >/dev/null 2>&1 |
---|
507 | :info:build mv -f .deps/chartype.Tpo .deps/chartype.Plo |
---|
508 | :info:build /bin/sh ../libtool --tag=CC --mode=compile /opt/local/bin/gcc-apple-4.2 -std=gnu99 -DHAVE_CONFIG_H -I. -I.. -I/opt/local/include -pipe -Os -arch ppc -MT parse.lo -MD -MP -MF .deps/parse.Tpo -c -o parse.lo parse.c |
---|
509 | :info:build libtool: compile: /opt/local/bin/gcc-apple-4.2 -std=gnu99 -DHAVE_CONFIG_H -I. -I.. -I/opt/local/include -pipe -Os -arch ppc -MT parse.lo -MD -MP -MF .deps/parse.Tpo -c parse.c -fno-common -DPIC -o .libs/parse.o |
---|
510 | :info:build In file included from ../config.h:345, |
---|
511 | :info:build from parse.c:35: |
---|
512 | :info:build ./sys.h:119:1: warning: "SIZE_MAX" redefined |
---|
513 | :info:build In file included from /usr/include/sys/_endian.h:88, |
---|
514 | :info:build from /usr/include/ppc/endian.h:107, |
---|
515 | :info:build from /usr/include/machine/endian.h:30, |
---|
516 | :info:build from /usr/include/sys/types.h:75, |
---|
517 | :info:build from ./sys.h:46, |
---|
518 | :info:build from ../config.h:345, |
---|
519 | :info:build from parse.c:35: |
---|
520 | :info:build /opt/local/lib/apple-gcc42/gcc/powerpc-apple-darwin8/4.2.1/include/stdint.h:210:1: warning: this is the location of the previous definition |
---|
521 | :info:build libtool: compile: /opt/local/bin/gcc-apple-4.2 -std=gnu99 -DHAVE_CONFIG_H -I. -I.. -I/opt/local/include -pipe -Os -arch ppc -MT parse.lo -MD -MP -MF .deps/parse.Tpo -c parse.c -o parse.o >/dev/null 2>&1 |
---|
522 | :info:build mv -f .deps/parse.Tpo .deps/parse.Plo |
---|
523 | :info:build /bin/sh ../libtool --tag=CC --mode=compile /opt/local/bin/gcc-apple-4.2 -std=gnu99 -DHAVE_CONFIG_H -I. -I.. -I/opt/local/include -pipe -Os -arch ppc -MT prompt.lo -MD -MP -MF .deps/prompt.Tpo -c -o prompt.lo prompt.c |
---|
524 | :info:build libtool: compile: /opt/local/bin/gcc-apple-4.2 -std=gnu99 -DHAVE_CONFIG_H -I. -I.. -I/opt/local/include -pipe -Os -arch ppc -MT prompt.lo -MD -MP -MF .deps/prompt.Tpo -c prompt.c -fno-common -DPIC -o .libs/prompt.o |
---|
525 | :info:build In file included from ../config.h:345, |
---|
526 | :info:build from prompt.c:35: |
---|
527 | :info:build ./sys.h:119:1: warning: "SIZE_MAX" redefined |
---|
528 | :info:build In file included from /usr/include/sys/_endian.h:88, |
---|
529 | :info:build from /usr/include/ppc/endian.h:107, |
---|
530 | :info:build from /usr/include/machine/endian.h:30, |
---|
531 | :info:build from /usr/include/sys/types.h:75, |
---|
532 | :info:build from ./sys.h:46, |
---|
533 | :info:build from ../config.h:345, |
---|
534 | :info:build from prompt.c:35: |
---|
535 | :info:build /opt/local/lib/apple-gcc42/gcc/powerpc-apple-darwin8/4.2.1/include/stdint.h:210:1: warning: this is the location of the previous definition |
---|
536 | :info:build libtool: compile: /opt/local/bin/gcc-apple-4.2 -std=gnu99 -DHAVE_CONFIG_H -I. -I.. -I/opt/local/include -pipe -Os -arch ppc -MT prompt.lo -MD -MP -MF .deps/prompt.Tpo -c prompt.c -o prompt.o >/dev/null 2>&1 |
---|
537 | :info:build mv -f .deps/prompt.Tpo .deps/prompt.Plo |
---|
538 | :info:build /bin/sh ../libtool --tag=CC --mode=compile /opt/local/bin/gcc-apple-4.2 -std=gnu99 -DHAVE_CONFIG_H -I. -I.. -I/opt/local/include -pipe -Os -arch ppc -MT read.lo -MD -MP -MF .deps/read.Tpo -c -o read.lo read.c |
---|
539 | :info:build libtool: compile: /opt/local/bin/gcc-apple-4.2 -std=gnu99 -DHAVE_CONFIG_H -I. -I.. -I/opt/local/include -pipe -Os -arch ppc -MT read.lo -MD -MP -MF .deps/read.Tpo -c read.c -fno-common -DPIC -o .libs/read.o |
---|
540 | :info:build In file included from ../config.h:345, |
---|
541 | :info:build from read.c:35: |
---|
542 | :info:build ./sys.h:119:1: warning: "SIZE_MAX" redefined |
---|
543 | :info:build In file included from /usr/include/sys/_endian.h:88, |
---|
544 | :info:build from /usr/include/ppc/endian.h:107, |
---|
545 | :info:build from /usr/include/machine/endian.h:30, |
---|
546 | :info:build from /usr/include/sys/types.h:75, |
---|
547 | :info:build from ./sys.h:46, |
---|
548 | :info:build from ../config.h:345, |
---|
549 | :info:build from read.c:35: |
---|
550 | :info:build /opt/local/lib/apple-gcc42/gcc/powerpc-apple-darwin8/4.2.1/include/stdint.h:210:1: warning: this is the location of the previous definition |
---|
551 | :info:build libtool: compile: /opt/local/bin/gcc-apple-4.2 -std=gnu99 -DHAVE_CONFIG_H -I. -I.. -I/opt/local/include -pipe -Os -arch ppc -MT read.lo -MD -MP -MF .deps/read.Tpo -c read.c -o read.o >/dev/null 2>&1 |
---|
552 | :info:build mv -f .deps/read.Tpo .deps/read.Plo |
---|
553 | :info:build /bin/sh ../libtool --tag=CC --mode=compile /opt/local/bin/gcc-apple-4.2 -std=gnu99 -DHAVE_CONFIG_H -I. -I.. -I/opt/local/include -pipe -Os -arch ppc -MT refresh.lo -MD -MP -MF .deps/refresh.Tpo -c -o refresh.lo refresh.c |
---|
554 | :info:build libtool: compile: /opt/local/bin/gcc-apple-4.2 -std=gnu99 -DHAVE_CONFIG_H -I. -I.. -I/opt/local/include -pipe -Os -arch ppc -MT refresh.lo -MD -MP -MF .deps/refresh.Tpo -c refresh.c -fno-common -DPIC -o .libs/refresh.o |
---|
555 | :info:build In file included from ../config.h:345, |
---|
556 | :info:build from refresh.c:35: |
---|
557 | :info:build ./sys.h:119:1: warning: "SIZE_MAX" redefined |
---|
558 | :info:build In file included from /usr/include/sys/_endian.h:88, |
---|
559 | :info:build from /usr/include/ppc/endian.h:107, |
---|
560 | :info:build from /usr/include/machine/endian.h:30, |
---|
561 | :info:build from /usr/include/sys/types.h:75, |
---|
562 | :info:build from ./sys.h:46, |
---|
563 | :info:build from ../config.h:345, |
---|
564 | :info:build from refresh.c:35: |
---|
565 | :info:build /opt/local/lib/apple-gcc42/gcc/powerpc-apple-darwin8/4.2.1/include/stdint.h:210:1: warning: this is the location of the previous definition |
---|
566 | :info:build libtool: compile: /opt/local/bin/gcc-apple-4.2 -std=gnu99 -DHAVE_CONFIG_H -I. -I.. -I/opt/local/include -pipe -Os -arch ppc -MT refresh.lo -MD -MP -MF .deps/refresh.Tpo -c refresh.c -o refresh.o >/dev/null 2>&1 |
---|
567 | :info:build mv -f .deps/refresh.Tpo .deps/refresh.Plo |
---|
568 | :info:build /bin/sh ../libtool --tag=CC --mode=compile /opt/local/bin/gcc-apple-4.2 -std=gnu99 -DHAVE_CONFIG_H -I. -I.. -I/opt/local/include -pipe -Os -arch ppc -MT search.lo -MD -MP -MF .deps/search.Tpo -c -o search.lo search.c |
---|
569 | :info:build libtool: compile: /opt/local/bin/gcc-apple-4.2 -std=gnu99 -DHAVE_CONFIG_H -I. -I.. -I/opt/local/include -pipe -Os -arch ppc -MT search.lo -MD -MP -MF .deps/search.Tpo -c search.c -fno-common -DPIC -o .libs/search.o |
---|
570 | :info:build In file included from ../config.h:345, |
---|
571 | :info:build from search.c:35: |
---|
572 | :info:build ./sys.h:119:1: warning: "SIZE_MAX" redefined |
---|
573 | :info:build In file included from /usr/include/sys/_endian.h:88, |
---|
574 | :info:build from /usr/include/ppc/endian.h:107, |
---|
575 | :info:build from /usr/include/machine/endian.h:30, |
---|
576 | :info:build from /usr/include/sys/types.h:75, |
---|
577 | :info:build from ./sys.h:46, |
---|
578 | :info:build from ../config.h:345, |
---|
579 | :info:build from search.c:35: |
---|
580 | :info:build /opt/local/lib/apple-gcc42/gcc/powerpc-apple-darwin8/4.2.1/include/stdint.h:210:1: warning: this is the location of the previous definition |
---|
581 | :info:build libtool: compile: /opt/local/bin/gcc-apple-4.2 -std=gnu99 -DHAVE_CONFIG_H -I. -I.. -I/opt/local/include -pipe -Os -arch ppc -MT search.lo -MD -MP -MF .deps/search.Tpo -c search.c -o search.o >/dev/null 2>&1 |
---|
582 | :info:build mv -f .deps/search.Tpo .deps/search.Plo |
---|
583 | :info:build /bin/sh ../libtool --tag=CC --mode=compile /opt/local/bin/gcc-apple-4.2 -std=gnu99 -DHAVE_CONFIG_H -I. -I.. -I/opt/local/include -pipe -Os -arch ppc -MT sig.lo -MD -MP -MF .deps/sig.Tpo -c -o sig.lo sig.c |
---|
584 | :info:build libtool: compile: /opt/local/bin/gcc-apple-4.2 -std=gnu99 -DHAVE_CONFIG_H -I. -I.. -I/opt/local/include -pipe -Os -arch ppc -MT sig.lo -MD -MP -MF .deps/sig.Tpo -c sig.c -fno-common -DPIC -o .libs/sig.o |
---|
585 | :info:build In file included from ../config.h:345, |
---|
586 | :info:build from sig.c:35: |
---|
587 | :info:build ./sys.h:119:1: warning: "SIZE_MAX" redefined |
---|
588 | :info:build In file included from /usr/include/sys/_endian.h:88, |
---|
589 | :info:build from /usr/include/ppc/endian.h:107, |
---|
590 | :info:build from /usr/include/machine/endian.h:30, |
---|
591 | :info:build from /usr/include/sys/types.h:75, |
---|
592 | :info:build from ./sys.h:46, |
---|
593 | :info:build from ../config.h:345, |
---|
594 | :info:build from sig.c:35: |
---|
595 | :info:build /opt/local/lib/apple-gcc42/gcc/powerpc-apple-darwin8/4.2.1/include/stdint.h:210:1: warning: this is the location of the previous definition |
---|
596 | :info:build libtool: compile: /opt/local/bin/gcc-apple-4.2 -std=gnu99 -DHAVE_CONFIG_H -I. -I.. -I/opt/local/include -pipe -Os -arch ppc -MT sig.lo -MD -MP -MF .deps/sig.Tpo -c sig.c -o sig.o >/dev/null 2>&1 |
---|
597 | :info:build mv -f .deps/sig.Tpo .deps/sig.Plo |
---|
598 | :info:build /bin/sh ../libtool --tag=CC --mode=compile /opt/local/bin/gcc-apple-4.2 -std=gnu99 -DHAVE_CONFIG_H -I. -I.. -I/opt/local/include -pipe -Os -arch ppc -MT terminal.lo -MD -MP -MF .deps/terminal.Tpo -c -o terminal.lo terminal.c |
---|
599 | :info:build libtool: compile: /opt/local/bin/gcc-apple-4.2 -std=gnu99 -DHAVE_CONFIG_H -I. -I.. -I/opt/local/include -pipe -Os -arch ppc -MT terminal.lo -MD -MP -MF .deps/terminal.Tpo -c terminal.c -fno-common -DPIC -o .libs/terminal.o |
---|
600 | :info:build In file included from ../config.h:345, |
---|
601 | :info:build from terminal.c:35: |
---|
602 | :info:build ./sys.h:119:1: warning: "SIZE_MAX" redefined |
---|
603 | :info:build In file included from /usr/include/sys/_endian.h:88, |
---|
604 | :info:build from /usr/include/ppc/endian.h:107, |
---|
605 | :info:build from /usr/include/machine/endian.h:30, |
---|
606 | :info:build from /usr/include/sys/types.h:75, |
---|
607 | :info:build from ./sys.h:46, |
---|
608 | :info:build from ../config.h:345, |
---|
609 | :info:build from terminal.c:35: |
---|
610 | :info:build /opt/local/lib/apple-gcc42/gcc/powerpc-apple-darwin8/4.2.1/include/stdint.h:210:1: warning: this is the location of the previous definition |
---|
611 | :info:build libtool: compile: /opt/local/bin/gcc-apple-4.2 -std=gnu99 -DHAVE_CONFIG_H -I. -I.. -I/opt/local/include -pipe -Os -arch ppc -MT terminal.lo -MD -MP -MF .deps/terminal.Tpo -c terminal.c -o terminal.o >/dev/null 2>&1 |
---|
612 | :info:build mv -f .deps/terminal.Tpo .deps/terminal.Plo |
---|
613 | :info:build /bin/sh ../libtool --tag=CC --mode=compile /opt/local/bin/gcc-apple-4.2 -std=gnu99 -DHAVE_CONFIG_H -I. -I.. -I/opt/local/include -pipe -Os -arch ppc -MT tty.lo -MD -MP -MF .deps/tty.Tpo -c -o tty.lo tty.c |
---|
614 | :info:build libtool: compile: /opt/local/bin/gcc-apple-4.2 -std=gnu99 -DHAVE_CONFIG_H -I. -I.. -I/opt/local/include -pipe -Os -arch ppc -MT tty.lo -MD -MP -MF .deps/tty.Tpo -c tty.c -fno-common -DPIC -o .libs/tty.o |
---|
615 | :info:build In file included from ../config.h:345, |
---|
616 | :info:build from tty.c:35: |
---|
617 | :info:build ./sys.h:119:1: warning: "SIZE_MAX" redefined |
---|
618 | :info:build In file included from /usr/include/sys/_endian.h:88, |
---|
619 | :info:build from /usr/include/ppc/endian.h:107, |
---|
620 | :info:build from /usr/include/machine/endian.h:30, |
---|
621 | :info:build from /usr/include/sys/types.h:75, |
---|
622 | :info:build from ./sys.h:46, |
---|
623 | :info:build from ../config.h:345, |
---|
624 | :info:build from tty.c:35: |
---|
625 | :info:build /opt/local/lib/apple-gcc42/gcc/powerpc-apple-darwin8/4.2.1/include/stdint.h:210:1: warning: this is the location of the previous definition |
---|
626 | :info:build libtool: compile: /opt/local/bin/gcc-apple-4.2 -std=gnu99 -DHAVE_CONFIG_H -I. -I.. -I/opt/local/include -pipe -Os -arch ppc -MT tty.lo -MD -MP -MF .deps/tty.Tpo -c tty.c -o tty.o >/dev/null 2>&1 |
---|
627 | :info:build mv -f .deps/tty.Tpo .deps/tty.Plo |
---|
628 | :info:build /bin/sh ../libtool --tag=CC --mode=compile /opt/local/bin/gcc-apple-4.2 -std=gnu99 -DHAVE_CONFIG_H -I. -I.. -I/opt/local/include -pipe -Os -arch ppc -MT vi.lo -MD -MP -MF .deps/vi.Tpo -c -o vi.lo vi.c |
---|
629 | :info:build libtool: compile: /opt/local/bin/gcc-apple-4.2 -std=gnu99 -DHAVE_CONFIG_H -I. -I.. -I/opt/local/include -pipe -Os -arch ppc -MT vi.lo -MD -MP -MF .deps/vi.Tpo -c vi.c -fno-common -DPIC -o .libs/vi.o |
---|
630 | :info:build In file included from ../config.h:345, |
---|
631 | :info:build from vi.c:35: |
---|
632 | :info:build ./sys.h:119:1: warning: "SIZE_MAX" redefined |
---|
633 | :info:build In file included from /usr/include/sys/_endian.h:88, |
---|
634 | :info:build from /usr/include/ppc/endian.h:107, |
---|
635 | :info:build from /usr/include/machine/endian.h:30, |
---|
636 | :info:build from /usr/include/sys/types.h:75, |
---|
637 | :info:build from ./sys.h:46, |
---|
638 | :info:build from ../config.h:345, |
---|
639 | :info:build from vi.c:35: |
---|
640 | :info:build /opt/local/lib/apple-gcc42/gcc/powerpc-apple-darwin8/4.2.1/include/stdint.h:210:1: warning: this is the location of the previous definition |
---|
641 | :info:build libtool: compile: /opt/local/bin/gcc-apple-4.2 -std=gnu99 -DHAVE_CONFIG_H -I. -I.. -I/opt/local/include -pipe -Os -arch ppc -MT vi.lo -MD -MP -MF .deps/vi.Tpo -c vi.c -o vi.o >/dev/null 2>&1 |
---|
642 | :info:build mv -f .deps/vi.Tpo .deps/vi.Plo |
---|
643 | :info:build /bin/sh ../libtool --tag=CC --mode=compile /opt/local/bin/gcc-apple-4.2 -std=gnu99 -DHAVE_CONFIG_H -I. -I.. -I/opt/local/include -pipe -Os -arch ppc -MT wcsdup.lo -MD -MP -MF .deps/wcsdup.Tpo -c -o wcsdup.lo wcsdup.c |
---|
644 | :info:build libtool: compile: /opt/local/bin/gcc-apple-4.2 -std=gnu99 -DHAVE_CONFIG_H -I. -I.. -I/opt/local/include -pipe -Os -arch ppc -MT wcsdup.lo -MD -MP -MF .deps/wcsdup.Tpo -c wcsdup.c -fno-common -DPIC -o .libs/wcsdup.o |
---|
645 | :info:build In file included from ../config.h:345, |
---|
646 | :info:build from wcsdup.c:16: |
---|
647 | :info:build ./sys.h:119:1: warning: "SIZE_MAX" redefined |
---|
648 | :info:build In file included from /usr/include/sys/_endian.h:88, |
---|
649 | :info:build from /usr/include/ppc/endian.h:107, |
---|
650 | :info:build from /usr/include/machine/endian.h:30, |
---|
651 | :info:build from /usr/include/sys/types.h:75, |
---|
652 | :info:build from ./sys.h:46, |
---|
653 | :info:build from ../config.h:345, |
---|
654 | :info:build from wcsdup.c:16: |
---|
655 | :info:build /opt/local/lib/apple-gcc42/gcc/powerpc-apple-darwin8/4.2.1/include/stdint.h:210:1: warning: this is the location of the previous definition |
---|
656 | :info:build libtool: compile: /opt/local/bin/gcc-apple-4.2 -std=gnu99 -DHAVE_CONFIG_H -I. -I.. -I/opt/local/include -pipe -Os -arch ppc -MT wcsdup.lo -MD -MP -MF .deps/wcsdup.Tpo -c wcsdup.c -o wcsdup.o >/dev/null 2>&1 |
---|
657 | :info:build mv -f .deps/wcsdup.Tpo .deps/wcsdup.Plo |
---|
658 | :info:build /bin/sh ../libtool --tag=CC --mode=compile /opt/local/bin/gcc-apple-4.2 -std=gnu99 -DHAVE_CONFIG_H -I. -I.. -I/opt/local/include -pipe -Os -arch ppc -MT tokenizer.lo -MD -MP -MF .deps/tokenizer.Tpo -c -o tokenizer.lo tokenizer.c |
---|
659 | :info:build libtool: compile: /opt/local/bin/gcc-apple-4.2 -std=gnu99 -DHAVE_CONFIG_H -I. -I.. -I/opt/local/include -pipe -Os -arch ppc -MT tokenizer.lo -MD -MP -MF .deps/tokenizer.Tpo -c tokenizer.c -fno-common -DPIC -o .libs/tokenizer.o |
---|
660 | :info:build In file included from ../config.h:345, |
---|
661 | :info:build from tokenizer.c:36: |
---|
662 | :info:build ./sys.h:119:1: warning: "SIZE_MAX" redefined |
---|
663 | :info:build In file included from /usr/include/sys/_endian.h:88, |
---|
664 | :info:build from /usr/include/ppc/endian.h:107, |
---|
665 | :info:build from /usr/include/machine/endian.h:30, |
---|
666 | :info:build from /usr/include/sys/types.h:75, |
---|
667 | :info:build from ./sys.h:46, |
---|
668 | :info:build from ../config.h:345, |
---|
669 | :info:build from tokenizer.c:36: |
---|
670 | :info:build /opt/local/lib/apple-gcc42/gcc/powerpc-apple-darwin8/4.2.1/include/stdint.h:210:1: warning: this is the location of the previous definition |
---|
671 | :info:build libtool: compile: /opt/local/bin/gcc-apple-4.2 -std=gnu99 -DHAVE_CONFIG_H -I. -I.. -I/opt/local/include -pipe -Os -arch ppc -MT tokenizer.lo -MD -MP -MF .deps/tokenizer.Tpo -c tokenizer.c -o tokenizer.o >/dev/null 2>&1 |
---|
672 | :info:build mv -f .deps/tokenizer.Tpo .deps/tokenizer.Plo |
---|
673 | :info:build /bin/sh ../libtool --tag=CC --mode=compile /opt/local/bin/gcc-apple-4.2 -std=gnu99 -DHAVE_CONFIG_H -I. -I.. -I/opt/local/include -pipe -Os -arch ppc -MT tokenizern.lo -MD -MP -MF .deps/tokenizern.Tpo -c -o tokenizern.lo tokenizern.c |
---|
674 | :info:build libtool: compile: /opt/local/bin/gcc-apple-4.2 -std=gnu99 -DHAVE_CONFIG_H -I. -I.. -I/opt/local/include -pipe -Os -arch ppc -MT tokenizern.lo -MD -MP -MF .deps/tokenizern.Tpo -c tokenizern.c -fno-common -DPIC -o .libs/tokenizern.o |
---|
675 | :info:build In file included from ../config.h:345, |
---|
676 | :info:build from tokenizern.c:1: |
---|
677 | :info:build ./sys.h:119:1: warning: "SIZE_MAX" redefined |
---|
678 | :info:build In file included from /usr/include/sys/_endian.h:88, |
---|
679 | :info:build from /usr/include/ppc/endian.h:107, |
---|
680 | :info:build from /usr/include/machine/endian.h:30, |
---|
681 | :info:build from /usr/include/sys/types.h:75, |
---|
682 | :info:build from ./sys.h:46, |
---|
683 | :info:build from ../config.h:345, |
---|
684 | :info:build from tokenizern.c:1: |
---|
685 | :info:build /opt/local/lib/apple-gcc42/gcc/powerpc-apple-darwin8/4.2.1/include/stdint.h:210:1: warning: this is the location of the previous definition |
---|
686 | :info:build libtool: compile: /opt/local/bin/gcc-apple-4.2 -std=gnu99 -DHAVE_CONFIG_H -I. -I.. -I/opt/local/include -pipe -Os -arch ppc -MT tokenizern.lo -MD -MP -MF .deps/tokenizern.Tpo -c tokenizern.c -o tokenizern.o >/dev/null 2>&1 |
---|
687 | :info:build mv -f .deps/tokenizern.Tpo .deps/tokenizern.Plo |
---|
688 | :info:build /bin/sh ../libtool --tag=CC --mode=compile /opt/local/bin/gcc-apple-4.2 -std=gnu99 -DHAVE_CONFIG_H -I. -I.. -I/opt/local/include -pipe -Os -arch ppc -MT history.lo -MD -MP -MF .deps/history.Tpo -c -o history.lo history.c |
---|
689 | :info:build libtool: compile: /opt/local/bin/gcc-apple-4.2 -std=gnu99 -DHAVE_CONFIG_H -I. -I.. -I/opt/local/include -pipe -Os -arch ppc -MT history.lo -MD -MP -MF .deps/history.Tpo -c history.c -fno-common -DPIC -o .libs/history.o |
---|
690 | :info:build In file included from ../config.h:345, |
---|
691 | :info:build from history.c:36: |
---|
692 | :info:build ./sys.h:119:1: warning: "SIZE_MAX" redefined |
---|
693 | :info:build In file included from /usr/include/sys/_endian.h:88, |
---|
694 | :info:build from /usr/include/ppc/endian.h:107, |
---|
695 | :info:build from /usr/include/machine/endian.h:30, |
---|
696 | :info:build from /usr/include/sys/types.h:75, |
---|
697 | :info:build from ./sys.h:46, |
---|
698 | :info:build from ../config.h:345, |
---|
699 | :info:build from history.c:36: |
---|
700 | :info:build /opt/local/lib/apple-gcc42/gcc/powerpc-apple-darwin8/4.2.1/include/stdint.h:210:1: warning: this is the location of the previous definition |
---|
701 | :info:build libtool: compile: /opt/local/bin/gcc-apple-4.2 -std=gnu99 -DHAVE_CONFIG_H -I. -I.. -I/opt/local/include -pipe -Os -arch ppc -MT history.lo -MD -MP -MF .deps/history.Tpo -c history.c -o history.o >/dev/null 2>&1 |
---|
702 | :info:build mv -f .deps/history.Tpo .deps/history.Plo |
---|
703 | :info:build /bin/sh ../libtool --tag=CC --mode=compile /opt/local/bin/gcc-apple-4.2 -std=gnu99 -DHAVE_CONFIG_H -I. -I.. -I/opt/local/include -pipe -Os -arch ppc -MT historyn.lo -MD -MP -MF .deps/historyn.Tpo -c -o historyn.lo historyn.c |
---|
704 | :info:build libtool: compile: /opt/local/bin/gcc-apple-4.2 -std=gnu99 -DHAVE_CONFIG_H -I. -I.. -I/opt/local/include -pipe -Os -arch ppc -MT historyn.lo -MD -MP -MF .deps/historyn.Tpo -c historyn.c -fno-common -DPIC -o .libs/historyn.o |
---|
705 | :info:build In file included from ../config.h:345, |
---|
706 | :info:build from historyn.c:1: |
---|
707 | :info:build ./sys.h:119:1: warning: "SIZE_MAX" redefined |
---|
708 | :info:build In file included from /usr/include/sys/_endian.h:88, |
---|
709 | :info:build from /usr/include/ppc/endian.h:107, |
---|
710 | :info:build from /usr/include/machine/endian.h:30, |
---|
711 | :info:build from /usr/include/sys/types.h:75, |
---|
712 | :info:build from ./sys.h:46, |
---|
713 | :info:build from ../config.h:345, |
---|
714 | :info:build from historyn.c:1: |
---|
715 | :info:build /opt/local/lib/apple-gcc42/gcc/powerpc-apple-darwin8/4.2.1/include/stdint.h:210:1: warning: this is the location of the previous definition |
---|
716 | :info:build libtool: compile: /opt/local/bin/gcc-apple-4.2 -std=gnu99 -DHAVE_CONFIG_H -I. -I.. -I/opt/local/include -pipe -Os -arch ppc -MT historyn.lo -MD -MP -MF .deps/historyn.Tpo -c historyn.c -o historyn.o >/dev/null 2>&1 |
---|
717 | :info:build mv -f .deps/historyn.Tpo .deps/historyn.Plo |
---|
718 | :info:build /bin/sh ../libtool --tag=CC --mode=compile /opt/local/bin/gcc-apple-4.2 -std=gnu99 -DHAVE_CONFIG_H -I. -I.. -I/opt/local/include -pipe -Os -arch ppc -MT filecomplete.lo -MD -MP -MF .deps/filecomplete.Tpo -c -o filecomplete.lo filecomplete.c |
---|
719 | :info:build libtool: compile: /opt/local/bin/gcc-apple-4.2 -std=gnu99 -DHAVE_CONFIG_H -I. -I.. -I/opt/local/include -pipe -Os -arch ppc -MT filecomplete.lo -MD -MP -MF .deps/filecomplete.Tpo -c filecomplete.c -fno-common -DPIC -o .libs/filecomplete.o |
---|
720 | :info:build In file included from ../config.h:345, |
---|
721 | :info:build from filecomplete.c:32: |
---|
722 | :info:build ./sys.h:119:1: warning: "SIZE_MAX" redefined |
---|
723 | :info:build In file included from /usr/include/sys/_endian.h:88, |
---|
724 | :info:build from /usr/include/ppc/endian.h:107, |
---|
725 | :info:build from /usr/include/machine/endian.h:30, |
---|
726 | :info:build from /usr/include/sys/types.h:75, |
---|
727 | :info:build from ./sys.h:46, |
---|
728 | :info:build from ../config.h:345, |
---|
729 | :info:build from filecomplete.c:32: |
---|
730 | :info:build /opt/local/lib/apple-gcc42/gcc/powerpc-apple-darwin8/4.2.1/include/stdint.h:210:1: warning: this is the location of the previous definition |
---|
731 | :info:build libtool: compile: /opt/local/bin/gcc-apple-4.2 -std=gnu99 -DHAVE_CONFIG_H -I. -I.. -I/opt/local/include -pipe -Os -arch ppc -MT filecomplete.lo -MD -MP -MF .deps/filecomplete.Tpo -c filecomplete.c -o filecomplete.o >/dev/null 2>&1 |
---|
732 | :info:build mv -f .deps/filecomplete.Tpo .deps/filecomplete.Plo |
---|
733 | :info:build /bin/sh ../libtool --tag=CC --mode=compile /opt/local/bin/gcc-apple-4.2 -std=gnu99 -DHAVE_CONFIG_H -I. -I.. -I/opt/local/include -pipe -Os -arch ppc -MT readline.lo -MD -MP -MF .deps/readline.Tpo -c -o readline.lo readline.c |
---|
734 | :info:build libtool: compile: /opt/local/bin/gcc-apple-4.2 -std=gnu99 -DHAVE_CONFIG_H -I. -I.. -I/opt/local/include -pipe -Os -arch ppc -MT readline.lo -MD -MP -MF .deps/readline.Tpo -c readline.c -fno-common -DPIC -o .libs/readline.o |
---|
735 | :info:build In file included from ../config.h:345, |
---|
736 | :info:build from readline.c:32: |
---|
737 | :info:build ./sys.h:119:1: warning: "SIZE_MAX" redefined |
---|
738 | :info:build In file included from /usr/include/sys/_endian.h:88, |
---|
739 | :info:build from /usr/include/ppc/endian.h:107, |
---|
740 | :info:build from /usr/include/machine/endian.h:30, |
---|
741 | :info:build from /usr/include/sys/types.h:75, |
---|
742 | :info:build from ./sys.h:46, |
---|
743 | :info:build from ../config.h:345, |
---|
744 | :info:build from readline.c:32: |
---|
745 | :info:build /opt/local/lib/apple-gcc42/gcc/powerpc-apple-darwin8/4.2.1/include/stdint.h:210:1: warning: this is the location of the previous definition |
---|
746 | :info:build libtool: compile: /opt/local/bin/gcc-apple-4.2 -std=gnu99 -DHAVE_CONFIG_H -I. -I.. -I/opt/local/include -pipe -Os -arch ppc -MT readline.lo -MD -MP -MF .deps/readline.Tpo -c readline.c -o readline.o >/dev/null 2>&1 |
---|
747 | :info:build mv -f .deps/readline.Tpo .deps/readline.Plo |
---|
748 | :info:build /bin/sh ../libtool --tag=CC --mode=compile /opt/local/bin/gcc-apple-4.2 -std=gnu99 -DHAVE_CONFIG_H -I. -I.. -I/opt/local/include -pipe -Os -arch ppc -MT literal.lo -MD -MP -MF .deps/literal.Tpo -c -o literal.lo literal.c |
---|
749 | :info:build libtool: compile: /opt/local/bin/gcc-apple-4.2 -std=gnu99 -DHAVE_CONFIG_H -I. -I.. -I/opt/local/include -pipe -Os -arch ppc -MT literal.lo -MD -MP -MF .deps/literal.Tpo -c literal.c -fno-common -DPIC -o .libs/literal.o |
---|
750 | :info:build In file included from ../config.h:345, |
---|
751 | :info:build from literal.c:32: |
---|
752 | :info:build ./sys.h:119:1: warning: "SIZE_MAX" redefined |
---|
753 | :info:build In file included from /usr/include/sys/_endian.h:88, |
---|
754 | :info:build from /usr/include/ppc/endian.h:107, |
---|
755 | :info:build from /usr/include/machine/endian.h:30, |
---|
756 | :info:build from /usr/include/sys/types.h:75, |
---|
757 | :info:build from ./sys.h:46, |
---|
758 | :info:build from ../config.h:345, |
---|
759 | :info:build from literal.c:32: |
---|
760 | :info:build /opt/local/lib/apple-gcc42/gcc/powerpc-apple-darwin8/4.2.1/include/stdint.h:210:1: warning: this is the location of the previous definition |
---|
761 | :info:build libtool: compile: /opt/local/bin/gcc-apple-4.2 -std=gnu99 -DHAVE_CONFIG_H -I. -I.. -I/opt/local/include -pipe -Os -arch ppc -MT literal.lo -MD -MP -MF .deps/literal.Tpo -c literal.c -o literal.o >/dev/null 2>&1 |
---|
762 | :info:build mv -f .deps/literal.Tpo .deps/literal.Plo |
---|
763 | :info:build /bin/sh ../libtool --tag=CC --mode=compile /opt/local/bin/gcc-apple-4.2 -std=gnu99 -DHAVE_CONFIG_H -I. -I.. -I/opt/local/include -pipe -Os -arch ppc -MT getline.lo -MD -MP -MF .deps/getline.Tpo -c -o getline.lo getline.c |
---|
764 | :info:build libtool: compile: /opt/local/bin/gcc-apple-4.2 -std=gnu99 -DHAVE_CONFIG_H -I. -I.. -I/opt/local/include -pipe -Os -arch ppc -MT getline.lo -MD -MP -MF .deps/getline.Tpo -c getline.c -fno-common -DPIC -o .libs/getline.o |
---|
765 | :info:build libtool: compile: /opt/local/bin/gcc-apple-4.2 -std=gnu99 -DHAVE_CONFIG_H -I. -I.. -I/opt/local/include -pipe -Os -arch ppc -MT getline.lo -MD -MP -MF .deps/getline.Tpo -c getline.c -o getline.o >/dev/null 2>&1 |
---|
766 | :info:build mv -f .deps/getline.Tpo .deps/getline.Plo |
---|
767 | :info:build /bin/sh ../libtool --tag=CC --mode=link /opt/local/bin/gcc-apple-4.2 -std=gnu99 -pipe -Os -arch ppc -no-undefined -version-info 0:68:0 -L/opt/local/lib -Wl,-headerpad_max_install_names -arch ppc -o libedit.la -rpath /opt/local/lib chared.lo common.lo el.lo eln.lo emacs.lo hist.lo keymacro.lo map.lo chartype.lo parse.lo prompt.lo read.lo refresh.lo search.lo sig.lo terminal.lo tty.lo vi.lo wcsdup.lo tokenizer.lo tokenizern.lo history.lo historyn.lo filecomplete.lo readline.lo literal.lo getline.lo getline.lo -lncurses |
---|
768 | :info:build libtool: link: /opt/local/bin/gcc-apple-4.2 -std=gnu99 -dynamiclib -o .libs/libedit.0.dylib .libs/chared.o .libs/common.o .libs/el.o .libs/eln.o .libs/emacs.o .libs/hist.o .libs/keymacro.o .libs/map.o .libs/chartype.o .libs/parse.o .libs/prompt.o .libs/read.o .libs/refresh.o .libs/search.o .libs/sig.o .libs/terminal.o .libs/tty.o .libs/vi.o .libs/wcsdup.o .libs/tokenizer.o .libs/tokenizern.o .libs/history.o .libs/historyn.o .libs/filecomplete.o .libs/readline.o .libs/literal.o .libs/getline.o .libs/getline.o -L/opt/local/lib -lncurses -Os -arch ppc -Wl,-headerpad_max_install_names -arch ppc -install_name /opt/local/lib/libedit.0.dylib -compatibility_version 1 -current_version 1.68 -Wl,-single_module |
---|
769 | :info:build ld: duplicate symbol _getdelim in .libs/getline.o and .libs/getline.o |
---|
770 | :info:build collect2: ld returned 1 exit status |
---|
771 | :info:build make[3]: *** [libedit.la] Error 1 |
---|
772 | :info:build make[3]: Leaving directory `/opt/local/var/macports/build/_opt_local_var_macports_sources_rsync.macports.org_macports_release_tarballs_ports_devel_libedit/libedit/work/libedit-20210910-3.1/src' |
---|
773 | :info:build make[2]: *** [all] Error 2 |
---|
774 | :info:build make[2]: Leaving directory `/opt/local/var/macports/build/_opt_local_var_macports_sources_rsync.macports.org_macports_release_tarballs_ports_devel_libedit/libedit/work/libedit-20210910-3.1/src' |
---|
775 | :info:build make[1]: *** [all-recursive] Error 1 |
---|
776 | :info:build make[1]: Leaving directory `/opt/local/var/macports/build/_opt_local_var_macports_sources_rsync.macports.org_macports_release_tarballs_ports_devel_libedit/libedit/work/libedit-20210910-3.1' |
---|
777 | :info:build make: *** [all] Error 2 |
---|
778 | :info:build make: Leaving directory `/opt/local/var/macports/build/_opt_local_var_macports_sources_rsync.macports.org_macports_release_tarballs_ports_devel_libedit/libedit/work/libedit-20210910-3.1' |
---|
779 | :info:build Command failed: cd "/opt/local/var/macports/build/_opt_local_var_macports_sources_rsync.macports.org_macports_release_tarballs_ports_devel_libedit/libedit/work/libedit-20210910-3.1" && /usr/bin/make -j1 -w all |
---|
780 | :info:build Exit code: 2 |
---|
781 | :error:build Failed to build libedit: command execution failed |
---|
782 | :debug:build Error code: CHILDSTATUS 6445 2 |
---|
783 | :debug:build Backtrace: command execution failed |
---|
784 | :debug:build while executing |
---|
785 | :debug:build "system {*}$notty {*}$callback {*}$nice $fullcmdstring" |
---|
786 | :debug:build invoked from within |
---|
787 | :debug:build "command_exec -callback portprogress::target_progress_callback build" |
---|
788 | :debug:build (procedure "portbuild::build_main" line 8) |
---|
789 | :debug:build invoked from within |
---|
790 | :debug:build "$procedure $targetname" |
---|
791 | :error:build See /opt/local/var/macports/logs/_opt_local_var_macports_sources_rsync.macports.org_macports_release_tarballs_ports_devel_libedit/libedit/main.log for details. |
---|